{"text_format":"1","workbook":"xlsx","n_sheets":7,"sheets":["Eingabe","Berechnung","Leistungsdaten","Ausdruck","Ausfüllhilfe Online-Antrag","Tabellen VDI4650","Linksammlung"],"not_rendered":{"charts":0,"images":59,"macros":1,"external_links":0,"defined_names":8,"comments":3,"pivot_tables":0},"unopened":[],"bounds":{"document_bytes":16777216,"sheet_cells":100000,"rows_first":2000,"rows_last":500,"rows_between":2000,"halvings":0,"cell_chars":16384,"cell_head_chars":4096},"cells_cut":0,"cells_raw":0,"read":"whole","date_system":"1900"}

{"sheet":"Eingabe","index":0,"n_rows":113,"n_cols":28,"rows_kept":113,"cut":false,"hidden":false,"merged":[[25,18,25,29],[18,2,18,7],[18,8,18,15],[72,8,72,15],[0,2,0,29],[12,2,12,7],[16,2,16,7],[12,8,12,15],[14,8,14,15],[4,2,4,16],[6,8,6,15],[8,8,8,15],[10,8,10,15],[16,8,16,15],[1,27,1,29],[14,2,14,7],[6,2,6,7],[8,2,8,7],[10,2,10,7],[110,8,110,15],[112,2,112,7],[112,8,112,15],[100,2,100,16],[102,2,102,7],[102,8,102,15],[104,2,104,7],[108,2,108,7],[108,8,108,15],[106,2,106,7],[74,8,74,15],[29,2,29,7],[52,8,52,15],[119,18,119,29],[20,2,20,7],[56,2,56,7],[58,2,58,7],[58,8,58,15],[66,2,66,7],[66,8,66,15],[68,2,68,7],[104,8,104,15],[52,2,52,7],[69,18,69,29],[70,8,70,15],[110,2,110,7],[26,2,26,7],[26,8,26,15],[106,8,106,15],[70,2,70,7],[72,2,72,7],[74,2,74,7],[50,2,50,16],[64,2,64,7],[54,11,54,15],[54,2,54,7],[54,8,54,9],[68,8,68,15],[60,2,60,7],[60,8,60,15],[62,2,62,7],[62,8,62,15],[64,8,64,13]]}
[null,null,"MAP-FÖRDERMITTELRECHNER"]
[null,null,null,null,null,null,null,null,null,null,null,null,null,null,null,null,null,null,null,null,null,null,null,null,null,null,null,"UMT/TR v8.39"]
[]
[]
[]
[]
[null,null,"Gebäudestandort"]
[]
[null,null,"Norm-Außentemperatur",null,null,null,null,null,{"$f":"Berechnung!C16&\" °C\"","v":"-14 °C"}]
[]
{"$rows_left_out":104}
{"sheet":"Berechnung","index":1,"n_rows":283,"n_cols":59,"rows_kept":283,"cut":false,"hidden":true,"merged":[[237,21,239,22],[204,13,204,14],[205,13,205,14],[206,13,206,14],[207,13,207,14],[208,13,208,14],[209,13,209,14],[210,13,210,14],[211,13,211,14],[212,13,212,14],[237,18,239,19],[165,37,165,38],[165,40,165,41],[166,37,166,38],[166,40,166,41],[167,37,167,38],[167,40,167,41],[176,37,176,38],[176,40,176,41],[173,37,173,38],[173,40,173,41],[174,37,174,38],[174,40,174,41],[170,37,170,38],[170,40,170,41],[171,37,171,38],[171,40,171,41],[169,37,169,38],[169,40,169,41],[172,37,172,38],[172,40,172,41],[168,37,168,38],[168,40,168,41],[172,10,172,11],[156,10,156,11],[179,37,179,38],[179,40,179,41],[180,37,180,38],[180,40,180,41],[177,37,177,38],[177,40,177,41],[178,37,178,38],[178,40,178,41],[175,37,175,38],[175,40,175,41],[177,13,177,14],[176,13,176,14],[176,16,176,17],[178,13,178,14],[178,16,178,17],[174,13,174,14],[174,16,174,17],[175,13,175,14],[175,16,175,17],[164,37,164,38],[164,40,164,41],[164,13,164,14],[173,13,173,14],[167,13,167,14],[165,13,165,14],[165,16,165,17],[29,20,31,21],[32,20,32,21],[33,20,33,21],[34,20,34,21],[35,20,35,21],[36,20,36,21],[169,13,169,14],[169,16,169,17],[168,19,168,20],[171,19,171,20],[164,16,164,17],[166,13,166,14],[166,16,166,17],[171,13,171,14],[171,16,171,17],[164,19,164,20],[145,10,145,12],[1,10,2,11],[145,7,145,9],[145,4,145,6],[150,1,150,2],[150,7,150,8],[153,7,153,8],[1,14,3,15],[37,20,37,21],[38,20,38,21],[152,10,152,11],[29,10,31,10],[146,10,146,11],[45,11,49,11],[171,4,171,5],[172,7,172,8],[177,7,177,8],[180,1,180,2],[172,1,172,2],[171,1,171,2],[1,1,3,2],[26,1,26,2],[25,5,25,6],[157,1,157,3],[149,1,149,2],[146,1,146,2],[159,4,159,12],[147,7,147,8],[146,7,146,8],[145,1,145,3],[147,1,147,2],[33,7,33,8],[32,7,32,8],[34,7,34,8],[29,7,29,8],[147,10,147,11],[149,7,149,8],[155,7,155,8],[211,1,211,2],[179,7,179,8],[179,10,179,11],[180,10,180,11],[174,10,174,11],[210,1,210,2],[174,7,174,8],[180,4,180,5],[180,7,180,8],[178,7,178,8],[178,10,178,11],[175,10,175,11],[177,10,177,11],[204,1,204,2],[176,7,176,8],[203,6,203,7],[203,8,203,9],[203,10,203,11],[228,1,228,2],[159,1,159,3],[165,4,165,5],[172,4,172,5],[173,4,173,5],[164,1,164,2],[212,1,212,2],[206,1,206,2],[220,1,220,2],[205,1,205,2],[209,1,209,2],[169,4,169,5],[169,1,169,2],[170,4,170,5],[160,4,160,12],[164,7,164,8],[208,1,208,2],[165,1,165,2],[207,1,207,2],[167,4,167,5],[203,5,204,5],[173,1,173,2],[164,10,164,11],[168,4,168,5],[167,1,167,2],[166,1,166,2],[148,7,148,8],[151,1,151,2],[148,1,148,2],[153,1,153,2],[153,10,153,11],[149,10,149,11],[158,1,158,3],[160,1,160,3],[154,7,154,8],[152,7,152,8],[152,1,152,2],[151,7,151,8],[154,4,154,5],[157,4,157,12],[149,4,149,5],[155,10,155,11],[156,1,156,2],[158,4,158,12],[165,7,165,8],[155,1,155,2],[154,1,154,2],[153,4,153,5],[168,1,168,2],[176,10,176,11],[167,7,167,8],[169,7,169,8],[169,10,169,11],[175,7,175,8],[146,4,146,5],[147,4,147,5],[155,4,155,5],[156,4,156,5],[154,10,154,11],[156,7,156,8],[165,10,165,11],[150,10,150,11],[166,10,166,11],[151,10,151,11],[148,10,148,11],[164,4,164,5],[167,10,167,11],[166,4,166,5],[148,4,148,5],[152,4,152,5],[151,4,151,5],[150,4,150,5],[170,1,170,2],[174,22,174,23],[175,19,175,20],[175,22,175,23],[176,19,176,20],[172,13,172,14],[172,16,172,17],[173,16,173,17],[165,22,165,23],[166,19,166,20],[166,22,166,23],[167,19,167,20],[167,22,167,23],[168,22,168,23],[169,19,169,20],[167,16,167,17],[170,13,170,14],[168,13,168,14],[168,16,168,17],[173,7,173,8],[173,10,173,11],[171,7,171,8],[171,10,171,11],[166,7,166,8],[171,28,171,29],[172,25,172,26],[171,25,171,26],[175,31,175,32],[175,34,175,35],[176,31,176,32],[176,34,176,35],[170,31,170,32],[170,34,170,35],[172,31,172,32],[173,31,173,32],[174,31,174,32],[172,28,172,29],[180,34,180,35],[177,31,177,32],[173,25,173,26],[173,28,173,29],[174,25,174,26],[174,28,174,29],[175,25,175,26],[175,28,175,29],[177,34,177,35],[178,34,178,35],[180,25,180,26],[179,34,179,35],[177,16,177,17],[180,22,180,23],[180,13,180,14],[180,16,180,17],[180,31,180,32],[176,22,176,23],[177,19,177,20],[177,22,177,23],[178,31,178,32],[179,31,179,32],[179,13,179,14],[179,16,179,17],[180,28,180,29],[180,19,180,20],[178,19,178,20],[178,22,178,23],[179,19,179,20],[179,22,179,23],[164,22,164,23],[165,19,165,20],[172,34,172,35],[173,34,173,35],[174,34,174,35],[171,22,171,23],[172,19,172,20],[172,22,172,23],[173,19,173,20],[173,22,173,23],[169,22,169,23],[170,19,170,20],[170,22,170,23],[174,19,174,20],[164,31,164,32],[164,34,164,35],[165,31,165,32],[165,34,165,35],[171,31,171,32],[171,34,171,35],[168,34,168,35],[170,25,170,26],[170,28,170,29],[169,31,169,32],[169,34,169,35],[164,28,164,29],[168,31,168,32],[165,25,165,26],[165,28,165,29],[166,25,166,26],[166,28,166,29],[167,28,167,29],[168,25,168,26],[168,28,168,29],[169,25,169,26],[169,28,169,29],[167,25,167,26],[164,25,164,26],[164,43,164,44],[164,46,164,47],[165,43,165,44],[165,46,165,47],[166,43,166,44],[166,46,166,47],[167,43,167,44],[167,46,167,47],[168,43,168,44],[168,46,168,47],[169,43,169,44],[169,46,169,47],[170,43,170,44],[170,46,170,47],[171,43,171,44],[171,46,171,47],[172,43,172,44],[172,46,172,47],[173,43,173,44],[173,46,173,47],[172,52,172,53],[173,49,173,50],[173,52,173,53],[164,49,164,50],[164,52,164,53],[165,49,165,50],[165,52,165,53],[166,49,166,50],[166,52,166,53],[167,49,167,50],[167,52,167,53],[168,49,168,50],[168,52,168,53],[267,2,267,3],[168,7,168,8],[168,10,168,11],[179,49,179,50],[179,52,179,53],[180,49,180,50],[180,52,180,53],[174,49,174,50],[174,52,174,53],[175,49,175,50],[175,52,175,53],[176,49,176,50],[176,52,176,53],[177,49,177,50],[177,52,177,53],[178,49,178,50],[178,52,178,53],[169,49,169,50],[169,52,169,53],[170,49,170,50],[170,52,170,53],[171,49,171,50],[171,52,171,53],[172,49,172,50],[164,55,164,56],[164,58,164,59],[165,55,165,56],[165,58,165,59],[166,55,166,56],[166,58,166,59],[167,55,167,56],[167,58,167,59],[168,55,168,56],[168,58,168,59],[169,55,169,56],[169,58,169,59],[170,55,170,56],[170,58,170,59],[171,55,171,56],[171,58,171,59],[172,55,172,56],[172,58,172,59],[173,55,173,56],[173,58,173,59],[179,55,179,56],[179,58,179,59],[180,55,180,56],[180,58,180,59],[174,55,174,56],[174,58,174,59],[175,55,175,56],[175,58,175,59],[176,55,176,56],[176,58,176,59],[177,55,177,56],[177,58,177,59],[178,55,178,56],[178,58,178,59],[179,43,179,44],[179,46,179,47],[180,43,180,44],[180,46,180,47],[174,43,174,44],[174,46,174,47],[175,43,175,44],[175,46,175,47],[176,43,176,44],[176,46,176,47],[177,43,177,44],[177,46,177,47],[178,43,178,44],[178,46,178,47]]}
[null,"Comoboxen Gebäudedaten"]
[null,"Projektdaten",null,null,null,null,null,null,null,null,"HT' (% von EnEV)",null,"Zahlenwert",null,null,null,"Ist gewählte WP","Gewählte Anzahl"]
[null,null,null,"Nutzungsart","Energieeffizienz","Anlagentechnik","Gebäudetyp","Wohneinheiten","Gesamtfläche","Heizung Alt",null,null,"Außentemperatur","Heizgrentztemperatur",null,null,"kaskadierbar ?",null,null,"Kosten Heizungsoptimierung","Kosten Heizungsoptimierung"]
[null,null,null,null,null,null,null,null,null,null,"Text Ausdruck","Wert"]
[]
[null,null,null,"Wohngebäude","Niedrigenergiehaus EnEV 2016","","Bestandsgebäude","Einfamilienhaus","Unter 500 m²","Gaskessel",{"$f":"IF(E6=E9,\"EnEV 2009 Neubau - Niveau\",VLOOKUP(E6,E8:K26,7,FALSE)&\" \"&L6&\"% EnEV 2009 Neubau - Niveau\")","v":"EnEV 2009 Neubau - Niveau"},{"$f":"IF(E27=FALSE,150,VLOOKUP(E6,E8:L25,8,FALSE))","v":100},{"$f":"IF(ISERROR(C16*1),-14,C16*1)","v":-14},{"$f":"IF(G6=G10,N27,VLOOKUP(E6,E8:N27,10,FALSE))","v":"15 °C"},"Checkbox","wählbar ?",{"$f":"VLOOKUP($C$34,Leistungsdaten!G:AC,23,FALSE)","v":false},1,null,"5000 €",{"$f":"IF(T6=T54,23000,LEFT(T6,FIND(\" \",T6)-1)*1)","v":5000}]
[]
[]
[null,null,null,"Wohngebäude","Niedrigenergiehaus EnEV 2016","Auswahl Wärmepumpe","Neubau","Einfamilienhaus","Unter 500 m²","Gaskessel",null,100,null,"12 °C","Projektdaten",true,null,null,null,"500 €"]
[null,null,null,"Nichtwohngebäude","Passivhausstandard",true,"Bestandsgebäude","Zweifamilienhaus","Über 500 m²","Ölkessel","Max.",55,null,"10 °C","Daten WP | Solar",{"$f":"IF(F27=0,FALSE,TRUE)","v":true},null,null,null,"1000 €"]
{"$rows_left_out":274}
{"sheet":"Leistungsdaten","index":2,"n_rows":8850,"n_cols":40,"rows_kept":8850,"cut":false,"hidden":true,"merged":[[201,6,201,14],[202,6,203,6],[152,6,153,6],[0,6,0,10],[1,6,2,6],[52,6,53,6],[51,6,51,14],[101,6,101,14],[102,6,103,6],[151,6,151,14]]}
["Norm-Außentemperaturen Deutschland",null,null,null,null,null,"Luft-Wasser-Wärmepumpen"]
["PLZ","Stadt","Außentemp.",null,null,null,"WP-Typ","DT","Leistungszahl","Leistungszahl","Leistungszahl","Heizleistung","WP-Set ?","WWB","EC-Pumpe Heizung","WMZ","EC-Pumpe Sole","Bezeichnung","LWM 250","Inverter ?","Sonderbauform","Artikel.nr.","In","EC-Pumpe Brunnen","EC-Pumpe Brunnen","Leistungsaufnahme","WPW ohne",null,"Kaskadierbar ?","EC-Pumpe","Produktbild","SG-ready ?",null,"Speichergröße","Name","Datenblatt","Produktbild","Name","Datenblatt","Produktbild"]
["0","Bitte Stadt oder PLZ eingeben","-12 °C",null,null,null,null,"Prüfstand","A-7 / W35","A2 / W35","A10 / W35","A2/W35",null,"integriert","eingebaut?","integriert ?","eingebaut ?","Solepumpe (EC)","einsetzbar ?",null,"Bafa-Liste ?",null,"Bafa-Liste ?","einsetzbar ?","Typ Grundfos","Brunnenpumpe","Zwischen-WT ?",null,null,"Heizung",null,null,null,"Warmwasser","Stiebel","Stiebel","Stiebel","tecalor","tecalor","tecalor"]
[72280,"Aach",-16,null,null,null,{"$f":"IF(Berechnung!$G$269=1,AI4,AL4)","v":"WPL 15 ACS"},5,2.83,3.88,4.83,4.2300000000000004,false,false,false,true,false,"-",false,true,false,{"$f":"IF(Berechnung!$G$269=1,AJ4,AM4)","v":234759},true,false,"-","-",false,null,false,false,{"$f":"IF(Berechnung!$G$269=1,AK4,AN4)","v":"PIC00003714-00.jpg"},true,null,0,"WPL 15 ACS",234759,"PIC00003714-00.jpg","TTL 15 ACS",190451,"PIC00003781-00.jpg"]
[78267,"Aach/Hegau",-14,null,null,null,{"$f":"IF(Berechnung!$G$269=1,AI5,AL5)","v":"WPL 20 AC"},5,3.38,3.99,4.91,6.85,false,false,false,true,false,"-",false,true,false,{"$f":"IF(Berechnung!$G$269=1,AJ5,AM5)","v":236007},true,false,"-","-",false,null,false,false,{"$f":"IF(Berechnung!$G$269=1,AK5,AN5)","v":"PIC00003555-00.jpg"},true,null,0,"WPL 20 AC",236007,"PIC00003555-00.jpg","TTL 20 AC",190497,"PIC00003729-00.jpg"]
["520..","Aachen",-12,null,null,null,{"$f":"IF(Berechnung!$G$269=1,AI6,AL6)","v":"WPL 25 AC"},5,2.93,4.17,5.16,8.33,false,false,false,true,false,"-",false,true,false,{"$f":"IF(Berechnung!$G$269=1,AJ6,AM6)","v":234760},true,false,"-","-",false,null,false,false,{"$f":"IF(Berechnung!$G$269=1,AK6,AN6)","v":"PIC00003555-00.jpg"},true,null,0,"WPL 25 AC",234760,"PIC00003555-00.jpg","TTL 25 AC",190452,"PIC00003729-00.jpg"]
["7343.","Aalen / Württ.",-16,null,null,null,{"$f":"IF(Berechnung!$G$269=1,AI7,AL7)","v":"WPL 15 AS"},5,2.83,3.88,4.83,4.2300000000000004,false,false,false,true,false,"-",false,true,false,{"$f":"IF(Berechnung!$G$269=1,AJ7,AM7)","v":232491},true,false,"-","-",false,null,false,false,{"$f":"IF(Berechnung!$G$269=1,AK7,AN7)","v":"PIC00003714-00.jpg"},true,null,0,"WPL 15 AS",232491,"PIC00003714-00.jpg","TTL 15 AS",190324,"PIC00003781-00.jpg"]
[65326,"Aarbergen",-14,null,null,null,{"$f":"IF(Berechnung!$G$269=1,AI8,AL8)","v":"WPL 20 A"},5,3.38,3.99,4.91,6.85,false,false,false,true,false,"-",false,true,false,{"$f":"IF(Berechnung!$G$269=1,AJ8,AM8)","v":236006},true,false,"-","-",false,null,false,false,{"$f":"IF(Berechnung!$G$269=1,AK8,AN8)","v":"PIC00003555-00.jpg"},true,null,0,"WPL 20 A",236006,"PIC00003555-00.jpg","TTL 20 A",190496,"PIC00003729-00.jpg"]
[19322,"Abbendorf",-14,null,null,null,{"$f":"IF(Berechnung!$G$269=1,AI9,AL9)","v":"WPL 25 A"},5,2.93,4.17,5.16,8.33,false,false,false,true,false,"-",false,true,false,{"$f":"IF(Berechnung!$G$269=1,AJ9,AM9)","v":232493},true,false,"-","-",false,null,false,false,{"$f":"IF(Berechnung!$G$269=1,AK9,AN9)","v":"PIC00003555-00.jpg"},true,null,0,"WPL 25 A",232493,"PIC00003555-00.jpg","TTL 25 A",190326,"PIC00003729-00.jpg"]
[30900,"Abbensen",-14,null,null,null,{"$f":"IF(Berechnung!$G$269=1,AI10,AL10)","v":"WPL 07 ACS classic"},5,2.76,3.57,4.84,1.69,false,false,false,true,false,"-",false,true,false,{"$f":"IF(Berechnung!$G$269=1,AJ10,AM10)","v":235920},true,false,"-","-",false,null,false,false,{"$f":"IF(Berechnung!$G$269=1,AK10,AN10)","v":"PIC00006444-00.jpg"},true,null,0,"WPL 07 ACS classic",235920,"PIC00006444-00.jpg","TTL 3.5 ACS",190484,"PIC00006444-00.jpg"]
{"$rows_left_out":8841}
{"sheet":"Ausdruck","index":3,"n_rows":704,"n_cols":24,"rows_kept":704,"cut":false,"hidden":true,"merged":[[53,12,53,26],[55,1,55,11],[56,1,56,11],[53,1,53,11],[115,1,115,11],[116,1,116,11],[159,1,159,11],[449,20,449,26],[399,20,399,26],[168,1,168,11],[169,1,169,11],[170,1,170,11],[117,12,117,26],[119,12,119,26],[117,1,117,11],[155,1,155,11],[154,1,154,11],[161,12,161,26],[167,12,167,26],[118,1,118,11],[119,1,119,11],[120,1,120,11],[308,1,308,11],[308,12,308,18],[0,21,0,26],[50,20,50,26],[100,20,100,26],[150,20,150,26],[200,20,200,26],[250,20,250,26],[300,20,300,26],[270,1,270,11],[272,12,272,26],[263,1,263,26],[51,1,51,25],[55,12,55,26],[54,12,54,26],[49,20,49,26],[56,12,56,26],[54,1,54,11],[11,1,11,11],[262,12,262,16],[262,22,262,26],[105,1,105,11],[69,1,69,11],[70,1,70,11],[114,1,114,11],[153,1,153,11],[703,1,703,25],[701,1,701,25],[255,12,255,16],[255,22,255,26],[253,22,253,26],[206,1,206,11],[214,1,214,11],[215,1,215,26],[208,1,208,11],[209,12,209,26],[309,1,309,11],[309,12,309,18],[309,19,309,26],[310,12,310,18],[303,12,303,18],[303,19,303,26],[304,12,304,18],[304,19,304,26],[305,12,305,18],[306,12,306,18],[305,19,305,26],[306,19,306,26],[304,1,304,11],[499,20,499,26],[349,20,349,26],[314,12,314,26],[404,1,404,25],[311,12,311,18],[63,1,63,11],[65,1,65,11],[66,1,66,11],[67,1,67,11],[68,1,68,11],[161,1,161,11],[166,1,166,11],[166,12,166,26],[160,1,160,11],[164,1,164,11],[315,1,315,11],[103,12,103,26],[104,1,104,11],[103,1,103,11],[66,12,66,26],[256,22,256,26],[257,12,257,16],[211,12,211,26],[171,12,171,26],[207,1,207,11],[57,12,57,15],[58,12,58,15],[59,12,59,15],[65,12,65,26],[264,22,264,26],[108,1,108,11],[156,1,156,11],[157,1,157,11],[108,12,108,26],[158,1,158,11],[111,1,111,11],[57,1,57,11],[111,12,111,26],[110,1,110,11],[107,1,107,11],[106,1,106,11],[107,12,107,26],[57,16,57,26],[58,16,58,26],[59,16,59,26],[60,12,60,26],[62,12,62,26],[63,12,63,26],[61,12,61,26],[2,20,2,26],[3,1,3,25],[10,12,10,26],[13,12,13,26],[9,12,9,26],[6,12,6,26],[7,12,7,26],[12,1,12,11],[13,1,13,11],[9,1,9,11],[5,1,5,11],[8,12,8,26],[11,12,11,26],[12,12,12,26],[8,1,8,11],[10,1,10,11],[5,12,5,26],[6,1,6,11],[7,1,7,11],[59,1,59,11],[60,1,60,11],[61,1,61,11],[62,1,62,11],[70,12,70,26],[68,12,68,26],[69,12,69,26],[67,12,67,26],[110,12,110,26],[105,12,105,26],[104,12,104,26],[101,1,101,25],[115,12,115,26],[208,12,208,26],[164,12,164,26],[170,12,170,26],[169,12,169,26],[175,1,175,26],[172,12,172,26],[203,1,203,11],[172,1,172,11],[173,1,173,11],[171,1,171,11],[207,12,207,26],[163,12,163,26],[118,12,118,26],[121,12,121,26],[160,12,160,26],[112,1,112,11],[106,12,106,26],[121,1,121,11],[154,12,154,26],[157,12,157,26],[156,12,156,26],[155,12,155,26],[315,12,315,26],[153,12,153,26],[203,12,203,26],[254,17,254,21],[210,12,210,26],[261,17,261,21],[269,12,269,26],[205,12,205,26],[271,12,271,26],[204,12,204,26],[201,1,201,25],[173,12,173,26],[174,1,174,26],[270,12,270,26],[162,1,162,11],[268,12,268,26],[162,12,162,26],[209,1,209,11],[210,1,210,11],[204,1,204,11],[205,1,205,11],[206,12,206,26],[251,1,251,25],[253,17,253,21],[266,17,266,21],[266,22,266,26],[265,12,265,16],[265,17,265,21],[265,22,265,26],[261,22,261,26],[262,1,262,11],[262,17,262,21],[264,1,264,11],[264,12,264,16],[264,17,264,21],[265,1,265,11],[260,12,260,16],[260,22,260,26],[213,1,213,11],[213,12,213,26],[214,12,214,26],[267,1,267,26],[268,1,268,11],[269,1,269,11],[271,1,271,11],[261,12,261,16],[261,1,261,11],[266,1,266,11],[257,17,257,21],[266,12,266,16],[255,17,255,21],[260,17,260,21],[253,1,253,11],[254,1,254,11],[254,22,254,26],[258,1,258,11],[258,12,258,16],[254,12,254,16],[257,1,257,11],[258,17,258,21],[258,22,258,26],[256,12,256,16],[256,1,256,11],[255,1,255,11],[260,1,260,11],[274,1,274,11],[274,12,274,26],[316,1,316,11],[316,12,316,26],[301,1,301,25],[310,19,310,26],[310,1,310,11],[311,1,311,11],[313,1,313,11],[303,1,303,11],[306,1,306,11],[308,19,308,26],[314,1,314,11],[305,1,305,11],[311,19,311,26],[211,1,211,11],[212,12,212,26],[216,1,216,26],[1,23,1,27],[273,1,273,11],[273,12,273,26],[58,1,58,11],[212,1,212,11],[168,12,168,26],[256,17,256,21],[112,12,112,26],[151,1,151,25],[113,12,113,26],[114,12,114,26],[167,1,167,11],[158,12,158,26],[163,1,163,11],[120,12,120,26],[113,1,113,11],[116,12,116,26],[159,12,159,26],[272,1,272,11],[253,12,253,16],[257,22,257,26]]}
["FÖRDERUNG NACH BAFA-MAP"]
[null,null,null,null,null,null,null,null,null,null,null,null,null,null,null,null,null,null,null,null,null,null,null,{"$f":"RIGHT(Eingabe!AB2,5)","v":"v8.39"}]
[]
[null,"Projektdaten","Straße",{"$f":"Berechnung!C10","v":0}]
[]
[null,"Gebäudedaten"]
[null,"Gebäudestandort",null,null,null,null,null,null,null,null,null,null,{"$f":"Berechnung!C14","v":"Leipzig"}]
[null,"Norm-Außentemperatur",null,null,null,null,null,null,null,null,null,null,{"$f":"Berechnung!C16&\" °C\"","v":"-14 °C"}]
[null,"Gebäudetyp",null,null,null,null,null,null,null,null,null,null,{"$f":"Berechnung!D6&\" | \"&Berechnung!G6","v":"Wohngebäude | Bestandsgebäude"}]
[null,{"$f":"Eingabe!C15","v":"Wohneinheiten"},null,null,null,null,null,null,null,null,null,null,{"$f":"IF(Berechnung!D6=Berechnung!D9,Berechnung!H6,Berechnung!I6)","v":"Einfamilienhaus"}]
{"$rows_left_out":695}
{"sheet":"Ausfüllhilfe Online-Antrag","index":4,"n_rows":122,"n_cols":11,"rows_kept":122,"cut":false,"hidden":true,"merged":[]}
["Antrag auf Basisförderung Wärmepumpe",null,null,null,null,null,null,"Antrag auf Innovationsförderung Wärmepumpe"]
[]
["Typ Element","Name Feld HTML","Wert","Bemerkung",null,null,null,"Typ Element","Name Feld HTML","Wert","Bemerkung"]
[1,"Antragsberechtigung","AUTO711","Radio Antragberechtigung, Privatperson = \"AUTO711\"",null,null,null,1,"Antragsberechtigung","Pg1_Obj1","Radio Antragberechtigung, Immer Privatperson"]
[2,"Anrede_1","HERR / FRAU",null,null,null,null,99,"Kommunal","Pg1_Obj17","Kommunale Mehrheitsbeteiligung ja/nein, aktuell nichts anhaken"]
[2,"VornameAnsprechpartner_1","BITTE EINTRAGEN",null,null,null,null,2,"Anrede_1","HERR / FRAU"]
[2,"NachnameAnsprechpartner_1","BITTE EINTRAGEN",null,null,null,null,2,"VornameAnsprechpartner_1","BITTE EINTRAGEN"]
[2,"FirmennameInstitutionsname_1","BITTE EINTRAGEN",null,null,null,null,2,"NachnameAnsprechpartner_1","BITTE EINTRAGEN"]
[2,"StrasseundHausnummer_1","BITTE EINTRAGEN",null,null,null,null,2,"Institutionsname_1","BITTE EINTRAGEN"]
[2,"Postleitzahl_1","EINTRAGEN",null,null,null,null,2,"StrasseundHausnummer_1","BITTE EINTRAGEN"]
{"$rows_left_out":113}
{"sheet":"Tabellen VDI4650","index":5,"n_rows":163,"n_cols":12,"rows_kept":163,"cut":false,"hidden":true,"merged":[[6,1,14,1],[6,10,14,10],[15,1,23,1],[15,10,23,10],[24,1,32,1],[24,10,32,10],[36,1,44,1],[36,10,44,10],[45,1,53,1],[45,10,53,10],[54,1,62,1],[54,10,62,10],[66,1,74,1],[66,10,74,10],[75,1,83,1],[75,10,83,10],[84,1,92,1],[84,10,92,10],[149,9,162,9],[157,1,157,2],[158,1,158,2],[159,1,159,2],[160,1,160,2],[161,1,161,2],[162,1,162,2],[154,1,154,2],[155,1,155,2],[156,1,156,2],[153,1,153,2],[152,1,152,2],[110,1,110,2],[120,1,120,2],[118,1,118,2],[125,1,125,2],[131,1,131,2],[117,1,117,2],[123,1,123,2],[134,1,134,2],[136,1,136,2],[114,1,114,2],[111,1,111,2],[112,1,112,2],[113,1,113,2],[124,1,124,2],[135,1,135,2],[133,1,133,2],[148,1,148,2],[150,1,150,2],[151,1,151,2],[111,9,136,9],[149,1,149,2],[130,1,130,2],[132,1,132,2],[119,1,119,2],[129,1,129,2],[128,1,128,2],[121,1,121,2],[127,1,127,2],[122,1,122,2],[126,1,126,2],[115,1,115,2],[116,1,116,2]]}
[]
[]
[]
[]
[null,"JAZ Luft-Wasser - Korrekturfaktor F1"]
[null,"Heizgrenze","Norm-Außentemp.","30 °C","35 °C","40 °C","45 °C","50 °C","55 °C","Bei Vorlauftemp.","bei Norm-Außentemp."]
[null,"10 °C",-10,0.109,0.10299999999999999,9.7000000000000003E-2,9.0999999999999998E-2,8.5000000000000006E-2,0.08,{"$f":"HLOOKUP(Berechnung!$F$34,$D$6:$I$33,L7,FALSE)","v":0.08},{"$f":"VLOOKUP(Berechnung!$M$6,$C$7:$J$15,8,FALSE)","v":0.154},2]
[null,null,-11,{"$f":"AVERAGE(D7,D9)","v":0.13450000000000001},0.127,0.12,0.113,0.10600000000000001,9.9500000000000005E-2,{"$f":"HLOOKUP(Berechnung!$F$34,$D$6:$I$33,L8,FALSE)","v":9.9500000000000005E-2},null,3]
[null,null,-12,0.16,0.151,0.14299999999999999,0.13500000000000001,0.127,0.11899999999999999,{"$f":"HLOOKUP(Berechnung!$F$34,$D$6:$I$33,L9,FALSE)","v":0.11899999999999999},null,4]
[null,null,-13,{"$f":"AVERAGE(D9,D11)","v":0.182},0.17249999999999999,0.16349999999999998,0.1545,0.14550000000000002,0.13650000000000001,{"$f":"HLOOKUP(Berechnung!$F$34,$D$6:$I$33,L10,FALSE)","v":0.13650000000000001},null,5]
{"$rows_left_out":154}
{"sheet":"Linksammlung","index":6,"n_rows":15,"n_cols":6,"rows_kept":15,"cut":false,"hidden":true,"merged":[[100,8,101,15],[2,2,2,3],[2,5,2,6]]}
[]
[null,null,"Linksammlung"]
[null,null,"Förderanträge",null,null,"Weiterführende Informationen"]
[]
[null,null,"Basisförderung Wärmepumpe",null,null,"BAFA-Förderrichtlinie 2016"]
[]
[null,null,"Innovationsförderung Wärmepumpe",null,null,"Übersicht Wärmepumpenförderung"]
[]
[null,null,"Basisförderung Solarthermie",null,null,"Übersicht Solarförderung"]
[]
{"$rows_left_out":5}