{"text_format":"1","workbook":"xlsx","n_sheets":7,"sheets":["Eingabe","Berechnung","Leistungsdaten","Ausdruck","Ausfüllhilfe Online-Antrag","Tabellen VDI4650","Linksammlung"],"not_rendered":{"charts":0,"images":59,"macros":1,"external_links":0,"defined_names":8,"comments":3,"pivot_tables":0},"unopened":[],"bounds":{"document_bytes":16777216,"sheet_cells":100000,"rows_first":2000,"rows_last":500,"rows_between":2000,"halvings":0,"cell_chars":16384,"cell_head_chars":4096},"cells_cut":0,"cells_raw":0,"read":"whole","date_system":"1900"}

{"sheet":"Eingabe","index":0,"n_rows":113,"n_cols":28,"rows_kept":113,"cut":false,"hidden":false,"merged":[[25,18,25,29],[18,2,18,7],[18,8,18,15],[72,8,72,15],[0,2,0,29],[12,2,12,7],[16,2,16,7],[12,8,12,15],[14,8,14,15],[4,2,4,16],[6,8,6,15],[8,8,8,15],[10,8,10,15],[16,8,16,15],[1,27,1,29],[14,2,14,7],[6,2,6,7],[8,2,8,7],[10,2,10,7],[110,8,110,15],[112,2,112,7],[112,8,112,15],[100,2,100,16],[102,2,102,7],[102,8,102,15],[104,2,104,7],[108,2,108,7],[108,8,108,15],[106,2,106,7],[74,8,74,15],[29,2,29,7],[52,8,52,15],[119,18,119,29],[20,2,20,7],[56,2,56,7],[58,2,58,7],[58,8,58,15],[66,2,66,7],[66,8,66,15],[68,2,68,7],[104,8,104,15],[52,2,52,7],[69,18,69,29],[70,8,70,15],[110,2,110,7],[26,2,26,7],[26,8,26,15],[106,8,106,15],[70,2,70,7],[72,2,72,7],[74,2,74,7],[50,2,50,16],[64,2,64,7],[54,11,54,15],[54,2,54,7],[54,8,54,9],[68,8,68,15],[60,2,60,7],[60,8,60,15],[62,2,62,7],[62,8,62,15],[64,8,64,13]]}
[null,null,"MAP-FÖRDERMITTELRECHNER"]
[null,null,null,null,null,null,null,null,null,null,null,null,null,null,null,null,null,null,null,null,null,null,null,null,null,null,null,"UMT/TR v8.39"]
[]
[]
[]
[]
[null,null,"Gebäudestandort"]
[]
[null,null,"Norm-Außentemperatur",null,null,null,null,null,{"$f":"Berechnung!C16&\" °C\"","v":"-14 °C"}]
[]
[null,null,"Gebäudetyp"]
[]
[null,null,"Nutzungsart"]
[]
[null,null,{"$f":"IF(Berechnung!D6=Berechnung!D9,\"Wohneinheiten\",\"Gesamtfläche\")","v":"Wohneinheiten"}]
[]
[null,null,"Wärmedämmung"]
[]
[null,null,"Alte Heizungsanlage",null,null,null,null,null,"Angabe nicht erforderlich"]
[]
[null,null,"Neue Heizungsanlage"]
[]
[]
[]
[]
[]
[null,null,"Kosten für Optimierung",null,null,null,null,null,"Angabe nicht erforderlich"]
[]
[]
[]
[]
[]
[]
[]
[]
[]
[]
[]
[]
[]
[]
[]
[]
[]
[]
[]
[]
[]
[]
[]
[]
[]
[null,null,"Wärmequelle"]
[]
[null,null,"Wärmepumpen-Typ",null,null,null,null,null,{"$f":"Berechnung!R6&\" x\"","v":"1 x"}]
[]
[null,null,"Betrieb | Bivalenzpunkt",null,null,null,null,null,null,null,null,null,null,null,null,"---"]
[]
[null,null,"Pufferspeicher"]
[]
[null,null,"Warmwasserbereitung"]
[]
[null,null,"Typ Warmwasser"]
[]
[null,null,"Anteil Warmwasser",null,null,null,null,null,{"$f":"IF(Berechnung!$M$54=FALSE,\"---\",\"\")","v":""},null,null,null,null,null,null,{"$f":"IF(Berechnung!$M$54=FALSE,\"---\",\"18 %\")","v":"18 %"}]
[]
[null,null,"Heizsystem"]
[]
[null,null,"Vorlauftemperatur"]
[]
[null,null,"Komponenten Heizkreis"]
[]
[null,null,{"$f":"IF(OR(Berechnung!B34=Berechnung!B39,Berechnung!B34=Berechnung!B40),\"Grundwassertemperatur\",\"Wärmequellenanlage\")","v":"Wärmequellenanlage"},null,null,null,null,null,"Angabe nicht erforderlich"]
[]
[null,null,"Komponenten Quelle",null,null,null,null,null,"Angabe nicht erforderlich"]
[]
[]
[]
[]
[]
[]
[]
[]
[]
[]
[]
[]
[]
[]
[]
[]
[]
[]
[]
[]
[]
[]
[]
[]
[]
[]
[]
[null,null,"Kollektortyp"]
[]
[null,null,"Kollektoranzahl"]
[]
[null,null,"Nutzungsart"]
[]
[null,null,"Installationsart"]
[]
[null,null,"Wärmeerzeuger Heizung",null,null,null,null,null,"Wärmepumpe"]
[]
[null,null,"Austausch Heizkessel",null,null,null,null,null,"Angabe nicht erforderlich"]

{"sheet":"Berechnung","index":1,"n_rows":283,"n_cols":59,"rows_kept":283,"cut":false,"hidden":true,"merged":[[237,21,239,22],[204,13,204,14],[205,13,205,14],[206,13,206,14],[207,13,207,14],[208,13,208,14],[209,13,209,14],[210,13,210,14],[211,13,211,14],[212,13,212,14],[237,18,239,19],[165,37,165,38],[165,40,165,41],[166,37,166,38],[166,40,166,41],[167,37,167,38],[167,40,167,41],[176,37,176,38],[176,40,176,41],[173,37,173,38],[173,40,173,41],[174,37,174,38],[174,40,174,41],[170,37,170,38],[170,40,170,41],[171,37,171,38],[171,40,171,41],[169,37,169,38],[169,40,169,41],[172,37,172,38],[172,40,172,41],[168,37,168,38],[168,40,168,41],[172,10,172,11],[156,10,156,11],[179,37,179,38],[179,40,179,41],[180,37,180,38],[180,40,180,41],[177,37,177,38],[177,40,177,41],[178,37,178,38],[178,40,178,41],[175,37,175,38],[175,40,175,41],[177,13,177,14],[176,13,176,14],[176,16,176,17],[178,13,178,14],[178,16,178,17],[174,13,174,14],[174,16,174,17],[175,13,175,14],[175,16,175,17],[164,37,164,38],[164,40,164,41],[164,13,164,14],[173,13,173,14],[167,13,167,14],[165,13,165,14],[165,16,165,17],[29,20,31,21],[32,20,32,21],[33,20,33,21],[34,20,34,21],[35,20,35,21],[36,20,36,21],[169,13,169,14],[169,16,169,17],[168,19,168,20],[171,19,171,20],[164,16,164,17],[166,13,166,14],[166,16,166,17],[171,13,171,14],[171,16,171,17],[164,19,164,20],[145,10,145,12],[1,10,2,11],[145,7,145,9],[145,4,145,6],[150,1,150,2],[150,7,150,8],[153,7,153,8],[1,14,3,15],[37,20,37,21],[38,20,38,21],[152,10,152,11],[29,10,31,10],[146,10,146,11],[45,11,49,11],[171,4,171,5],[172,7,172,8],[177,7,177,8],[180,1,180,2],[172,1,172,2],[171,1,171,2],[1,1,3,2],[26,1,26,2],[25,5,25,6],[157,1,157,3],[149,1,149,2],[146,1,146,2],[159,4,159,12],[147,7,147,8],[146,7,146,8],[145,1,145,3],[147,1,147,2],[33,7,33,8],[32,7,32,8],[34,7,34,8],[29,7,29,8],[147,10,147,11],[149,7,149,8],[155,7,155,8],[211,1,211,2],[179,7,179,8],[179,10,179,11],[180,10,180,11],[174,10,174,11],[210,1,210,2],[174,7,174,8],[180,4,180,5],[180,7,180,8],[178,7,178,8],[178,10,178,11],[175,10,175,11],[177,10,177,11],[204,1,204,2],[176,7,176,8],[203,6,203,7],[203,8,203,9],[203,10,203,11],[228,1,228,2],[159,1,159,3],[165,4,165,5],[172,4,172,5],[173,4,173,5],[164,1,164,2],[212,1,212,2],[206,1,206,2],[220,1,220,2],[205,1,205,2],[209,1,209,2],[169,4,169,5],[169,1,169,2],[170,4,170,5],[160,4,160,12],[164,7,164,8],[208,1,208,2],[165,1,165,2],[207,1,207,2],[167,4,167,5],[203,5,204,5],[173,1,173,2],[164,10,164,11],[168,4,168,5],[167,1,167,2],[166,1,166,2],[148,7,148,8],[151,1,151,2],[148,1,148,2],[153,1,153,2],[153,10,153,11],[149,10,149,11],[158,1,158,3],[160,1,160,3],[154,7,154,8],[152,7,152,8],[152,1,152,2],[151,7,151,8],[154,4,154,5],[157,4,157,12],[149,4,149,5],[155,10,155,11],[156,1,156,2],[158,4,158,12],[165,7,165,8],[155,1,155,2],[154,1,154,2],[153,4,153,5],[168,1,168,2],[176,10,176,11],[167,7,167,8],[169,7,169,8],[169,10,169,11],[175,7,175,8],[146,4,146,5],[147,4,147,5],[155,4,155,5],[156,4,156,5],[154,10,154,11],[156,7,156,8],[165,10,165,11],[150,10,150,11],[166,10,166,11],[151,10,151,11],[148,10,148,11],[164,4,164,5],[167,10,167,11],[166,4,166,5],[148,4,148,5],[152,4,152,5],[151,4,151,5],[150,4,150,5],[170,1,170,2],[174,22,174,23],[175,19,175,20],[175,22,175,23],[176,19,176,20],[172,13,172,14],[172,16,172,17],[173,16,173,17],[165,22,165,23],[166,19,166,20],[166,22,166,23],[167,19,167,20],[167,22,167,23],[168,22,168,23],[169,19,169,20],[167,16,167,17],[170,13,170,14],[168,13,168,14],[168,16,168,17],[173,7,173,8],[173,10,173,11],[171,7,171,8],[171,10,171,11],[166,7,166,8],[171,28,171,29],[172,25,172,26],[171,25,171,26],[175,31,175,32],[175,34,175,35],[176,31,176,32],[176,34,176,35],[170,31,170,32],[170,34,170,35],[172,31,172,32],[173,31,173,32],[174,31,174,32],[172,28,172,29],[180,34,180,35],[177,31,177,32],[173,25,173,26],[173,28,173,29],[174,25,174,26],[174,28,174,29],[175,25,175,26],[175,28,175,29],[177,34,177,35],[178,34,178,35],[180,25,180,26],[179,34,179,35],[177,16,177,17],[180,22,180,23],[180,13,180,14],[180,16,180,17],[180,31,180,32],[176,22,176,23],[177,19,177,20],[177,22,177,23],[178,31,178,32],[179,31,179,32],[179,13,179,14],[179,16,179,17],[180,28,180,29],[180,19,180,20],[178,19,178,20],[178,22,178,23],[179,19,179,20],[179,22,179,23],[164,22,164,23],[165,19,165,20],[172,34,172,35],[173,34,173,35],[174,34,174,35],[171,22,171,23],[172,19,172,20],[172,22,172,23],[173,19,173,20],[173,22,173,23],[169,22,169,23],[170,19,170,20],[170,22,170,23],[174,19,174,20],[164,31,164,32],[164,34,164,35],[165,31,165,32],[165,34,165,35],[171,31,171,32],[171,34,171,35],[168,34,168,35],[170,25,170,26],[170,28,170,29],[169,31,169,32],[169,34,169,35],[164,28,164,29],[168,31,168,32],[165,25,165,26],[165,28,165,29],[166,25,166,26],[166,28,166,29],[167,28,167,29],[168,25,168,26],[168,28,168,29],[169,25,169,26],[169,28,169,29],[167,25,167,26],[164,25,164,26],[164,43,164,44],[164,46,164,47],[165,43,165,44],[165,46,165,47],[166,43,166,44],[166,46,166,47],[167,43,167,44],[167,46,167,47],[168,43,168,44],[168,46,168,47],[169,43,169,44],[169,46,169,47],[170,43,170,44],[170,46,170,47],[171,43,171,44],[171,46,171,47],[172,43,172,44],[172,46,172,47],[173,43,173,44],[173,46,173,47],[172,52,172,53],[173,49,173,50],[173,52,173,53],[164,49,164,50],[164,52,164,53],[165,49,165,50],[165,52,165,53],[166,49,166,50],[166,52,166,53],[167,49,167,50],[167,52,167,53],[168,49,168,50],[168,52,168,53],[267,2,267,3],[168,7,168,8],[168,10,168,11],[179,49,179,50],[179,52,179,53],[180,49,180,50],[180,52,180,53],[174,49,174,50],[174,52,174,53],[175,49,175,50],[175,52,175,53],[176,49,176,50],[176,52,176,53],[177,49,177,50],[177,52,177,53],[178,49,178,50],[178,52,178,53],[169,49,169,50],[169,52,169,53],[170,49,170,50],[170,52,170,53],[171,49,171,50],[171,52,171,53],[172,49,172,50],[164,55,164,56],[164,58,164,59],[165,55,165,56],[165,58,165,59],[166,55,166,56],[166,58,166,59],[167,55,167,56],[167,58,167,59],[168,55,168,56],[168,58,168,59],[169,55,169,56],[169,58,169,59],[170,55,170,56],[170,58,170,59],[171,55,171,56],[171,58,171,59],[172,55,172,56],[172,58,172,59],[173,55,173,56],[173,58,173,59],[179,55,179,56],[179,58,179,59],[180,55,180,56],[180,58,180,59],[174,55,174,56],[174,58,174,59],[175,55,175,56],[175,58,175,59],[176,55,176,56],[176,58,176,59],[177,55,177,56],[177,58,177,59],[178,55,178,56],[178,58,178,59],[179,43,179,44],[179,46,179,47],[180,43,180,44],[180,46,180,47],[174,43,174,44],[174,46,174,47],[175,43,175,44],[175,46,175,47],[176,43,176,44],[176,46,176,47],[177,43,177,44],[177,46,177,47],[178,43,178,44],[178,46,178,47]]}
[null,"Comoboxen Gebäudedaten"]
[null,"Projektdaten",null,null,null,null,null,null,null,null,"HT' (% von EnEV)",null,"Zahlenwert",null,null,null,"Ist gewählte WP","Gewählte Anzahl"]
[null,null,null,"Nutzungsart","Energieeffizienz","Anlagentechnik","Gebäudetyp","Wohneinheiten","Gesamtfläche","Heizung Alt",null,null,"Außentemperatur","Heizgrentztemperatur",null,null,"kaskadierbar ?",null,null,"Kosten Heizungsoptimierung","Kosten Heizungsoptimierung"]
[null,null,null,null,null,null,null,null,null,null,"Text Ausdruck","Wert"]
[]
[null,null,null,"Wohngebäude","Niedrigenergiehaus EnEV 2016","","Bestandsgebäude","Einfamilienhaus","Unter 500 m²","Gaskessel",{"$f":"IF(E6=E9,\"EnEV 2009 Neubau - Niveau\",VLOOKUP(E6,E8:K26,7,FALSE)&\" \"&L6&\"% EnEV 2009 Neubau - Niveau\")","v":"EnEV 2009 Neubau - Niveau"},{"$f":"IF(E27=FALSE,150,VLOOKUP(E6,E8:L25,8,FALSE))","v":100},{"$f":"IF(ISERROR(C16*1),-14,C16*1)","v":-14},{"$f":"IF(G6=G10,N27,VLOOKUP(E6,E8:N27,10,FALSE))","v":"15 °C"},"Checkbox","wählbar ?",{"$f":"VLOOKUP($C$34,Leistungsdaten!G:AC,23,FALSE)","v":false},1,null,"5000 €",{"$f":"IF(T6=T54,23000,LEFT(T6,FIND(\" \",T6)-1)*1)","v":5000}]
[]
[]
[null,null,null,"Wohngebäude","Niedrigenergiehaus EnEV 2016","Auswahl Wärmepumpe","Neubau","Einfamilienhaus","Unter 500 m²","Gaskessel",null,100,null,"12 °C","Projektdaten",true,null,null,null,"500 €"]
[null,null,null,"Nichtwohngebäude","Passivhausstandard",true,"Bestandsgebäude","Zweifamilienhaus","Über 500 m²","Ölkessel","Max.",55,null,"10 °C","Daten WP | Solar",{"$f":"IF(F27=0,FALSE,TRUE)","v":true},null,null,null,"1000 €"]
[null,null,null,null,"KfW Effizienzhaus 40","Auswahl Solar",null,"Dreifamilienhaus",null,"Gas-Brennwertkessel","Max.",55,null,"12 °C","JAZ Wärmepumpe",{"$f":"IF(OR(F27=0,F27=2),FALSE,TRUE)","v":true},null,null,null,"1500 €"]
[null,null,null,null,"KfW Effizienzhaus 55",false,null,"Mehrfamilienhaus",null,"Öl-Brennwertkessel","Max.",70,null,"12 °C","Fördersummen",true,null,null,null,"2000 €"]
[null,"PLZ Gebäude",{"$f":"INDEX(Leistungsdaten!A:A,SUBSTITUTE(C17,\"lstStadt\",\"\"),1)","v":"04..."},null,"KfW Effizienzhaus 70",null,null,null,null,"Wärmepumpe","Max.",85,null,"12 °C","Herstellererklärungen",false,null,null,null,"2500 €"]
[null,"Standort Gebäude",{"$f":"INDEX(Leistungsdaten!A:B,SUBSTITUTE(C17,\"lstStadt\",\"\"),2)","v":"Leipzig"},null,"KfW Effizienzhaus 100",null,null,null,null,"Sonstige Wärmeerzeuger","Max.",115,null,"12 °C","Ausfüllhilfe Basis",{"$f":"E224","v":true},null,null,null,"3000 €"]
[null,null,null,null,"KfW Effizienzhaus 115",null,null,null,null,null,"Max.",130,null,"12 °C","Ausfüllhilfe Innovation WP?",{"$f":"E228","v":false},null,null,null,"3500 €"]
[null,"Norm-Außentemp.",{"$f":"INDEX(Leistungsdaten!A:C,SUBSTITUTE(C17,\"lstStadt\",\"\"),3)","v":-14},null,"Altbau (WSchVO 95)",null,null,null,null,null,"≥",150,null,"15 °C",null,null,null,null,null,"4000 €"]
[null,"Stadt Application.caller","lstStadt4521",null,null,null,null,null,null,null,null,null,null,null,null,null,null,null,null,"4500 €"]
[null,null,null,null,null,null,null,null,null,null,null,null,null,null,null,null,null,null,null,"5000 €"]
[null,null,null,null,null,null,null,null,null,null,null,null,null,null,null,null,null,null,null,"5500 €"]
[null,null,null,null,null,null,null,null,null,null,null,null,null,null,null,null,null,null,null,"6000 €"]
[null,null,null,null,null,"0=Ohne",null,null,null,null,null,null,null,null,null,null,null,null,null,"6500 €"]
[null,null,null,null,null,"1=WP",null,null,null,null,null,null,null,null,null,null,null,null,null,"7000 €"]
[null,null,null,null,null,"2=Solar",null,null,null,null,null,null,null,null,null,null,null,null,null,"7500 €"]
[null,null,null,null,null,"3=WP+Solar",null,null,null,null,null,null,null,null,null,null,null,null,null,"8000 €"]
[null,null,null,null,null,null,null,null,null,null,null,null,null,null,null,null,null,null,null,"8500 €"]
[null,null,null,"Wohngebäude ?","Effizienzbonus möglich ?","System",null,"Neubau ?",null,null,null,null,null,"Altbau immer HGT 15 °C",null,null,null,null,null,"9000 €"]
[null,"Angabe wird nicht benötigt",null,{"$f":"IF(D6=D9,TRUE,FALSE)","v":true},{"$f":"IF(D6=D10,FALSE,TRUE)","v":true},{"$f":"IF(AND(F10=TRUE,F12=TRUE),3,IF(F10=TRUE,1,IF(F12=TRUE,2,0)))","v":1},null,{"$f":"IF(G6=G9,TRUE,FALSE)","v":false},null,null,null,null,null,"15 °C",null,null,null,null,null,"9500 €"]
[null,null,null,null,null,null,null,null,null,null,null,null,null,null,null,null,null,null,null,"10000 €"]
[null,"Comoboxen Wärmepumpe",null,null,null,null,null,null,null,null,null,null,null,null,null,null,null,null,null,"10500 €","Auswahl Zusatzkomponenten"]
[null,null,null,null,null,null,null,"Wärmequellentemperatur",null,null,"Komponenten Sole",null,null,null,"Zahlenwert","Zahlenwert","Zahlenwert","Zahlenwert",null,"11000 €"]
[null,"Wärmequelle","WP-Typ","Betriebsweise","Bivalenzpunkt","Vorlauftemperatur","Heizsystem","Sole","Wasser","Komponenten Heizung",null,"Warmwasserbereitung","Anteil WWB","% WWB","Temp. Quelle","Temp. Quelle","Deckungsanteil","Anteil WWB",null,"11500 €",null,null,"Auswahl",{"$f":"$B$37","v":"Außenluft"},{"$f":"$B$38","v":"Erdreich"},{"$f":"$B$39","v":"Grundwasser"}]
[null,null,null,null,null,null,null,null,null,null,null,null,null,null,"Sole-Wasser","Sole oder Wasser","Bivalenzpunkt",null,null,"12000 €"]
[null,null,null,null,null,null,null,null,null,null,null,null,null,null,null,null,null,null,null,"12500 €","WMZ eingebaut ?",null,{"$f":"HLOOKUP($B$34,$X$31:$Z$37,3,FALSE)","v":true},{"$f":"VLOOKUP($C$34,Leistungsdaten!G:W,10,FALSE)","v":true},{"$f":"X33","v":true},{"$f":"X33","v":true}]
[null,"Außenluft","WPL 25 A","Monoenergetisch","-5 °C","55 °C","Radiatorenheizung","Erdwärmesonde (Neuerrichtung)",null,"EC-Pumpe Heizung","Keine","Mit Heizungs-Wärmepumpe","Vorgabewert","18",{"$f":"IF(OR(K34=K39,K34=K40),VLOOKUP(H34,H36:O53,8,FALSE)+2,VLOOKUP(H34,H36:O53,8,FALSE))","v":2},{"$f":"IF(OR(B34=B38,B34=B37),O34,IF(B54=FALSE,(VLOOKUP(H34,I36:P54,8,FALSE)-3),VLOOKUP(H34,I36:P54,8,FALSE)))","v":2},{"$f":"IF(D34=D38,VLOOKUP(E34,E36:Q53,13,FALSE),1)","v":0.98},{"$f":"IF(M54=FALSE,0,N34/100)","v":0.18},null,"13000 €","EC-Pumpe Heizung eingebaut ?",null,{"$f":"HLOOKUP($B$34,$X$31:$Z$37,4,FALSE)","v":false},{"$f":"VLOOKUP($C$34,Leistungsdaten!G:W,9,FALSE)","v":false},{"$f":"X34","v":false},{"$f":"X34","v":false}]
[null,null,null,null,null,null,null,null,null,null,null,null,null,null,null,null,null,null,null,"13500 €","EC-Pumpe Sole eingebaut ?",null,{"$f":"IF(R6>1,FALSE,HLOOKUP($B$34,$X$31:$Z$37,5,FALSE))","v":true},true,{"$f":"VLOOKUP($C$34,Leistungsdaten!G:W,11,FALSE)","v":false},{"$f":"Y35","v":false}]
[null,null,null,null,null,null,null,null,null,null,null,null,null,"Typ WWB für Ausdruck",null,null,null,null,null,"14000 €","LWM 250 einsetzbar ?",null,{"$f":"HLOOKUP($B$34,$X$31:$Z$37,6,FALSE)","v":false},false,{"$f":"VLOOKUP($C$34,Leistungsdaten!G:W,13,FALSE)","v":false},false]
[null,"Außenluft","Luft/Wasser-Wärmepumpe","Monovalent","-10 °C","30 °C","Radiatorenheizung","Erdwärmesonde (Neuerrichtung)","Standardwert (10 °C)","Keine","Keine","Mit Heizungs-Wärmepumpe","Vorgabewert",null,2,10,1,null,null,"14500 €","EC-Pumpe Brunnen einsetzbar ?",null,{"$f":"HLOOKUP($B$34,$X$31:$Z$37,7,FALSE)","v":false},false,false,{"$f":"VLOOKUP($C$34,Leistungsdaten!G:Z,18,FALSE)","v":false}]
[null,"Erdreich","Sole/Wasser-Wärmepumpe","Monoenergetisch","-9 °C","35 °C","Gebläsekonvektor AUK","Erdwärmesonde (bereits vorhanden)","5 °C","Wärmemengenzähler","EC-Pumpe Sole","Mit Warmwasser-Wärmepumpe","Eingabe in %",null,2,5,0.99,null,null,"15000 €","WMZ gewählt/eingebaut (Fördervoraussetzung) ?",null,{"$f":"IF(OR(W33=TRUE,J34=J38,J34=J40),TRUE,FALSE)","v":true}]
[null,"Grundwasser",{"$f":"IF(B54=FALSE,\"Wasser/Wasser (Zwischenwärmetauscher)\",\"Wasser/Wasser-Wärmepumpe\")","v":"Wasser/Wasser (Zwischenwärmetauscher)"},"Bivalent-Parallel","-8 °C","40 °C","Fußbodenheizung","Erdreichkollektor","6 °C","EC-Pumpe Heizung",{"$f":"$G$276","v":"Abluftmodul LWM 250"},"Mit Abluft-Wärmepumpe",null,null,0,6,0.99,null,null,"15500 €"]
[null,null,null,null,"-7 °C","45 °C","Wandheizung","Erdwärmekorb","7 °C","EC-Pumpe | Wärmemengenzähler",{"$f":"$G$277","v":"EC-Pumpe-Sole | LWM 250"},"Durchlauferhitzer mit Ökostrom",null,null,0,7,0.99,null,null,"16000 €"]
[null,null,null,null,"-6 °C","50 °C","Deckenheizung",null,"8 °C",null,"EC-Pumpe Brunnen","Durchlauferhitzer mit PV-Strom",null,null,null,8,0.99,null,null,"16500 €"]
[null,null,null,null,"-5 °C","55 °C","FBH und Radiatoren (FBH > 50%)",null,"9 °C",null,"EC-Pumpe Sole + Brunnen","Sonstige Wärmeerzeuger",null,null,null,9,0.98,null,null,"17000 €"]
[null,null,null,null,"-4 °C",null,"FBH und Radiatoren (FBH < 50%)",null,"10 °C",null,null,{"$f":"IF(D6=D10,\"Angabe wird nicht benötigt\",\"Keine Warmwasserbereitung\")","v":"Keine Warmwasserbereitung"},null,null,null,10,0.97,null,null,"17500 €"]
[null,null,null,null,"-3 °C",null,null,null,"11 °C",null,null,null,null,null,null,11,0.96,null,null,"18000 €"]
[null,null,null,null,"-2 °C",null,null,null,"12 °C",null,null,null,null,null,null,12,0.95,null,null,"18500 €"]
[null,null,null,null,"-1 °C",null,null,null,"13 °C",null,null,"!! Bei Hinzufügen/Löschen im VBA ListIndex und ListFillRange cboWarmwasserbereitung anpassen!!",null,null,null,13,0.93,null,null,"19000 €"]
[null,null,null,null,"  0 °C",null,null,null,"14 °C",null,null,null,null,null,null,14,0.9,null,null,"19500 €"]
[null,null,null,null,"  1 °C",null,null,null,"15 °C",null,null,null,null,null,null,15,0.87,null,null,"20000 €"]
[null,null,null,null,"  2 °C",null,null,null,null,null,null,null,null,null,null,null,0.83,null,null,"20500 €"]
[null,null,null,null,"  3 °C",null,null,null,null,null,null,null,"WWB mit DE?",null,null,null,0.77,null,null,"21000 €"]
[null,null,null,null,"  4 °C",null,null,null,null,null,null,null,{"$f":"IF(OR(L34=L40,L34=L41),TRUE,FALSE)","v":false},null,null,null,0.7,null,null,"21500 €"]
[null,null,null,null,"  5 °C",null,null,null,null,null,null,null,null,null,null,null,0.61,null,null,"22000 €"]
[null,"WPW gewählt ?","WP-Set ?","Inverter ?","Qualitätscheck gewählt ?","SG-ready ?","Produktbild","Link Webseite WP","Link WP-Datenblatt","EC-Pumpe HK gewählt ?","EC-Pumpe Eingebaut ?","WWB integriert ?","WWB mit EE?","WWB Separat ?","Heizungsoptimierung gewählt?","Sonderbauform nach Bafa ?",null,null,null,"22500 €"]
[null,{"$f":"VLOOKUP(C34,Leistungsdaten!G:AA,21,FALSE)","v":false},{"$f":"VLOOKUP(C34,Leistungsdaten!G:M,7,FALSE)","v":false},{"$f":"VLOOKUP(C34,Leistungsdaten!G:W,14,FALSE)","v":true},true,{"$f":"VLOOKUP(C34,Leistungsdaten!G:AH,26,FALSE)","v":true},{"$f":"IF(ISERROR(VLOOKUP(C34,Leistungsdaten!G:AE,25,FALSE)),FALSE,VLOOKUP(C34,Leistungsdaten!G:AE,25,FALSE))","v":"PIC00003555-00.jpg"},{"$f":"$G$272","v":"http://apps.stiebel-eltron.de/produktdaten/?article=232493"},{"$f":"$G$273","v":"http://www.stiebel-eltron.de/services/productproxy.product.pdf?productnr=232493"},{"$f":"IF(OR(W34=TRUE,J34=J39,J34=J40),TRUE,FALSE)","v":true},{"$f":"VLOOKUP(C34,Leistungsdaten!G:AD,24,FALSE)","v":false},{"$f":"VLOOKUP(C34,Leistungsdaten!G:N,8,FALSE)","v":false},{"$f":"IF(OR(L34=L42,L34=L43),FALSE,TRUE)","v":true},{"$f":"IF(OR(L34=L38,L34=L39,L34=L40,L34=L41),TRUE,FALSE)","v":false},false,{"$f":"VLOOKUP(C34,Leistungsdaten!G:U,15,FALSE)","v":false},null,null,null,"23000 € und mehr"]
[]
[null,"Comoboxen Solar"]
[]
[null,"Kollektortyp","Kollektoranzahl","Wärmeerzeuger","Kesseltausch",null,"Installationsart","Nutzungsart","Kollektorfläche (m²)",null,"Basisförderung","Innovation","Puffervolumen min"]
[]
[]
[null,"SOL 27 premium S","4","Förderfähiger Biomassekessel","Alter Kessel wird getauscht",null,"Erstinstallation","Warmwasser und Heizung",{"$f":"VLOOKUP(B61,Leistungsdaten!G:O,2,FALSE)*C61","v":10.199999999999999},null,{"$f":"IF(H61=H64,K64,K65)","v":2000},{"$f":"IF(V181=FALSE,0,IF(H61=H64,L64,L65))","v":0},{"$f":"ROUNDUP(I61*40,-1)&\" Liter\"","v":"410 Liter"}]
[]
[]
[null,{"$f":"Leistungsdaten!G205","v":"SOL 27 premium S"},1,"Gas-Brennwertkessel","Alter Kessel wird getauscht",null,"Erstinstallation","Warmwasser und Heizung",null,null,{"$f":"IF(G61=G64,MAX(ROUNDDOWN(I61,0)*140,2000),IF(AND(G61=G65,I61>4),ROUNDDOWN(I61,0)*50,0))","v":2000},{"$f":"IF(G6=G9,ROUNDDOWN(I61,0)*150,ROUNDDOWN(I61,0)*200)","v":2000}]
[null,{"$f":"Leistungsdaten!G206","v":"SOL 27 premium W"},2,"Öl-Brennwertkessel","Alter Kessel wird nicht getauscht",null,"Erweiterung bestehende Anlage","Nur Warmwasserbereitung",null,null,{"$f":"IF(AND(G61=G64,I61<3),0,IF(AND(G61=G65,I61<4),0,MAX(ROUNDDOWN(I61,0)*50,500)))","v":500},{"$f":"IF(G6=G9,ROUNDDOWN(I61,0)*75,ROUNDDOWN(I61,0)*100)","v":1000}]
[null,{"$f":"Leistungsdaten!G207","v":"SOL 27 basic S"},3,"Förderfähiger Biomassekessel"]
[null,{"$f":"Leistungsdaten!G208","v":"SOL 27 basic W"},4,"Sonstiger Wärmeerzeuger"]
[null,{"$f":"Leistungsdaten!G209","v":"SOL 23 premium"},5]
[null,null,6]
[null,null,7]
[null,null,8]
[null,null,9]
[null,null,10]
[null,null,11]
[null,null,12]
[null,null,13]
[null,null,14]
[null,null,15,"Abfrage Kesseltausch ?","Produktbild Kollektor","Link Datenblatt","Link Web"]
[null,null,null,{"$f":"IF(G6=G9,FALSE,IF(F27<>2,FALSE,IF(D61=D64,TRUE,IF(D61=D65,TRUE,FALSE))))","v":false},{"$f":"IF(ISERROR(VLOOKUP(B61,Leistungsdaten!G:AE,25,FALSE)),FALSE,VLOOKUP(B61,Leistungsdaten!G:AE,25,FALSE))","v":"PIC00001016-00.jpg"},{"$f":"G275","v":"http://www.stiebel-eltron.de/services/productproxy.product.pdf?productnr=230016"},{"$f":"G274","v":"http://apps.stiebel-eltron.de/produktdaten/?article=230016"}]
[]
[]
[]
[]
[]
[]
[]
[]
[]
[]
[]
[]
[]
[]
[]
[]
[]
[]
[]
[]
[]
[]
[]
[]
[]
[]
[]
[]
[]
[]
[]
[]
[]
[]
[]
[]
[]
[]
[]
[]
[]
[]
[]
[]
[]
[]
[]
[]
[]
[null,"JAZ - Korrekturfaktor Verflüssiger",null,null,null,null,"JAZ - Korrekturfaktor Quellenpumpe"]
[null,null,"Luft-Wasser","Sole-Wasser","Wasser-Wasser",null,null,"Luft-Wasser","Sole-Wasser","Zwischen-WT","Wasser-Wasser"]
[null,"DeltaT Prüfstand:",{"$f":"VLOOKUP($C$34,Leistungsdaten!G:H,2,FALSE)","v":5},{"$f":"C131","v":5},{"$f":"C131","v":5},null,"Heizleistung WP",null,{"$f":"VLOOKUP($C$34,Leistungsdaten!G:L,6,FALSE)*R6","v":8.33},{"$f":"VLOOKUP($C$34,Leistungsdaten!G:AC,22,FALSE)*R6","v":0},{"$f":"J131","v":0}]
[null,"Fußbodenheizung",{"$f":"-0.0102*$C$131+1.0716","v":1.0206000000000002},{"$f":"C132","v":1.0206000000000002},{"$f":"C132","v":1.0206000000000002},null,"Leistungsaufnahme WP",null,{"$f":"VLOOKUP($C$34,Leistungsdaten!G:J,4,FALSE)*R6","v":4.17},{"$f":"I132","v":4.17},{"$f":"I132","v":4.17}]
[null,"Radiatorenheizung",{"$f":"-0.0102*$C$131+1.1025","v":1.0515000000000001},{"$f":"C133","v":1.0515000000000001},{"$f":"C133","v":1.0515000000000001},null,"EC-Pumpe Sole eingesetzt?",null,{"$f":"IF(OR(W35=TRUE,K34=K38,K34=K40,K34=K42),TRUE,FALSE)","v":true},{"$f":"I133","v":true},"-"]
[null,"Warmwasserbereitung",{"$f":"C132","v":1.0206000000000002},{"$f":"C133","v":1.0515000000000001},{"$f":"C133","v":1.0515000000000001},null,"Leistung EC-Solepumpe",null,{"$f":"VLOOKUP($C$34,Leistungsdaten!G:O,5,FALSE)","v":5.16},{"$f":"IF(J133=TRUE,I134,0.075*J132)","v":5.16},"-"]
[null,null,null,null,null,null,"Bezeichnung EC-Pumpe",null,{"$f":"VLOOKUP($C$34,Leistungsdaten!G:R,12,FALSE)","v":"-"},{"$f":"I135","v":"-"},"-"]
[null,null,null,null,null,null,"Ausgabe Druck",null,{"$f":"IF(OR(I133=FALSE,I141=I142),H143,\"Typ: \"&I135&\"  |  Leistung: \"&I134*1000&\" W\")","v":"Standard nach VDI 4650"},{"$f":"IF(J133=FALSE,H143,\"Typ: \"&I135&\"  |  Leistung: \"&I134*1000&\" W\")","v":"Typ: -  |  Leistung: 5160 W"},"-"]
[null,null,null,null,null,null,"EC-Pumpe Brunnen eigesetzt ?",null,"-",{"$f":"IF(OR(K34=K41,K34=K42),TRUE,FALSE)","v":false},{"$f":"J137","v":false}]
[null,null,null,null,null,null,"Leistung EC-Brunnenpumpe",null,"-",{"$f":"IF(J137=TRUE,VLOOKUP($C$34,Leistungsdaten!G:Z,20,FALSE),IF(J131<10,0.25*J132,IF(J131>20,0.14*J132,0.2*J132)))","v":1.0425},{"$f":"VLOOKUP($C$34,Leistungsdaten!G:Z,20,FALSE)","v":"-"}]
[null,null,null,null,null,null,"Bezeichnung EC-Pumpe",null,"-",{"$f":"VLOOKUP($C$34,Leistungsdaten!G:Z,19,FALSE)","v":"-"},{"$f":"J139","v":"-"}]
[null,null,null,null,null,null,"Ausgabe Druck",null,"-",{"$f":"IF(J137=FALSE,H143,\"Typ: \"&J139&\"    |    Leistungsaufnahme: \"&J138*1000&\" W\")","v":"Standard nach VDI 4650"},{"$f":"IF(OR(K137=FALSE,K141=K142),H143,\"Typ: \"&K139&\"    |    Leistungsaufnahme: \"&K138*1000&\" W\")","v":"Standard nach VDI 4650"}]
[null,null,null,null,null,null,"Korrekturfaktor Standard",null,1.075,{"$f":"IF(J131<10,1.325,IF(J131>20,1.215,1.275))","v":1.325},{"$f":"IF(K131<10,1.25,IF(K131>20,1.14,1.2))","v":1.25}]
[null,null,null,null,null,null,"Korrekturfaktor Fp",null,{"$f":"IF(I133=FALSE,I141,MIN(I141,1+I134/I132))","v":1.075},{"$f":"IF(AND(J133=FALSE,J137=FALSE),J141,MIN(J141,1+((J134+J138)/J132)))","v":1.325},{"$f":"IF(K137=FALSE,K141,MIN(K141,1+(K138/K132)))","v":1.25}]
[null,null,null,null,null,null,"Text Standard","Standard nach VDI 4650"]
[]
[null,"JAZ-Berechnung"]
[null,"Luft-Wasser-WP",null,null,"Sole-Wasser-WP",null,null,"Wasser-Wasser",null,null,"Warmwasser-WP"]
[null,"Heizleistung A2/W35",null,{"$f":"VLOOKUP($C$34,Leistungsdaten!G:Q,6,FALSE)*R6","v":8.33},"Heizleistung B0/W35",null,{"$f":"D147","v":8.33},"Heizleistung B0/W35",null,{"$f":"D147","v":8.33}]
[null,"Leistungszahl A-7/W35","Leistungszahl B0/W35:",{"$f":"VLOOKUP($C$34,Leistungsdaten!G:O,3,FALSE)","v":2.93},"Leistungszahl B0/W35:","Leistungszahl B0/W35:",{"$f":"D148","v":2.93},"Leistungszahl B0/W35:","Leistungszahl B0/W35:",{"$f":"D148","v":2.93},"Leistungszahl",null,{"$f":"VLOOKUP($E$240,Leistungsdaten!$G$155:$W$200,2,FALSE)","v":{"$error":"#N/A"}}]
[null,"Leistungszahl A2/W35","Leistungszahl B0/W35:",{"$f":"VLOOKUP($C$34,Leistungsdaten!G:O,4,FALSE)","v":4.17},"Korrektur Verdampfer:",null,{"$f":"'Tabellen VDI4650'!J112","v":0.91700000000000004},"Korrektur Verdampfer:",null,{"$f":"IF(B54=FALSE,'Tabellen VDI4650'!J112,'Tabellen VDI4650'!J150)","v":0.91700000000000004},"Korrekturfaktor Prüfstand",null,{"$f":"VLOOKUP($E$240,Leistungsdaten!$G$155:$W$200,4,FALSE)","v":{"$error":"#N/A"}}]
[null,"Leistungszahl A10/W35","Leistungszahl B0/W35:",{"$f":"VLOOKUP($C$34,Leistungsdaten!G:O,5,FALSE)","v":5.16},"Korrektur Verflüssiger:",null,{"$f":"IF(OR(G34=G39,G34=G40,G34=G41,G34=G42),D132,D133)","v":1.0515000000000001},"Korrektur Verflüssiger:",null,{"$f":"IF(OR(G34=G39,G34=G40,G34=G41,G34=G42),E132,E133)","v":1.0515000000000001},"Korrekturfaktor WP-Art",null,{"$f":"VLOOKUP($E$240,Leistungsdaten!$G$155:$W$200,5,FALSE)","v":{"$error":"#N/A"}}]
[null,"Korrekturfaktor F1",null,{"$f":"VLOOKUP($N$6,'Tabellen VDI4650'!B7:K33,10,FALSE)","v":0.109},"Korrektur Quellenpumpe",null,{"$f":"I142","v":1.075},"Korrektur Quellenpumpe",null,{"$f":"IF(B54=FALSE,J142,K142)","v":1.325}]
[null,"Korrekturfaktor F2",null,{"$f":"VLOOKUP($N$6,'Tabellen VDI4650'!B37:K63,10,FALSE)","v":0.626}]
[null,"Korrekturfaktor F3",null,{"$f":"VLOOKUP($N$6,'Tabellen VDI4650'!B67:K93,10,FALSE)","v":0.16}]
[null,"Korrektur Verflüssiger",null,{"$f":"IF(OR(G34=G39,G34=G40,G34=G41,G34=G42),C132,C133)","v":1.0515000000000001}]
[null,"Jahresarbeitszahl HZG (monovalent):",null,{"$f":"D154*(D148*D151+D149*D152+D150*D153)","v":3.9487925850000005},"Jahresarbeitszahl HZG (monovalent):",null,{"$f":"G148*G149*G150/G151","v":2.628075083720931},"Jahresarbeitszahl HZG (monovalent):",null,{"$f":"J148*J149*J150/J151","v":2.132211860377359}]
[null,"Jahresarbeitszahl WWB",null,{"$f":"($D$148*0.103+$D$149*0.903+$D$150*0.061)*$C$134","v":4.472330436},"Jahresarbeitszahl WWB",null,{"$f":"$G$148*VLOOKUP($P$34,'Tabellen VDI4650'!$B$112:$J$137,8,FALSE)*$D$134/$G$151","v":2.628075083720931},"Jahresarbeitszahl WWB",null,{"$f":"IF(B54=FALSE,$J$148*VLOOKUP($P$34,'Tabellen VDI4650'!$B$112:$J$137,8,FALSE)*$E$134/$J$151,$J$148*VLOOKUP($P$34,'Tabellen VDI4650'!B150:I163,8,FALSE)*$E$134/$J$151)","v":2.132211860377359},"Jahresarbeitszahl WWB",null,{"$f":"M148*M149*M150","v":{"$error":"#N/A"}}]
[]
[null,"JAZ-Heizung (monovalent)",null,null,{"$f":"IF(B34=B37,D155,IF(B34=B38,G155,J155))","v":3.9487925850000005}]
[null,"JAZ-Heizung (mit Deckungsanteil)",null,null,{"$f":"1/((Q34/E158)+1-Q34)","v":3.7288787828928349}]
[null,"JAZ-Warmwasserbereitung",null,null,{"$f":"IF(OR(L34=L40,L34=L41,L34=L42,L34=L43,D6=D10),1,IF(L34=L37,IF(B34=B37,D156,IF(B34=B38,G156,J156)),M156))","v":4.472330436}]
[null,"JAZ-Gesamt",null,null,{"$f":"IF(OR(L34=L40,L34=L41,L34=L42,L34=L43,D6=D10),E159,ROUND(1/(((1-R34)*Q34/E158+R34*Q34/E160+1-Q34)),2))","v":3.8}]
[]
[]
[]
[null,"Basisförderung WP",null,"Wahr/falsch","Ausgabetext wenn falsch",null,null,"Basisförderung Solar",null,"Wahr/falsch","Ausgabetext wenn falsch",null,null,"Kombibonus Solar",null,"Wahr/falsch","Ausgabetext wenn falsch",null,null,"Innovationsförderung Solar",null,"Wahr/falsch","Ausgabetext wenn falsch",null,null,"Innovationsförderung Wärmepumpe",null,"Wahr/falsch","Ausgabetext wenn falsch",null,null,"Effizienzbonus",null,"Wahr/falsch","Ausgabetext wenn falsch",null,null,"Bonus Lastmanagementfähigkeit",null,"Wahr/falsch","Ausgabetext wenn falsch",null,null,"Bonus Qualitätscheck",null,"Wahr/falsch","Ausgabetext wenn falsch",null,null,"Bonus Optimierung Heizung",null,"Wahr/falsch","Ausgabetext wenn falsch",null,null,"Bonus Austausch Heizung APEE",null,"Wahr/falsch","Ausgabetext wenn falsch"]
[null,"Altbau ?",null,{"$f":"IF($H$27=TRUE,FALSE,TRUE)","v":true},"Als Gebäudetyp wurde 'Neubau' angegeben. Die Wärmepumpen-Basisförderung wird nur für Bestandsgebäude gewährt.",null,null,"Altbau gewählt ?",null,{"$f":"IF(G6=G10,TRUE,FALSE)","v":true},"Die Basisförderung für Solaranlagen wird nur für Bestandsgebäude gewährt. Der Neubaubereich ist von der Förderung ausgeschlossen.",null,null,"Neubau Brennwertkessel ?",null,{"$f":"IF(AND(F27=2,OR(D61=D64,D61=D65)),IF(H27=TRUE,FALSE,TRUE),TRUE)","v":true},"Der Kombinationsbonus für Brennwertkessel wird nur gewährt, wenn in Bestandsgebäuden ein Altgerät ohne Brennwertnutzung getauscht wird.",null,null,null,null,null,null,null,null,null,null,null,null,null,null,"Bestandsgebäude gewählt ?",null,{"$f":"IF($H$27=TRUE,FALSE,TRUE)","v":true},"Als Gebäudetyp wurde 'Neubau' angegeben. Der Effizienzbonus wird nur für Bestandsgebäude gewährt."]
[null,"Wärmepumpe gewählt ?",null,{"$f":"IF(OR($F$27=2,$F$27=0),FALSE,TRUE)","v":true},"Es wurde keine Wärmepumpe im Menüpunkt 'Gebäude' ausgewählt.",null,null,"Solar gewählt ?",null,{"$f":"IF(OR($F$27=1,F27=0),FALSE,TRUE)","v":false},"Es wurde keine Solaranlage im Menüpunkt 'Gebäude' ausgewählt.",null,null,"Solar gewählt ?",null,{"$f":"IF(OR($F$27=1,F27=0),FALSE,TRUE)","v":false},"Der Kombinationsbonus Solar wird nur in Verbindung mit einer Thermischen Solaranlage gewährt. Es wurde keine Solaranlage im Menüpunkt 'Gebäude' ausgewählt.",null,null,"Solar gewählt ?",null,{"$f":"IF(OR($F$27=1,F27=0),FALSE,TRUE)","v":false},"Der Innovationsförderung wird nur in Verbindung mit einer Thermischen Solaranlage gewährt. Es wurde keine Solaranlage im Menüpunkt 'Gebäude' ausgewählt.",null,null,"Wärmepumpe gewählt ?",null,{"$f":"IF(OR($F$27=2,$F$27=0),FALSE,TRUE)","v":true},"Es wurde keine Wärmepumpe im Menüpunkt 'Gebäude' ausgewählt.",null,null,"Wohngebäude gewählt?",null,{"$f":"IF(D6=D9,TRUE,FALSE)","v":true},"Der Effizienzbonus wird nur für Wohngebäude gewährt.",null,null,"Wärmepumpe gewählt?",null,{"$f":"IF(OR(F27=2,F27=0),FALSE,TRUE)","v":true},"Es wurde keine Wärmepumpe im Menüpunkt 'Gebäude' ausgewählt.",null,null,"Wärmepumpe gewählt?",null,{"$f":"IF(OR(F27=2,F27=0),FALSE,TRUE)","v":true},"Es wurde keine Wärmepumpe im Menüpunkt 'Gebäude' ausgewählt.",null,null,"Wärmepumpe gewählt?",null,{"$f":"IF(OR(F27=2,F27=0),FALSE,TRUE)","v":true},"Es wurde keine Wärmepumpe im Menüpunkt 'Gebäude' ausgewählt.",null,null,"Öl-Gaskessel alt gewählt?",null,{"$f":"IF(OR(J6=J9,J6=J10),TRUE,FALSE)","v":true},"Die alte Heizungsanlage muss auf Basis fossiler Energien (z. B. Gas oder Öl) betrieben worden sein und diese darf keine Brennwerttechnik genutzt haben."]
[null,"JAZ-Min erreicht ?",null,{"$f":"IF(ROUND($D$205,1)>=$D$206,TRUE,FALSE)","v":true},{"$f":"\"Als Fördervoraussetzung ist eine Mindest-Jahresarbeitszahl von \"&D206&\" festgesetzt. Diese wird mit dem gewählten System nicht erreicht.\"","v":"Als Fördervoraussetzung ist eine Mindest-Jahresarbeitszahl von 3,5 festgesetzt. Diese wird mit dem gewählten System nicht erreicht."},null,null,"Fläche Erstinstallation WWB erreicht ?",null,{"$f":"IF(G61=G65,TRUE,IF(H61=H64,TRUE,IF(I61>=3,TRUE,FALSE)))","v":true},"Die Basisförderung für die Erstinstallation einer Thermischen Solaranlagen zur Warmwasserbereitung wird erst ab einer Mindest-Kollektorfläche von 3,0 m² gewährt.",null,null,"Kesseltausch ?",null,{"$f":"IF(AND(D79=TRUE,E61=E65),FALSE,TRUE)","v":true},"Es wurde kein Kesseltausch vorgenommen. Der Kombinationsbonus ist nur bei Austausch eines Heizkessels ohne Brennwertnutzung gegen einen Brennwertkessel möglich.",null,null,"20 - 100 m² Kollektorfläche ?",null,{"$f":"IF(I61>20,TRUE,FALSE)","v":false},"Die Innovationsförderung wird nur für Solaranlagen > 20 m² Kollektorfläche gewährt.",null,null,"JAZ-Min erreicht ?",null,{"$f":"IF(ROUND($P$205,1)>=$P$206,TRUE,FALSE)","v":false},{"$f":"\"Als Fördervoraussetzung ist eine Mindest-Jahresarbeitszahl von \"&P206&\" festgesetzt. Diese wird mit dem gewählten System nicht erreicht.\"","v":"Als Fördervoraussetzung ist eine Mindest-Jahresarbeitszahl von 4,5 festgesetzt. Diese wird mit dem gewählten System nicht erreicht."},null,null,"HT 30% unter EnEV?",null,{"$f":"IF(L6>70,FALSE,TRUE)","v":false},"Zur Gewährung des Effizienzbonus muss der Transmissionswärmeverlust des Gebäudes min. 30% unter den Vorgaben der EnEV 2014 liegen. Für den unter 'Gebäude' gewählten Dämmstandard trifft dies nicht zu.",null,null,"Wärmepumpe förderfähig?",null,{"$f":"IF(OR(D181=TRUE,AB181=TRUE),TRUE,FALSE)","v":true},"Der Bonus für Lastmanagementfähigkeit kann nicht gewährt werden, da für die gewählte Wärmepumpe keine Basisförderung gewährt wird.",null,null,"Wärmepumpe förderfähig?",null,{"$f":"IF(AND(D181=FALSE,AB181=FALSE),FALSE,TRUE)","v":true},"Der Optimierungsbonus kann nicht gewährt werden, da die gewählte Wärmepumpe nicht förderfähig ist.",null,null,"Wärmepumpe förderfähig?",null,{"$f":"IF(AND(D181=FALSE,AB181=FALSE),FALSE,TRUE)","v":true},"Der Optimierungsbonus kann nicht gewährt werden, da die gewählte Wärmepumpe nicht förderfähig ist.",null,null,"Heizungsoptimierung gewählt)",null,{"$f":"O54","v":false},"Zur Gewährung des Bonus müssen zusätzlich zum Austausch des alten Heizkessels Optimieriungen am Heizungssystem vorgenommen werden."]
[null,null,null,null,null,null,null,"Fläche Erstinstallation WWB erreicht ?",null,{"$f":"IF(G61=G65,TRUE,IF(H61=H65,TRUE,IF(I61>=9,TRUE,FALSE)))","v":true},"Die Basisförderung für die Erstinstallation einer Thermischen Solaranlagen zur kombinierten Warmwasserbereitung und Heizungsunterstützung wird erst ab einer Mindest-Kollektorfläche von 9,0 m² gewährt.",null,null,"Biomasse/WP gewählt ?",null,{"$f":"IF(F27=3,TRUE,IF(AND(F27=2,D61=D66),TRUE,FALSE))","v":false},"Für die Gewährung des Kombinationsbonus muss neben der Solaranlage auch ein förderfähiger Biomassekessel oder eine Wärmepumpe installiert werden.",null,null,"Neusinstalltion Solaranlage ?",null,{"$f":"IF(G61=G65,FALSE,TRUE)","v":true},"Der Innovationsbonus wird nur bei Erstinstallation einer Solaranlage gewährt. Die Erweiterung bereits bestehender Anlagen wird nicht gefördert.",null,null,null,null,null,null,null,null,"Basisförderung Solar/WP/Pellets erreicht ?",null,{"$f":"IF(D181=TRUE,TRUE,IF(J181=TRUE,TRUE,IF(AB181=TRUE,TRUE,IF(AND(F27=2,D61=D66),TRUE,FALSE))))","v":true},"Der Effizienzbonus kann nicht gewährt werden, da die gewählte Solaranlage/Wärmepumpe nicht förderfähig und auch kein förderfähiger Biomassekessel zum Einsatz kommt.",null,null,"Wurde ein Puffer ausgewählt?",null,{"$f":"IF(C240>0,TRUE,FALSE)","v":true},"Es wurde kein neuer Pufferspeicher ausgewählt. Für den Bonus werden mind. 30 Liter/KW neu errichtetes Puffervolumen gefordert.",null,null,"Qualitätscheck angehakt",null,{"$f":"E54","v":true},"Die Durchführung des Qualitätschecks nach einem Betriebsjahr wurde nicht angewählt.",null,null,"Heizungsoptimierung angehakt",null,{"$f":"O54","v":false},"Es wurden im Bereich 'Gebäude' keine Optimierungsmaßnahmen an der Heizungsanlage gewählt.",null,null,"Förderfähige WP oder Solar?",null,{"$f":"IF(SUM(F223:F230)=0,FALSE,TRUE)","v":true},"Der Austauschbonus kann nicht gewährt werden, da keine förderfähige Wärmepumpe oder Solaranlage gewählt wurde."]
[null,"Leistung< 100 KW",null,{"$f":"IF($D$207>100,FALSE,TRUE)","v":true},"Die Heizleistung der gewählten Wärmepumpenanlage ist größer als 100 KW. Das Marktanreizprogramm ist auf Wärmepumpen-Anlagen bis 100 KW begrenzt.",null,null,"Mindestfläche Erweiterung erreicht ?",null,{"$f":"IF(G61=G64,TRUE,IF(I61>=4,TRUE,FALSE))","v":true},"Die Basisförderung für die Erweiterung einer bestehenden Thermischen Solaranlagen wird erst ab einer Kollektorfläche von mind. 4,0 m² gewährt.",null,null,"Wärmepumpe förderfähig ?",null,{"$f":"IF(F27=2,TRUE,IF(OR(D181=TRUE,AB181=TRUE),TRUE,FALSE))","v":true},"Der Kombinationsbonus Solar kann nicht gewährt werden, da die gewählte Wärmepumpe nicht förderfähig ist.",null,null,"Nichtwohngebäude > 500 m² ?",null,{"$f":"IF(D27=TRUE,TRUE,IF(I6=I9,FALSE,TRUE))","v":true},"Die Innovationsförderung wird bei Nichtwohngebäuden nur für Nutzflächen > 500 m² gewährt.",null,null,"Leistung< 100 KW",null,{"$f":"IF($D$207>100,FALSE,TRUE)","v":true},"Die Heizleistung der gewählten Wärmepumpenanlage ist größer als 100 KW. Das Marktanreizprogramm ist auf Wärmepumpen-Anlagen bis 100 KW begrenzt.",null,null,"Bonus Solar nur bei Neuanlage",null,{"$f":"IF(AND(F27=2,G61=G65),FALSE,TRUE)","v":true},"Der Effizienzbonus wird nur bei Erstinstallation einer Solaranlage gewährt. Die Erweiterung bereits bestehender Anlagen wird nicht gefördert.",null,null,"Mind. 30 l/KW erreicht ?",null,{"$f":"IF(H240<30,FALSE,TRUE)","v":true},"Der Bonus für Lastmanagementfähigkeit kann nicht gewährt werden, da das geforderte Mindestvolumen von 30 Liter/KW nicht erreicht wird.",null,null,"Keine Innovationsförderung?",null,true,"Der Wärmepumpen-Qualitätscheck nach einem Betriebsjahr ist Fördervoraussetzung für die Gewährung der Innovationsförderung und wird daher nicht extra vergütet.",null,null,"Bestandsgebäude?",null,{"$f":"IF($H$27=TRUE,FALSE,TRUE)","v":true},"Als Gebäudetyp wurde 'Neubau' angegeben. Optimierungsmaßnahmen an der Heizungsanlage sind nur in Bestandsgebäuden förderfähig.",null,null,"Mehr als Optimierungsbonus?",null,{"$f":"IF(MIN(D224/2,0.1*U6)>=D231,FALSE,TRUE)","v":true},"Der Bonus für die Optimierung der Heizungsanlage fällt höher aus als der Bonus für den Heizkesseltausch, daher wird der Optimierungsbonus in Ansatz gebracht (beide sind nicht miteinander kumulierbar)"]
[null,"WMZ eingebaut ?",null,{"$f":"$W$38","v":true},"Fördervoraussetzung ist die Messung aller von der Wärmepumpe abgegebenen Wärmemengen. Bei der gewählten Anlage ist kein Wärmemengenzähler enthalten.",null,null,"Solare HU gewählt ?",null,true,"Die Basisförderung für Thermische Solaranlagen wird nur für die kombinierte solare Warmwasserbereitung und Heizungsunterstützung gewährt.",null,null,"Neuinstallation Solaranlage ?",null,{"$f":"IF(G61=G65,FALSE,TRUE)","v":true},"Der Kombinationsbonus Solar wird nur bei Erstinstallation einer Solaranlage gewährt. Die Erweiterung bereits bestehender Anlagen wird nicht gefördert.",null,null,"Wohngebäude mit drei WE oder HAT' < 70 ?",null,{"$f":"IF(D27=FALSE,TRUE,IF(OR(H6=H11,H6=H12),TRUE,IF(L6>70,FALSE,TRUE)))","v":false},"Für Ein- und Zweifamilienhäuser wird die Innovationsförderung nur gewährt wenn der Transmissionswärmeverlust des Gebäudes mind. 30% unter dem Referenzwert nach Energieeinsparverordnung liegt (KfW55).",null,null,"WMZ eingebaut ?",null,{"$f":"$W$38","v":true},"Fördervoraussetzung ist die Messung aller von der Wärmepumpe abgegebenen Wärmemengen. Bei der gewählten Anlage ist kein Wärmemengenzähler enthalten.",null,null,null,null,null,null,null,null,"Ist WP SG-ready ?",null,{"$f":"F54","v":true},"Die gewählte Wärmepumpe ist nicht lastmanagementfähig, d.h. sie wurde bisher nicht als 'Smart Grid Ready'-zertifiziert.",null,null,"Bestandsgebäude ?",null,{"$f":"IF($H$27=TRUE,FALSE,TRUE)","v":true},"Als Gebäudetyp wurde 'Neubau' angegeben. Optimierungsmaßnahmen an der Heizungsanlage sind nur in Bestandsgebäuden förderfähig.",null,null,"Mehr als APEE-Bonus?",null,{"$f":"IF(BF181=FALSE,TRUE,IF(MIN(D224/2,0.1*U6)>D231,TRUE,FALSE))","v":true},"Der Bonus für den Heizkesseltausch fällt höher aus als der Bonus für die Optimierung der Heizungsanlage, daher wird der Heizungstauschbonus (APEE) in Ansatz gebracht (beide sind nicht miteinander kumulierbar)"]
[null,"Platzhalter EC-Pumpe eingebaut ?",null,{"$f":"$J$54","v":true},"Für die gewählte Heizungsanlage wurde keine Effizienzpumpe gewählt. Seit dem 01.09.2011 sind Wärmepumpen nur dann förderfähig, wenn mindestens eine Umwälzpumpe der Effizienzklasse A im Heizkreis eingebunden ist.",null,null,null,null,null,null,null,null,"Förderung Solar erreicht ?",null,{"$f":"IF(OR(J181=TRUE,V181=TRUE),TRUE,FALSE)","v":false},"Der Kombinationsbonus Solar kann nicht gewährt werden, da die gewählte Solaranlage nicht förderfähig ist.",null,null,null,null,null,null,null,null,"Platzhalter EC-Pumpe eingebaut ?",null,{"$f":"$J$54","v":true},"Für die gewählte Heizungsanlage wurde keine Effizienzpumpe gewählt. Seit dem 01.09.2011 sind Wärmepumpen nur dann förderfähig, wenn mindestens eine Umwälzpumpe der Effizienzklasse A im Heizkreis eingebunden ist."]
[null,"Mit WWB ?",null,{"$f":"IF(OR($R$34=0,$L$34=$L$42,$L$34=$L$43),(IF($D$6=$D$9,FALSE,TRUE)),TRUE)","v":true},"In Wohngebäuden werden nur Wärmepumpenanlagen zur kombinierten Heizung und Warmwasserbereitung gefördert. Im gewählten System wird die Wärmepumpe ausschließlich zur Raumheizung eingesetzt.",null,null,null,null,null,null,null,null,null,null,null,null,null,null,null,null,null,null,null,null,"Mit WWB ?",null,{"$f":"IF(OR($R$34=0,$L$34=$L$42,$L$34=$L$43),(IF($D$6=$D$9,FALSE,TRUE)),TRUE)","v":true},"In Wohngebäuden werden nur Wärmepumpenanlagen zur kombinierten Heizung und Warmwasserbereitung gefördert. Im gewählten System wird die Wärmepumpe ausschließlich zur Raumheizung eingesetzt."]
[null,"In Bafa-Liste vorhanden ?",null,{"$f":"VLOOKUP($C$34,Leistungsdaten!$G:$W,17,FALSE)","v":true},"Die gewählte Wärmepumpe ist bislang nicht in der BAFA-Liste förderfähiger Wärmepumpen aufgeführt. Daher kann keine Förderung gewährt werden.",null,null,null,null,null,null,null,null,null,null,null,null,null,null,null,null,null,null,null,null,"In Bafa-Liste vorhanden ?",null,{"$f":"VLOOKUP($C$34,Leistungsdaten!$G:$W,17,FALSE)","v":true},"Die gewählte Wärmepumpe ist nicht in der BAFA-Liste förderfähiger Wärmepumpen aufgeführt. Daher kann keine Förderung gewährt werden."]
[null,null,null,null,null,null,null,null,null,null,null,null,null,null,null,null,null,null,null,null,null,null,null,null,null,"Qualitätscheck mit ISG gewählt ?",null,{"$f":"E54","v":true},"Fördervoraussetzung ist die Durchführung eines Qualitätschecks der Wärmepumpe nach Ablauf eines Jahres nach Inbetriebnahme. Bitte wählen Sie diese Option an."]
[null,null,null,null,null,null,null,null,null,null,null,null,null,null,null,null,null,null,null,null,null,null,null,null,null,"FBH gewählt ?",null,{"$f":"IF(OR(G34=G39,G34=G40,G34=G41,G34=G42),TRUE,FALSE)","v":false},"Die Innovationsförderung wird nur in Verbindung mit Flächenheizsystemen (z.B. Fußbodenheizung) gewährt. Bei kombinierten Verteilsystemen (zb. Fußbodenheizung und Radiatoren) muss die Flächenheizung einen Anteil von über 50% haben."]
[]
[]
[]
[]
[null,"Basisförderung WP erreicht ?",null,{"$f":"IF(COUNTIF(D166:D180,FALSE)>0,FALSE,TRUE)","v":true},{"$f":"VLOOKUP(FALSE,D166:F180,2,FALSE)","v":{"$error":"#N/A"}},null,null,"Basisförderung erreicht ?",null,{"$f":"IF(COUNTIF(J166:J180,FALSE)>0,FALSE,TRUE)","v":false},{"$f":"VLOOKUP(FALSE,J166:L180,2,FALSE)","v":"Es wurde keine Solaranlage im Menüpunkt 'Gebäude' ausgewählt."},null,null,"Erreicht",null,{"$f":"IF(COUNTIF(P166:P180,FALSE)>0,FALSE,TRUE)","v":false},{"$f":"VLOOKUP(FALSE,P166:R180,2,FALSE)","v":"Der Kombinationsbonus Solar wird nur in Verbindung mit einer Thermischen Solaranlage gewährt. Es wurde keine Solaranlage im Menüpunkt 'Gebäude' ausgewählt."},null,null,"Erreicht",null,{"$f":"IF(COUNTIF(V166:V180,FALSE)>0,FALSE,TRUE)","v":false},{"$f":"VLOOKUP(FALSE,V166:X180,2,FALSE)","v":"Der Innovationsförderung wird nur in Verbindung mit einer Thermischen Solaranlage gewährt. Es wurde keine Solaranlage im Menüpunkt 'Gebäude' ausgewählt."},null,null,"Erreicht",null,{"$f":"IF(COUNTIF(AB166:AB180,FALSE)>0,FALSE,TRUE)","v":false},{"$f":"VLOOKUP(FALSE,AB166:AD180,2,FALSE)","v":"Als Fördervoraussetzung ist eine Mindest-Jahresarbeitszahl von 4,5 festgesetzt. Diese wird mit dem gewählten System nicht erreicht."},null,null,"Erreicht",null,{"$f":"IF(COUNTIF(AH166:AH180,FALSE)>0,FALSE,TRUE)","v":false},{"$f":"VLOOKUP(FALSE,AH166:AJ180,2,FALSE)","v":"Zur Gewährung des Effizienzbonus muss der Transmissionswärmeverlust des Gebäudes min. 30% unter den Vorgaben der EnEV 2014 liegen. Für den unter 'Gebäude' gewählten Dämmstandard trifft dies nicht zu."},null,null,"Erreicht",null,{"$f":"IF(COUNTIF(AN166:AN180,FALSE)>0,FALSE,TRUE)","v":true},{"$f":"VLOOKUP(FALSE,AN166:AP180,2,FALSE)","v":{"$error":"#N/A"}},null,null,"Erreicht",null,{"$f":"IF(COUNTIF(AT166:AT180,FALSE)>0,FALSE,TRUE)","v":true},{"$f":"VLOOKUP(FALSE,AT166:AV180,2,FALSE)","v":{"$error":"#N/A"}},null,null,"Erreicht",null,{"$f":"IF(COUNTIF(AZ166:AZ180,FALSE)>0,FALSE,TRUE)","v":false},{"$f":"VLOOKUP(FALSE,AZ166:BB180,2,FALSE)","v":"Es wurden im Bereich 'Gebäude' keine Optimierungsmaßnahmen an der Heizungsanlage gewählt."},null,null,"Erreicht",null,{"$f":"IF(COUNTIF(BF166:BF180,FALSE)>0,FALSE,TRUE)","v":false},{"$f":"VLOOKUP(FALSE,BF166:BH180,2,FALSE)","v":"Zur Gewährung des Bonus müssen zusätzlich zum Austausch des alten Heizkessels Optimieriungen am Heizungssystem vorgenommen werden."}]
[]
[]
[]
[]
[]
[]
[]
[]
[]
[]
[]
[]
[]
[]
[]
[]
[]
[]
[]
[]
[]
[null,null,null,null,null,"! Werte werden auch in Ausdruck übernommen, also nicht dran rumfingern"]
[null,"Berechnung Basisförderung WP",null,null,null,"Textfelder","Wärmepumpe",null,"Solar",null,"Gesamtübersicht",null,null,"Berechnung Innovationsförderung WP"]
[null,"JAZ-Ist",null,{"$f":"FIXED(E161,2)*1","v":3.8},null,null,"Beschreibung","Wert","Beschreibung","Wert","Beschreibung","Wert",null,"JAZ-Ist",null,{"$f":"D205","v":3.8}]
[null,"JAZ-Soll",null,{"$f":"IF(B34=B37,3.5,IF(D6=D9,3.8,4))","v":3.5},null,"Zeile 1",{"$f":"IF($B$34=$B$37,\"Heizleistung A2/W35\",IF(B54=TRUE,\"Heizleistung B10/W35\",\"Heizleistung B0/W35\"))","v":"Heizleistung A2/W35"},{"$f":"IF(ISERROR(D147),\"---\",FIXED(D147,2)&\" KW\")","v":"8,33 KW"},"Ausführung",{"$f":"VLOOKUP(B61,Leistungsdaten!G:O,4,FALSE)","v":"Aufdach"},"Bonus Wärmepumpen-Qualitätscheck",{"$f":"IF(E223=FALSE,\"-\",FIXED(F223,0)&\" €\")","v":"250 €"},null,"JAZ-Soll",null,4.5]
[null,"Heizleistung in KW",null,{"$f":"D147","v":8.33},null,"Zeile 2",{"$f":"IF($B$34=$B$37,\"Leistungszahl A-7/W35\",IF(B54=TRUE,\"Leistungszahl B10/W35\",\"Leistungszahl B0/W35\"))","v":"Leistungszahl A-7/W35"},{"$f":"IF($B$34=$B$37,FIXED(D148,2),FIXED(G148,2))","v":"2,93"},"Kollektorfläche",{"$f":"FIXED(VLOOKUP(B61,Leistungsdaten!G:O,2,FALSE),2)&\" m²\"","v":"2,55 m²"},"Basisförderung Wärmepumpe",{"$f":"IF(E224=FALSE,\"-\",FIXED(F224,0)&\" €\")","v":"1.500 €"},null,"Förderung Basis",null,{"$f":"D211","v":1500}]
[null,"Luft-Wasser",null,{"$f":"MAX(D207*40,IF(OR(D54=TRUE,D34=D37),1500,1300))","v":1500},null,"Zeile 3",{"$f":"IF($B$34=$B$37,\"Leistungszahl A2/W35\",IF(B54=TRUE,\"Leistungszahl B10/W35\",\"Leistungszahl B0/W35\"))","v":"Leistungszahl A2/W35"},{"$f":"IF($B$34=$B$37,FIXED(D149,2),FIXED(G148,2))","v":"4,17"},"Wirkungsgrad",{"$f":"VLOOKUP(B61,Leistungsdaten!G:O,3,FALSE)","v":"82,3 %"},"Basisförderung Solaranlage",{"$f":"IF(E225=FALSE,\"-\",FIXED(D225,0)&\" €\")","v":"-"},null,"Förderung Altbau",null,{"$f":"P207*0.5","v":750}]
[null,"Sole-Wasser",null,{"$f":"MAX(D207*100,IF(H34=H37,4500,4000))","v":4500},null,"Zeile 4",{"$f":"IF($B$34=$B$37,\"Leistungszahl A10/W35\",\"\")","v":"Leistungszahl A10/W35"},{"$f":"IF($B$34=$B$37,FIXED(D150,2),\"\")","v":"5,16"},"Gesamtfläche",{"$f":"FIXED(I61,2)&\" m²\"","v":"10,20 m²"},"Bonus für Lastmanagementfähigkeit",{"$f":"IF(E230=FALSE,\"-\",FIXED(D230,0)&\" €\")","v":"500 €"},null,"Förderung Neubau",null,{"$f":"P207","v":1500}]
[null,"Wasser-Wasser",null,{"$f":"MAX(D207*100,4000)","v":4000},null,"Zeile 5",{"$f":"IF(B34<>B37,\"\",\"Jahresarbeitszahl Soll\")","v":"Jahresarbeitszahl Soll"},{"$f":"IF(B34<>B37,\"\",FIXED(D206,2))","v":"3,50"},null,null,"Kombinationsbonus Solar",{"$f":"IF(E226=FALSE,\"-\",FIXED(D226,0)&\" €\")","v":"-"}]
[null,"Basisförderung",null,{"$f":"IF(B34=B37,D208,IF(B34=B38,D209,D210))","v":1500},null,"Zeile 6",{"$f":"IF(B34<>B37,\"\",\"Jahresarbeitszahl Ist\")","v":"Jahresarbeitszahl Ist"},{"$f":"IF(ISERROR(D205),\"---\",IF(B34<>B37,\"\",FIXED(D205,2)))","v":"3,80"},null,null,"Innovationsförderung Solar",{"$f":"IF(E227=FALSE,\"-\",FIXED(D227,0)&\" €\")","v":"-"},null,"Innovationsförderung WP",null,{"$f":"IF(H27=TRUE,P209,P208)","v":750}]
[null,null,null,null,null,"Zeile 7","Jahresarbeitszahl Soll",{"$f":"IF(ISERROR(D206),\"---\",IF(H27=TRUE,FIXED(P206,1),FIXED(D206,1)))","v":"3,5"},null,null,"Innovationsförderung Wärmepumpe",{"$f":"IF(E228=FALSE,\"-\",FIXED(D228,0)&\" €\")","v":"-"}]
[null,null,null,null,null,"Zeile 8","Jahresarbeitszahl Ist",{"$f":"IF(ISERROR(D205),\"---\",FIXED(D205,1))","v":"3,8"},null,null,"Gebäudeeffizienzbonus",{"$f":"IF(E229=FALSE,\"-\",FIXED(D229,0)&\" €\")","v":"-"}]
[null,null,null,null,null,"Zeile 9",null,null,null,null,"Bonus Heizungsaustausch (APEE)",{"$f":"IF(E231=FALSE,\"-\",FIXED(D231,0)&\" €\")","v":"-"}]
[null,null,null,null,null,"Zeile 10",null,null,null,null,"Optimierungsbonus Heizungsanlage",{"$f":"IF(E232=FALSE,\"-\",FIXED(D222,0)&\" €\")","v":"500 €"}]
[null,null,null,null,null,"Zeile 11",null,null,null,null,"Max. Fördersumme",{"$f":"IF(F232=0,\"0 €\",FIXED(F232,0)&\" €\")","v":"2.250 €"}]
[null,null,null,null,null,"Zeile 12",null,null,null,null,"Sternchentext Optimierung Heizung",{"$f":"IF(OR(E222=FALSE,E231=TRUE),\"Gemäß Richtlinien zur Förderung von Maßnahmen zur Nutzung erneuerbarer Energien im Wärmemarkt vom 11. März 2015. Irrtum und Technische Änderungen vorbehalten.\",\"* 10% der Investitionskosten für Heizungsoptimierung, max. 50% Basisförderung Irrtum und Technische Änderungen vorbehalten.\")","v":"Gemäß Richtlinien zur Förderung von Maßnahmen zur Nutzung erneuerbarer Energien im Wärmemarkt vom 11. März 2015. Irrtum und Technische Änderungen vorbehalten."}]
[]
[]
[]
[null,"Förderbeträge",null,"Betrag","Gewährt ?","Gewährt"]
[null,"Bonus Heizungsoptimierung",null,{"$f":"MIN(D224/2,0.1*U6)","v":500},{"$f":"AZ181","v":false},{"$f":"IF(E222=TRUE,D222,0)","v":0}]
[null,"Bonus Qualitätscheck WP",null,250,{"$f":"AT181","v":true},{"$f":"IF(E223=TRUE,D223,0)","v":250}]
[null,"Basisförderung WP",null,{"$f":"D211","v":1500},{"$f":"D181","v":true},{"$f":"IF(E224=TRUE,D224,0)","v":1500}]
[null,"Basisförderung Solar",null,{"$f":"IF(F227>0,0,K61)","v":2000},{"$f":"J181","v":false},0]
[null,"Kombinationsbonus Solar",null,500,{"$f":"P181","v":false},0]
[null,"Innovationsförderung Solar",null,{"$f":"L61","v":0},{"$f":"V181","v":false},0]
[null,"Innovationsförderung Wärmepumpe",null,{"$f":"P211","v":750},{"$f":"AB181","v":false},0]
[null,"Effizienzbonus",null,{"$f":"0.5*(F224+F225+F227+F228)","v":750},{"$f":"AH181","v":false},0]
[null,"Bonus Lastmanagementfähigkeit",null,500,{"$f":"AN181","v":true},{"$f":"IF(E230=TRUE,D230,0)","v":500}]
[null,"Bonus Heizungstausch APEE",null,{"$f":"ROUND(SUM(F223:F230)*0.2+600,0)","v":1050},{"$f":"BF181","v":false},{"$f":"IF(E231=TRUE,D231,0)","v":0}]
[null,"Gesamtförderung (€)",null,null,true,{"$f":"SUM(F222:F231)","v":2250}]
[null,null,null,"Bei Änderung auch Werte im Ausdruck ändern !!"]
[]
[]
[]
[null,"Übersicht Speichervolumen",null,null,null,null,null,null,null,null,"Nebenrechnung TypWarmwasser"]
[null,"Combobox","Inhalt Puffer","Kombispeicher ?","Combobox WW","Inhalt WW","Gesamtinhalt","Spez. Volumen","Name STE","Name TEC",null,null,null,null,null,null,null,null,"Nebenrechnung Größe WW-Speicher",null,null,"Nebenrechnung WW-Wärmepumpe Manuell"]
[null,null,null,null,null,null,null,null,null,null,"Auswahl","WWB in WP integriert","Puffer SBS gewählt","Mit Heizungs-WP","Mit WW-WP","Mit Abluft-WP","Ohne/Sonstige"]
[null,"SBP 200",{"$f":"VLOOKUP(B240,B242:H262,2,FALSE)","v":200},{"$f":"VLOOKUP(B240,B242:H262,3,FALSE)","v":false},"Warmwasserspeicher 300 Liter",{"$f":"K253","v":300},{"$f":"C240+F240","v":500},{"$f":"G240/D207","v":60.024009603841534}]
[null,null,null,null,null,null,null,null,null,null,null,null,null,null,null,null,null,null,null,null,null,"Manuell gewählt?",{"$f":"IF(OR($E$240=Leistungsdaten!$G$199,$E$240=Leistungsdaten!$G$200),TRUE,FALSE)","v":false}]
[null,null,null,null,null,null,null,null,null,null,{"$f":"IF($L$54=TRUE,L242,IF($D$240=TRUE,M242,IF($L$34=$L$37,N242,IF($L$34=$L$38,O242,IF($L$34=$L$39,P242,Q242)))))","v":"Warmwasserspeicher 300 Liter"},{"$f":"\"Integriert \"&VLOOKUP(C34,Leistungsdaten!G:AH,28,FALSE)&\" Liter\"","v":"Integriert 0 Liter"},{"$f":"B240","v":"SBP 200"},"Warmwasserspeicher 300 Liter",{"$f":"Leistungsdaten!G155","v":"WWK 220 electronic"},{"$f":"Leistungsdaten!G162","v":"LWA 252"},{"$f":"B27","v":"Angabe wird nicht benötigt"},null,{"$f":"N242","v":"Warmwasserspeicher 300 Liter"},300,null,"Hersteller","STIEBEL ELTRON GmbH & Co. KG"]
[null,{"$f":"IF($G$269=1,I243,J243)","v":"Ohne Puffer"},0,false,{"$f":"L242","v":"Integriert 0 Liter"},0,null,null,"Ohne Puffer","Ohne Puffer",{"$f":"IF($L$54=TRUE,L243,IF($D$240=TRUE,M243,IF($L$34=$L$37,N243,IF($L$34=$L$38,O243,IF($L$34=$L$39,P243,Q243)))))","v":"Warmwasserspeicher 400 Liter"},null,null,"Warmwasserspeicher 400 Liter",{"$f":"Leistungsdaten!G156","v":"WWK 300 electronic"},{"$f":"Leistungsdaten!G163","v":"LWA 100"},null,null,{"$f":"N243","v":"Warmwasserspeicher 400 Liter"},400,null,"Bezeichnung","WWK 222"]
[null,{"$f":"IF($G$269=1,I244,J244)","v":"Vorhandener Puffer"},0,false,null,0,null,null,"Vorhandener Puffer","Vorhandener Puffer",{"$f":"IF($L$54=TRUE,L244,IF($D$240=TRUE,M244,IF($L$34=$L$37,N244,IF($L$34=$L$38,O244,IF($L$34=$L$39,P244,Q244)))))","v":"Warmwasserspeicher 500 Liter"},null,null,"Warmwasserspeicher 500 Liter",{"$f":"Leistungsdaten!G157","v":"WWK 300 electronic SOL"},{"$f":"Leistungsdaten!G200","v":"Eigene Abluft-Wärmepumpe"},null,null,"Warmwasserspeicher 500 Liter",500,null,"COP","3,4"]
[null,"Hydraulische Weiche",0,false,null,0,null,null,"Hydraulische Weiche","Hydraulische Weiche",{"$f":"IF($L$54=TRUE,L245,IF($D$240=TRUE,M245,IF($L$34=$L$37,N245,IF($L$34=$L$38,O245,IF($L$34=$L$39,P245,Q245)))))","v":"Warmwasserspeicher 600 Liter"},null,null,"Warmwasserspeicher 600 Liter",{"$f":"Leistungsdaten!G158","v":"WWK 221 electronic"},null,null,null,"Warmwasserspeicher 600 Liter",600,null,"Temperatur","55 °C"]
[null,"SBP 100",100,false,null,0,null,null,"SBP 100","TSP 100","Warmwasserspeicher 750 Liter",null,null,"Warmwasserspeicher 750 Liter",{"$f":"Leistungsdaten!G159","v":"WWK 301 electronic"},null,null,null,"Warmwasserspeicher 750 Liter",750,null,"Auswahl TempCBO","45 °C"]
[null,"SBP 200",200,false,null,0,null,null,"SBP 200","TSP 200","Warmwasserspeicher 800 Liter",null,null,"Warmwasserspeicher 800 Liter",{"$f":"Leistungsdaten!G160","v":"WWK 301 electronic SOL"},null,null,null,"Warmwasserspeicher 800 Liter",800,null,"Auswahl TempCBO","50 °C"]
[null,"SBP 400",400,false,null,0,null,null,"SBP 400","TSP 400","Warmwasserspeicher 1000 Liter",null,null,"Warmwasserspeicher 1000 Liter",{"$f":"Leistungsdaten!G161","v":"WWS 20"},null,null,null,"Warmwasserspeicher 1000 Liter",1000,null,"Auswahl TempCBO","55 °C"]
[null,"SBPE 400",400,false,null,0,null,null,"SBPE 400","TSPE 400","Warmwasserspeicher 1500 Liter",null,null,"Warmwasserspeicher 1500 Liter",{"$f":"Leistungsdaten!G199","v":"Eigene WW-Wärmepumpe"},null,null,null,"Warmwasserspeicher 1500 Liter",1500,null,"Auswahl TempCBO","60 °C"]
[null,"SBP 700",700,false,null,0,null,null,"SBP 700","TSP 700","Speicher-/ Hydraulikmodul HSBB",null,null,{"$f":"IF(G269=1,\"Speicher-/ Hydraulikmodul HSBB\",\"Speicher-/ Hydraulikmodul HTSB\")","v":"Speicher-/ Hydraulikmodul HSBB"},null,null,null,null,"Speicher-/ Hydraulikmodul HSBB",168,null,"Auswahl TempCBO","65 °C"]
[null,"SBP 1000",1000,false,null,0,null,null,"SBP 1000","TSP 1000","Vorhandener WW-Speicher",null,null,"Vorhandener WW-Speicher",null,null,null,null,"Vorhandener WW-Speicher",0]
[null,"SBP 1500",1500,false,null,0,null,null,"SBP 1500","TSP 1500"]
[null,"SBS 601",600,true,null,0,null,null,"SBS 601","TBS 601",{"$f":"IF($L$54=TRUE,L253,IF($D$240=TRUE,M253,IF($L$34=$L$37,N253,IF($L$34=$L$38,O253,IF($L$34=$L$39,P253,Q253)))))","v":300},{"$f":"VLOOKUP(C34,Leistungsdaten!G:AH,28,FALSE)","v":0},{"$f":"VLOOKUP(B240,B242:H262,5,FALSE)","v":0},{"$f":"T253","v":300},0,0,0,null,{"$f":"E240","v":"Warmwasserspeicher 300 Liter"},{"$f":"VLOOKUP(S253,S241:T252,2,FALSE)","v":300},null,{"$f":"H240","v":60.024009603841534},{"$f":"VLOOKUP(V253,V241:W252,2,FALSE)","v":{"$error":"#N/A"}}]
[null,"SBS 801",800,true,null,0,null,null,"SBS 801","TBS 801"]
[null,"SBS 1001",1000,true,null,0,null,null,"SBS 1001","TBS 1001"]
[null,"SBS 1501",1500,true,null,0,null,null,"SBS 1501","TBS 1501"]
[null,"HSBC 200",100,true,null,200,null,null,"HSBC 200","TSBC 200"]
[]
[]
[]
[]
[]
[]
[]
[]
[null,"Begrifflichkeiten STE/TEC"]
[]
[null,"Nr","Bemerkung",null,"Stiebel","Tecalor","Gewählt"]
[null,1,"Für Sverweis",null,1,2,1]
[null,2,"Rechtshinweis",null,"Stiebel Eltron übernimmt keinerlei Gewährleistung oder Garantie dafür, dass die bereitgestellten Angaben, Werte und Informationen oder die mit Hilfe bzw. anhand dieser Informationen, Werte und Angaben ermittelten Werte und Angaben in jeder Hinsicht vollständig, genau, richtig und aktuell sind. Stiebel Eltron behält sich das Recht vor, jederzeit und ohne vorherige Ankündigung Änderungen der bereitgestellten Angaben, Werte und Informationen vorzunehmen. Irrtum und Änderungen sind ausdrücklich vorbehalten. Keine der bereitgestellten Angaben, Werte und Informationen oder der mit Hilfe bzw. anhand dieser Angaben, Werte und Informationen ermittelten Werte und Angaben sind als Grundlage für eine finanzielle Entscheidung oder für einen sonstigen Zweck anzusehen, sondern dienen vielmehr nur als eine erste unverbindliche Information und als Hilfe zur ersten Orientierung.\n\nDie Haftung von Stiebel Eltron für Schäden jeglicher Art, die sich möglicherweise aus der Nutzung oder Verwendung der bereitgestellten Informationen, Werte und Angaben oder der mit Hilfe bzw. anhand dieser Angaben, Werte und Informationen ermittelten Werte und Angaben, ergeben, ist ausgeschlossen. Dieser Haftungsausschluss gilt nicht, wenn der Schaden auf Vorsatz oder grobe Fahrlässigkeit von Stiebel Eltron zurückzuführen ist sowie bei einer Verletzung des Lebens, des Körpers oder der Gesundheit.\n","Tecalor übernimmt keinerlei Gewährleistung oder Garantie dafür, dass die bereitgestellten Angaben, Werte und Informationen oder die mit Hilfe bzw. anhand dieser Informationen, Werte und Angaben ermittelten Werte und Angaben in jeder Hinsicht vollständig, genau, richtig und aktuell sind. tecalor behält sich das Recht vor, jederzeit und ohne vorherige Ankündigung Änderungen der bereitgestellten Angaben, Werte und Informationen vorzunehmen. Irrtum und Änderungen sind ausdrücklich vorbehalten. Keine der bereitgestellten Angaben, Werte und Informationen oder der mit Hilfe bzw. anhand dieser Angaben, Werte und Informationen ermittelten Werte und Angaben sind als Grundlage für eine finanzielle Entscheidung oder für einen sonstigen Zweck anzusehen, sondern dienen vielmehr nur als eine erste unverbindliche Information und als Hilfe zur ersten Orientierung.\n\nDie Haftung von tecalor für Schäden jeglicher Art, die sich möglicherweise aus der Nutzung oder Verwendung der bereitgestellten Informationen, Werte und Angaben oder der mit Hilfe bzw. anhand dieser Angaben, Werte und Informationen ermittelten Werte und Angaben, ergeben, ist ausgeschlossen. Dieser Haftungsausschluss gilt nicht, wenn der Schaden auf Vorsatz oder grobe Fahrlässigkeit von tecalor zurückzuführen ist sowie bei einer Verletzung des Lebens, des Körpers oder der Gesundheit.\n",{"$f":"HLOOKUP($G$269,$E$269:$F$287,B270,FALSE)","v":"Stiebel Eltron übernimmt keinerlei Gewährleistung oder Garantie dafür, dass die bereitgestellten Angaben, Werte und Informationen oder die mit Hilfe bzw. anhand dieser Informationen, Werte und Angaben ermittelten Werte und Angaben in jeder Hinsicht vollständig, genau, richtig und aktuell sind. Stiebel Eltron behält sich das Recht vor, jederzeit und ohne vorherige Ankündigung Änderungen der bereitgestellten Angaben, Werte und Informationen vorzunehmen. Irrtum und Änderungen sind ausdrücklich vorbehalten. Keine der bereitgestellten Angaben, Werte und Informationen oder der mit Hilfe bzw. anhand dieser Angaben, Werte und Informationen ermittelten Werte und Angaben sind als Grundlage für eine finanzielle Entscheidung oder für einen sonstigen Zweck anzusehen, sondern dienen vielmehr nur als eine erste unverbindliche Information und als Hilfe zur ersten Orientierung.\n\nDie Haftung von Stiebel Eltron für Schäden jeglicher Art, die sich möglicherweise aus der Nutzung oder Verwendung der bereitgestellten Informationen, Werte und Angaben oder der mit Hilfe bzw. anhand dieser Angaben, Werte und Informationen ermittelten Werte und Angaben, ergeben, ist ausgeschlossen. Dieser Haftungsausschluss gilt nicht, wenn der Schaden auf Vorsatz oder grobe Fahrlässigkeit von Stiebel Eltron zurückzuführen ist sowie bei einer Verletzung des Lebens, des Körpers oder der Gesundheit.\n"}]
[null,3,"Firmenname",null,"STIEBEL ELTRON GmbH & Co. KG","tecalor GmbH",{"$f":"HLOOKUP($G$269,$E$269:$F$287,B271,FALSE)","v":"STIEBEL ELTRON GmbH & Co. KG"}]
[null,4,"WP - Link Webseite",null,{"$f":"\"http://apps.stiebel-eltron.de/produktdaten/?article=\"&TEXT(VLOOKUP(C34,Leistungsdaten!G:V,16,FALSE),\"000000\")","v":"http://apps.stiebel-eltron.de/produktdaten/?article=232493"},{"$f":"\"http://www.tecalor.de/services/productproxy.html?productnr=\"&TEXT(VLOOKUP(C34,Leistungsdaten!G:V,16,FALSE),\"000000\")","v":"http://www.tecalor.de/services/productproxy.html?productnr=232493"},{"$f":"HLOOKUP($G$269,$E$269:$F$287,B272,FALSE)","v":"http://apps.stiebel-eltron.de/produktdaten/?article=232493"}]
[null,5,"WP - Link Datenblatt",null,{"$f":"\"http://www.stiebel-eltron.de/services/productproxy.product.pdf?productnr=\"&TEXT(VLOOKUP(C34,Leistungsdaten!G:V,16,FALSE),\"000000\")","v":"http://www.stiebel-eltron.de/services/productproxy.product.pdf?productnr=232493"},{"$f":"\"http://www.tecalor.de/services/productproxy.product.pdf?productnr=\"&TEXT(VLOOKUP(C34,Leistungsdaten!G:V,16,FALSE),\"000000\")","v":"http://www.tecalor.de/services/productproxy.product.pdf?productnr=232493"},"http://www.stiebel-eltron.de/services/productproxy.product.pdf?productnr=232493"]
[null,6,"Solar - Link Webseite",null,{"$f":"\"http://apps.stiebel-eltron.de/produktdaten/?article=\"&TEXT(VLOOKUP(B61,Leistungsdaten!G:V,16,FALSE),\"000000\")","v":"http://apps.stiebel-eltron.de/produktdaten/?article=230016"},{"$f":"\"http://www.tecalor.de\"&VLOOKUP(B61,Leistungsdaten!G:V,16,FALSE)","v":"http://www.tecalor.de230016"},"http://apps.stiebel-eltron.de/produktdaten/?article=230016"]
[null,7,"Solar - Link Datenblatt",null,{"$f":"\"http://www.stiebel-eltron.de/services/productproxy.product.pdf?productnr=\"&TEXT(VLOOKUP(B61,Leistungsdaten!G:V,16,FALSE),\"000000\")","v":"http://www.stiebel-eltron.de/services/productproxy.product.pdf?productnr=230016"},{"$f":"\"http://www.tecalor.de/services/productproxy.product.pdf?productnr=\"&TEXT(VLOOKUP(B61,Leistungsdaten!G:V,16,FALSE),\"000000\")","v":"http://www.tecalor.de/services/productproxy.product.pdf?productnr=230016"},"http://www.stiebel-eltron.de/services/productproxy.product.pdf?productnr=230016"]
[null,8,"Abluftmodul LWM 250",null,"Abluftmodul LWM 250","Abluftmodul TVM 250",{"$f":"HLOOKUP($G$269,$E$269:$F$287,B276,FALSE)","v":"Abluftmodul LWM 250"}]
[null,9,"EC-Pumpe-Sole | LWM 250",null,"EC-Pumpe-Sole | LWM 250","EC-Pumpe-Sole | TVM 250","EC-Pumpe-Sole | LWM 250"]
[null,10,null,null,null,null,0]
[null,11,null,null,null,null,{"$f":"HLOOKUP($G$269,$E$269:$F$287,B279,FALSE)","v":0}]
[null,12,null,null,null,null,{"$f":"HLOOKUP($G$269,$E$269:$F$287,B280,FALSE)","v":0}]
[null,13,null,null,null,null,{"$f":"HLOOKUP($G$269,$E$269:$F$287,B281,FALSE)","v":0}]
[null,14,null,null,null,null,{"$f":"HLOOKUP($G$269,$E$269:$F$287,B282,FALSE)","v":0}]
[null,15,null,null,null,null,{"$f":"HLOOKUP($G$269,$E$269:$F$287,B283,FALSE)","v":0}]

{"sheet":"Leistungsdaten","index":2,"n_rows":8850,"n_cols":40,"rows_kept":8850,"cut":false,"hidden":true,"merged":[[201,6,201,14],[202,6,203,6],[152,6,153,6],[0,6,0,10],[1,6,2,6],[52,6,53,6],[51,6,51,14],[101,6,101,14],[102,6,103,6],[151,6,151,14]]}
["Norm-Außentemperaturen Deutschland",null,null,null,null,null,"Luft-Wasser-Wärmepumpen"]
["PLZ","Stadt","Außentemp.",null,null,null,"WP-Typ","DT","Leistungszahl","Leistungszahl","Leistungszahl","Heizleistung","WP-Set ?","WWB","EC-Pumpe Heizung","WMZ","EC-Pumpe Sole","Bezeichnung","LWM 250","Inverter ?","Sonderbauform","Artikel.nr.","In","EC-Pumpe Brunnen","EC-Pumpe Brunnen","Leistungsaufnahme","WPW ohne",null,"Kaskadierbar ?","EC-Pumpe","Produktbild","SG-ready ?",null,"Speichergröße","Name","Datenblatt","Produktbild","Name","Datenblatt","Produktbild"]
["0","Bitte Stadt oder PLZ eingeben","-12 °C",null,null,null,null,"Prüfstand","A-7 / W35","A2 / W35","A10 / W35","A2/W35",null,"integriert","eingebaut?","integriert ?","eingebaut ?","Solepumpe (EC)","einsetzbar ?",null,"Bafa-Liste ?",null,"Bafa-Liste ?","einsetzbar ?","Typ Grundfos","Brunnenpumpe","Zwischen-WT ?",null,null,"Heizung",null,null,null,"Warmwasser","Stiebel","Stiebel","Stiebel","tecalor","tecalor","tecalor"]
[72280,"Aach",-16,null,null,null,{"$f":"IF(Berechnung!$G$269=1,AI4,AL4)","v":"WPL 15 ACS"},5,2.83,3.88,4.83,4.2300000000000004,false,false,false,true,false,"-",false,true,false,{"$f":"IF(Berechnung!$G$269=1,AJ4,AM4)","v":234759},true,false,"-","-",false,null,false,false,{"$f":"IF(Berechnung!$G$269=1,AK4,AN4)","v":"PIC00003714-00.jpg"},true,null,0,"WPL 15 ACS",234759,"PIC00003714-00.jpg","TTL 15 ACS",190451,"PIC00003781-00.jpg"]
[78267,"Aach/Hegau",-14,null,null,null,{"$f":"IF(Berechnung!$G$269=1,AI5,AL5)","v":"WPL 20 AC"},5,3.38,3.99,4.91,6.85,false,false,false,true,false,"-",false,true,false,{"$f":"IF(Berechnung!$G$269=1,AJ5,AM5)","v":236007},true,false,"-","-",false,null,false,false,{"$f":"IF(Berechnung!$G$269=1,AK5,AN5)","v":"PIC00003555-00.jpg"},true,null,0,"WPL 20 AC",236007,"PIC00003555-00.jpg","TTL 20 AC",190497,"PIC00003729-00.jpg"]
["520..","Aachen",-12,null,null,null,{"$f":"IF(Berechnung!$G$269=1,AI6,AL6)","v":"WPL 25 AC"},5,2.93,4.17,5.16,8.33,false,false,false,true,false,"-",false,true,false,{"$f":"IF(Berechnung!$G$269=1,AJ6,AM6)","v":234760},true,false,"-","-",false,null,false,false,{"$f":"IF(Berechnung!$G$269=1,AK6,AN6)","v":"PIC00003555-00.jpg"},true,null,0,"WPL 25 AC",234760,"PIC00003555-00.jpg","TTL 25 AC",190452,"PIC00003729-00.jpg"]
["7343.","Aalen / Württ.",-16,null,null,null,{"$f":"IF(Berechnung!$G$269=1,AI7,AL7)","v":"WPL 15 AS"},5,2.83,3.88,4.83,4.2300000000000004,false,false,false,true,false,"-",false,true,false,{"$f":"IF(Berechnung!$G$269=1,AJ7,AM7)","v":232491},true,false,"-","-",false,null,false,false,{"$f":"IF(Berechnung!$G$269=1,AK7,AN7)","v":"PIC00003714-00.jpg"},true,null,0,"WPL 15 AS",232491,"PIC00003714-00.jpg","TTL 15 AS",190324,"PIC00003781-00.jpg"]
[65326,"Aarbergen",-14,null,null,null,{"$f":"IF(Berechnung!$G$269=1,AI8,AL8)","v":"WPL 20 A"},5,3.38,3.99,4.91,6.85,false,false,false,true,false,"-",false,true,false,{"$f":"IF(Berechnung!$G$269=1,AJ8,AM8)","v":236006},true,false,"-","-",false,null,false,false,{"$f":"IF(Berechnung!$G$269=1,AK8,AN8)","v":"PIC00003555-00.jpg"},true,null,0,"WPL 20 A",236006,"PIC00003555-00.jpg","TTL 20 A",190496,"PIC00003729-00.jpg"]
[19322,"Abbendorf",-14,null,null,null,{"$f":"IF(Berechnung!$G$269=1,AI9,AL9)","v":"WPL 25 A"},5,2.93,4.17,5.16,8.33,false,false,false,true,false,"-",false,true,false,{"$f":"IF(Berechnung!$G$269=1,AJ9,AM9)","v":232493},true,false,"-","-",false,null,false,false,{"$f":"IF(Berechnung!$G$269=1,AK9,AN9)","v":"PIC00003555-00.jpg"},true,null,0,"WPL 25 A",232493,"PIC00003555-00.jpg","TTL 25 A",190326,"PIC00003729-00.jpg"]
[30900,"Abbensen",-14,null,null,null,{"$f":"IF(Berechnung!$G$269=1,AI10,AL10)","v":"WPL 07 ACS classic"},5,2.76,3.57,4.84,1.69,false,false,false,true,false,"-",false,true,false,{"$f":"IF(Berechnung!$G$269=1,AJ10,AM10)","v":235920},true,false,"-","-",false,null,false,false,{"$f":"IF(Berechnung!$G$269=1,AK10,AN10)","v":"PIC00006444-00.jpg"},true,null,0,"WPL 07 ACS classic",235920,"PIC00006444-00.jpg","TTL 3.5 ACS",190484,"PIC00006444-00.jpg"]
[31234,"Abbensen",-14,null,null,null,{"$f":"IF(Berechnung!$G$269=1,AI11,AL11)","v":"WPL 09 ACS classic"},5,2.5099999999999998,3.43,4.84,2.17,false,false,false,true,false,"-",false,true,false,{"$f":"IF(Berechnung!$G$269=1,AJ11,AM11)","v":235921},true,false,"-","-",false,null,false,false,{"$f":"IF(Berechnung!$G$269=1,AK11,AN11)","v":"PIC00006444-00.jpg"},true,null,0,"WPL 09 ACS classic",235921,"PIC00006444-00.jpg","TTL 4.5 ACS",190487,"PIC00006444-00.jpg"]
[93326,"Abensberg",-18,null,null,null,{"$f":"IF(Berechnung!$G$269=1,AI12,AL12)","v":"WPL 17 ACS classic"},5,2.92,3.97,5.24,5.73,false,false,false,true,false,"-",false,true,false,{"$f":"IF(Berechnung!$G$269=1,AJ12,AM12)","v":235922},true,false,"-","-",false,null,false,false,{"$f":"IF(Berechnung!$G$269=1,AK12,AN12)","v":"PIC00006444-00.jpg"},true,null,0,"WPL 17 ACS classic",235922,"PIC00006444-00.jpg","TTL 8.5 ACS",190490,"PIC00006444-00.jpg"]
[8485,"Abhorn",-16,null,null,null,{"$f":"IF(Berechnung!$G$269=1,AI13,AL13)","v":"WPL 15 IS-2"},5,2.92,4.01,5.35,4.7699999999999996,false,false,true,true,false,"-",false,true,false,{"$f":"IF(Berechnung!$G$269=1,AJ13,AM13)","v":231888},true,false,"-","-",false,null,false,"Stratos TEC RS 25/7",{"$f":"IF(Berechnung!$G$269=1,AK13,AN13)","v":"PIC00003553-00.jpg"},true,null,0,"WPL 15 IS-2",231888,"PIC00003553-00.jpg","TTL 15 IS-2",190331,"PIC00003738-00.jpg"]
[37290,"Abterode",-16,null,null,null,{"$f":"IF(Berechnung!$G$269=1,AI14,AL14)","v":"WPL 25 I-2"},5,3.05,3.89,5.28,8.14,false,false,true,true,false,"-",false,true,false,{"$f":"IF(Berechnung!$G$269=1,AJ14,AM14)","v":231889},true,false,"-","-",false,null,false,"Stratos TEC RS 25/7",{"$f":"IF(Berechnung!$G$269=1,AK14,AN14)","v":"PIC00003554-00.jpg"},true,null,0,"WPL 25 I-2",231889,"PIC00003554-00.jpg","TTL 25 I-2",190332,"PIC00003739-00.jpg"]
[4347,"Abtnaundorf",-14,null,null,null,{"$f":"IF(Berechnung!$G$269=1,AI15,AL15)","v":"WPL 15 IKS-2"},5,2.92,4.01,5.35,4.7699999999999996,false,true,true,true,false,"-",false,true,false,{"$f":"IF(Berechnung!$G$269=1,AJ15,AM15)","v":231886},true,false,"-","-",false,null,false,"Stratos TEC RS 25/7",{"$f":"IF(Berechnung!$G$269=1,AK15,AN15)","v":"PIC00003177-00.jpg"},true,null,162,"WPL 15 IKS-2",231886,"PIC00003177-00.jpg","TTL 15 IKS-2",190315,"PIC00003728-00.jpg"]
[94261,"Abtschlag",-18,null,null,null,{"$f":"IF(Berechnung!$G$269=1,AI16,AL16)","v":"WPL 25 IK-2"},5,3.05,3.89,5.28,8.14,false,true,true,true,false,"-",false,true,false,{"$f":"IF(Berechnung!$G$269=1,AJ16,AM16)","v":231887},true,false,"-","-",false,null,false,"Stratos TEC RS 25/7",{"$f":"IF(Berechnung!$G$269=1,AK16,AN16)","v":"PIC00003178-00.jpg"},true,null,162,"WPL 25 IK-2",231887,"PIC00003178-00.jpg","TTL 25 IK-2",190316,"PIC00002984-00.jpg"]
[73453,"Abtsgmünd",-16,null,null,null,{"$f":"IF(Berechnung!$G$269=1,AI17,AL17)","v":"WPL 08 S trend"},5,2.89,3.89,4.87,2.79,false,false,false,true,false,"-",false,true,false,{"$f":"IF(Berechnung!$G$269=1,AJ17,AM17)","v":233878},true,false,"-","-",false,null,false,false,{"$f":"IF(Berechnung!$G$269=1,AK17,AN17)","v":"PIC00004917-00.jpg"},true,null,0,"WPL 08 S trend",233878,"PIC00004917-00.jpg","TTL 08 S eco",190397,"PIC00005088-00.jpg"]
[69518,"Abtsteinach",-12,null,null,null,{"$f":"IF(Berechnung!$G$269=1,AI18,AL18)","v":"WPL 12 S trend"},5,2.82,4.13,5.14,3.9,false,false,false,true,false,"-",false,true,false,{"$f":"IF(Berechnung!$G$269=1,AJ18,AM18)","v":233879},true,false,"-","-",false,null,false,false,{"$f":"IF(Berechnung!$G$269=1,AK18,AN18)","v":"PIC00004917-00.jpg"},true,null,0,"WPL 12 S trend",233879,"PIC00004917-00.jpg","TTL 12 S eco",190398,"PIC00005088-00.jpg"]
[88147,"Achberg",-16,null,null,null,{"$f":"IF(Berechnung!$G$269=1,AI19,AL19)","v":"WPL 16 S trend"},5,2.95,4.29,5.18,5.05,false,false,false,true,false,"-",false,true,false,{"$f":"IF(Berechnung!$G$269=1,AJ19,AM19)","v":233880},true,false,"-","-",false,null,false,false,{"$f":"IF(Berechnung!$G$269=1,AK19,AN19)","v":"PIC00004917-00.jpg"},true,null,0,"WPL 16 S trend",233880,"PIC00004917-00.jpg","TTL 16 S eco",190399,"PIC00005088-00.jpg"]
[83101,"Achenmühle",-18,null,null,null,{"$f":"IF(Berechnung!$G$269=1,AI20,AL20)","v":"WPL 22 trend"},5,2.85,4.05,5.2,7.11,false,false,false,true,false,"-",false,true,false,{"$f":"IF(Berechnung!$G$269=1,AJ20,AM20)","v":233883},true,false,"-","-",false,null,false,false,{"$f":"IF(Berechnung!$G$269=1,AK20,AN20)","v":"PIC00004918-00.jpg"},true,null,0,"WPL 22 trend",233883,"PIC00004918-00.jpg","TTL 22 eco",190400,"PIC00005089-00.jpg"]
[77855,"Achern",-12,null,null,null,{"$f":"IF(Berechnung!$G$269=1,AI21,AL21)","v":"WPL 28 trend"},5,2.5499999999999998,4.03,5.12,7.42,false,false,false,true,false,"-",false,true,false,{"$f":"IF(Berechnung!$G$269=1,AJ21,AM21)","v":233884},true,false,"-","-",false,null,false,false,{"$f":"IF(Berechnung!$G$269=1,AK21,AN21)","v":"PIC00004918-00.jpg"},true,null,0,"WPL 28 trend",233884,"PIC00004918-00.jpg","TTL 28 eco",190401,"PIC00005089-00.jpg"]
[28832,"Achim",-12,null,null,null,{"$f":"IF(Berechnung!$G$269=1,AI22,AL22)","v":"WPL 10 AC"},5,3.06,3.51,4.16,6.74,false,false,false,true,false,"-",false,false,false,{"$f":"IF(Berechnung!$G$269=1,AJ22,AM22)","v":230236},true,false,"-","-",false,null,true,false,{"$f":"IF(Berechnung!$G$269=1,AK22,AN22)","v":"PIC00001670-00.jpg"},true,null,0,"WPL 10 AC",230236,"PIC00001670-00.jpg","TTL 10 AC",190288,"PIC00003086-00.jpg"]
[82547,"Achmühle",-16,null,null,null,{"$f":"IF(Berechnung!$G$269=1,AI23,AL23)","v":"WPL 10 I"},5,2.94,3.27,4.08,6.7,false,false,false,true,false,"-",false,false,false,{"$f":"IF(Berechnung!$G$269=1,AJ23,AM23)","v":220811},true,false,"-","-",false,null,false,false,{"$f":"IF(Berechnung!$G$269=1,AK23,AN23)","v":"PIC00004156-00.jpg"},true,null,0,"WPL 10 I",220811,"PIC00004156-00.jpg","TTL 10 I",190099,"PIC00003786-00.jpg"]
[88480,"Achstetten",-16,null,null,null,{"$f":"IF(Berechnung!$G$269=1,AI24,AL24)","v":"WPL 10 IK"},5,2.94,3.27,4.08,6.7,false,false,true,true,false,"-",false,false,false,{"$f":"IF(Berechnung!$G$269=1,AJ24,AM24)","v":234655},true,false,"-","-",false,null,false,"Stratos Para 25/1-7",{"$f":"IF(Berechnung!$G$269=1,AK24,AN24)","v":"PIC00004961-00.jpg"},true,null,0,"WPL 10 IK",234655,"PIC00004961-00.jpg","WPL 10 IK",null,"PIC00004961-00.jpg"]
[47626,"Achterhoek",-10,null,null,null,{"$f":"IF(Berechnung!$G$269=1,AI25,AL25)","v":"WPL 19 A"},5,3.32,4.12,5.48,7.41,false,false,false,true,false,"-",false,true,false,{"$f":"IF(Berechnung!$G$269=1,AJ25,AM25)","v":236412},true,false,"-","-",false,null,false,false,{"$f":"IF(Berechnung!$G$269=1,AK25,AN25)","v":"PIC00000457-00.jpg"},true,null,0,"WPL 19 A",236412,"PIC00000457-00.jpg","TTL 9.5 A",190517,"PIC00000457-00.jpg"]
[24239,"Achterwehr",-10,null,null,null,{"$f":"IF(Berechnung!$G$269=1,AI26,AL26)","v":"WPL 24 A"},5,3,4.01,5.48,9.0299999999999994,false,false,false,true,false,"-",false,true,false,{"$f":"IF(Berechnung!$G$269=1,AJ26,AM26)","v":236413},true,false,"-","-",false,null,false,false,{"$f":"IF(Berechnung!$G$269=1,AK26,AN26)","v":"PIC00000457-00.jpg"},true,null,0,"WPL 24 A",236413,"PIC00000457-00.jpg","TTL 13.5 A",190518,"PIC00000457-00.jpg"]
[25917,"Achtrup",-10,null,null,null,{"$f":"IF(Berechnung!$G$269=1,AI27,AL27)","v":"WPL 19 I"},5,3.32,4.12,5.48,7.41,false,false,false,true,false,"-",false,true,false,{"$f":"IF(Berechnung!$G$269=1,AJ27,AM27)","v":235193},true,false,"-","-",false,null,false,false,{"$f":"IF(Berechnung!$G$269=1,AK27,AN27)","v":"PIC00000418-00.jpg"},true,null,0,"WPL 19 I",235193,"PIC00000418-00.jpg","TTL 9.5 I",190462,"PIC00000418-00.jpg"]
[37581,"Ackenhausen",-16,null,null,null,{"$f":"IF(Berechnung!$G$269=1,AI28,AL28)","v":"WPL 24 I"},5,3,4.01,5.48,9.0299999999999994,false,false,false,true,false,"-",false,true,false,{"$f":"IF(Berechnung!$G$269=1,AJ28,AM28)","v":235194},true,false,"-","-",false,null,false,false,{"$f":"IF(Berechnung!$G$269=1,AK28,AN28)","v":"PIC00000418-00.jpg"},true,null,0,"WPL 24 I",235194,"PIC00000418-00.jpg","TTL 13.5 I",190463,"PIC00000418-00.jpg"]
[73099,"Adelberg",-16,null,null,null,{"$f":"IF(Berechnung!$G$269=1,AI29,AL29)","v":"WPL 13 E"},5,3.2,3.76,4.6500000000000004,8.09,false,false,false,true,false,"-",false,false,false,{"$f":"IF(Berechnung!$G$269=1,AJ29,AM29)","v":227756},true,false,"-","-",false,null,true,false,{"$f":"IF(Berechnung!$G$269=1,AK29,AN29)","v":"PIC00000457-00.jpg"},true,null,0,"WPL 13 E",227756,"PIC00000457-00.jpg","TTL 13 E",190163,"PIC00003075-00.jpg"]
[37139,"Adelebsen",-14,null,null,null,{"$f":"IF(Berechnung!$G$269=1,AI30,AL30)","v":"WPL 18 E"},5,3.3,3.7,4.5999999999999996,11.3,false,false,false,true,false,"-",false,false,false,{"$f":"IF(Berechnung!$G$269=1,AJ30,AM30)","v":227757},true,false,"-","-",false,null,true,false,{"$f":"IF(Berechnung!$G$269=1,AK30,AN30)","v":"PIC00000457-00.jpg"},true,null,0,"WPL 18 E",227757,"PIC00000457-00.jpg","TTL 18 E",190164,"PIC00003075-00.jpg"]
[79618,"Adelhausen",-12,null,null,null,{"$f":"IF(Berechnung!$G$269=1,AI31,AL31)","v":"WPL 23 E"},5,3.1,3.6,4.4000000000000004,15.7,false,false,false,true,false,"-",false,false,false,{"$f":"IF(Berechnung!$G$269=1,AJ31,AM31)","v":227758},true,false,"-","-",false,null,true,false,{"$f":"IF(Berechnung!$G$269=1,AK31,AN31)","v":"PIC00000457-00.jpg"},true,null,0,"WPL 23 E",227758,"PIC00000457-00.jpg","TTL 23 E",190165,"PIC00003075-00.jpg"]
[73486,"Adelmannsfelden",-16,null,null,null,{"$f":"IF(Berechnung!$G$269=1,AI32,AL32)","v":"WPL 13 cool"},5,3,3.4,4.3,8.1,false,false,false,true,false,"-",false,false,false,{"$f":"IF(Berechnung!$G$269=1,AJ32,AM32)","v":223400},true,false,"-","-",false,null,true,false,{"$f":"IF(Berechnung!$G$269=1,AK32,AN32)","v":"PIC00000457-00.jpg"},true,null,0,"WPL 13 cool",223400,"PIC00000457-00.jpg","TTL 13 cool",190159,"PIC00003075-00.jpg"]
[79669,"Adelsberg",-16,null,null,null,{"$f":"IF(Berechnung!$G$269=1,AI33,AL33)","v":"WPL 18 cool"},5,3.2,3.7,4.5999999999999996,11.3,false,false,false,true,false,"-",false,false,false,{"$f":"IF(Berechnung!$G$269=1,AJ33,AM33)","v":223401},true,false,"-","-",false,null,true,false,{"$f":"IF(Berechnung!$G$269=1,AK33,AN33)","v":"PIC00000457-00.jpg"},true,null,0,"WPL 18 cool",223401,"PIC00000457-00.jpg","TTL 18 cool",190160,"PIC00003075-00.jpg"]
[97737,"Adelsberg",-14,null,null,null,{"$f":"IF(Berechnung!$G$269=1,AI34,AL34)","v":"WPL 23 cool"},5,3.02,3.48,4.34,15.93,false,false,false,true,false,"-",false,false,false,{"$f":"IF(Berechnung!$G$269=1,AJ34,AM34)","v":223402},true,false,"-","-",false,null,true,false,{"$f":"IF(Berechnung!$G$269=1,AK34,AN34)","v":"PIC00000457-00.jpg"},true,null,0,"WPL 23 cool",223402,"PIC00000457-00.jpg","TTL 23 cool",190161,"PIC00003075-00.jpg"]
[85111,"Adelschlag",-16,null,null,null,{"$f":"IF(Berechnung!$G$269=1,AI35,AL35)","v":"WPL 33 HT"},5,2.46,3.45,4.84,7.45,false,false,false,true,false,"-",false,true,false,{"$f":"IF(Berechnung!$G$269=1,AJ35,AM35)","v":229938},true,false,"-","-",false,null,false,false,{"$f":"IF(Berechnung!$G$269=1,AK35,AN35)","v":"PIC00000457-00.jpg"},true,null,0,"WPL 33 HT",229938,"PIC00000457-00.jpg","TTL 33 HT",190231,"PIC00003075-00.jpg"]
[74740,"Adelsheim",-14,null,null,null,{"$f":"IF(Berechnung!$G$269=1,AI36,AL36)","v":"WPL 34"},5,2.78,3.14,3.94,18.32,false,false,false,true,false,"-",false,false,false,{"$f":"IF(Berechnung!$G$269=1,AJ36,AM36)","v":228835},true,false,"-","-",false,null,true,false,{"$f":"IF(Berechnung!$G$269=1,AK36,AN36)","v":"PIC00001676-00.jpg"},true,null,0,"WPL 34",228835,"PIC00001676-00.jpg","TTL 34",229872,"PIC00003094-00.jpg"]
[86477,"Adelsried",-16,null,null,null,{"$f":"IF(Berechnung!$G$269=1,AI37,AL37)","v":"WPL 47"},5,3.05,3.43,4.24,24.82,false,false,false,true,false,"-",false,false,false,{"$f":"IF(Berechnung!$G$269=1,AJ37,AM37)","v":228836},true,false,"-","-",false,null,true,false,{"$f":"IF(Berechnung!$G$269=1,AK37,AN37)","v":"PIC00001676-00.jpg"},true,null,0,"WPL 47",228836,"PIC00001676-00.jpg","TTL 47",229873,"PIC00003094-00.jpg"]
[4886,"Adelwitz",-16,null,null,null,{"$f":"IF(Berechnung!$G$269=1,AI38,AL38)","v":"WPL 57"},5,2.84,3.3,3.89,29.81,false,false,false,true,false,"-",false,false,false,{"$f":"IF(Berechnung!$G$269=1,AJ38,AM38)","v":228837},true,false,"-","-",false,null,true,false,{"$f":"IF(Berechnung!$G$269=1,AK38,AN38)","v":"PIC00001676-00.jpg"},true,null,0,"WPL 57",228837,"PIC00001676-00.jpg","TTL 57",229874,"PIC00003094-00.jpg"]
[21365,"Adendorf",-12,null,null,null,{"$f":"IF(Berechnung!$G$269=1,AI39,AL39)","v":"WPL 44 AC"},5,3.5,4.2,4.9000000000000004,21.8,false,false,false,true,false,"-",false,false,false,{"$f":"IF(Berechnung!$G$269=1,AJ39,AM39)","v":235108},true,false,"-","-",false,null,true,false,{"$f":"IF(Berechnung!$G$269=1,AK39,AN39)","v":"PIC00005950-00.jpg"},true,null,0,"WPL 44 AC",235108,"PIC00005950-00.jpg","WPL 44 AC",null,"PIC00005950-00.jpg"]
[31171,"Adensen",-14,null,null,null,{"$f":"IF(Berechnung!$G$269=1,AI40,AL40)","v":"WPL 60 AC"},5,3.4,4.0999999999999996,4.9000000000000004,30.3,false,false,false,true,false,"-",false,false,false,{"$f":"IF(Berechnung!$G$269=1,AJ40,AM40)","v":235109},true,false,"-","-",false,null,true,false,{"$f":"IF(Berechnung!$G$269=1,AK40,AN40)","v":"PIC00005950-00.jpg"},true,null,0,"WPL 60 AC",235109,"PIC00005950-00.jpg","WPL 60 AC",null,"PIC00005950-00.jpg"]
[31079,"Adenstedt",-16,null,null,null,{"$f":"IF(Berechnung!$G$269=1,AI41,AL41)","v":"WPL 130 AC"},5,2.96,3.26,4.05,61.28,false,false,false,true,false,"-",false,false,false,{"$f":"IF(Berechnung!$G$269=1,AJ41,AM41)","v":235110},true,false,"-","-",false,null,true,false,{"$f":"IF(Berechnung!$G$269=1,AK41,AN41)","v":"PIC00005950-00.jpg"},true,null,0,"WPL 130 AC",235110,"PIC00005950-00.jpg","WPL 130 AC",null,"PIC00005950-00.jpg"]
[84166,"Adlkofen",-16,null,null,null,{"$f":"IF(Berechnung!$G$269=1,AI42,AL42)","v":"LWZ 504"},5,3.09,4.4000000000000004,5.21,5.16,false,true,true,true,false,"-",false,true,true,{"$f":"IF(Berechnung!$G$269=1,AJ42,AM42)","v":233514},true,false,"-","-",false,null,false,"Stratos Para 25/1-7",{"$f":"IF(Berechnung!$G$269=1,AK42,AN42)","v":"PIC00001023-00.jpg"},true,null,235,"LWZ 504",233514,"PIC00001023-00.jpg","THZ 504",190384,"PIC00003078-00.jpg"]
[8626,"Adorf/Vogtland",-18,null,null,null,{"$f":"IF(Berechnung!$G$269=1,AI43,AL43)","v":"LWZ 304 SOL"},5,4.0599999999999996,4.1399999999999997,4.38,4.32,false,true,true,true,false,"-",false,false,true,{"$f":"IF(Berechnung!$G$269=1,AJ43,AM43)","v":230143},true,false,"-","-",false,null,false,"Stratos Para 25/1-7",{"$f":"IF(Berechnung!$G$269=1,AK43,AN43)","v":"PIC00001023-00.jpg"},true,null,235,"LWZ 304 SOL",230143,"PIC00001023-00.jpg","THZ 304 SOL",190221,"PIC00003078-00.jpg"]
[88299,"Adrazhofen",-16,null,null,null,{"$f":"IF(Berechnung!$G$269=1,AI44,AL44)","v":"LWZ 404 SOL"},5,3.74,3.98,4.3600000000000003,6.38,false,true,true,true,false,"-",false,false,true,{"$f":"IF(Berechnung!$G$269=1,AJ44,AM44)","v":230144},true,false,"-","-",false,null,false,"Stratos Para 25/1-7",{"$f":"IF(Berechnung!$G$269=1,AK44,AN44)","v":"PIC00001023-00.jpg"},true,null,235,"LWZ 404 SOL",230144,"PIC00001023-00.jpg","THZ 404 SOL",190222,"PIC00003078-00.jpg"]
[31855,"Aerzen",-14,null,null,null,{"$f":"IF(Berechnung!$G$269=1,AI45,AL45)","v":"LWZ 304 Trend"},5,4.0599999999999996,4.1399999999999997,4.38,4.32,false,true,true,true,false,"-",false,false,true,{"$f":"IF(Berechnung!$G$269=1,AJ45,AM45)","v":233254},true,false,"-","-",false,null,false,"Stratos Para 25/1-7",{"$f":"IF(Berechnung!$G$269=1,AK45,AN45)","v":"PIC00004273-00.jpg"},true,null,235,"LWZ 304 Trend",233254,"PIC00004273-00.jpg","THZ 304 eco",190373,"PIC00004353-00.jpg"]
[71563,"Affalterbach",-14,null,null,null,{"$f":"IF(Berechnung!$G$269=1,AI46,AL46)","v":"LWZ 404 Trend"},5,3.74,3.98,4.3600000000000003,6.38,false,true,true,true,false,"-",false,false,true,{"$f":"IF(Berechnung!$G$269=1,AJ46,AM46)","v":233255},true,false,"-","-",false,null,false,"Stratos Para 25/1-7",{"$f":"IF(Berechnung!$G$269=1,AK46,AN46)","v":"PIC00004273-00.jpg"},true,null,235,"LWZ 404 Trend",233255,"PIC00004273-00.jpg","THZ 404 eco",190374,"PIC00004353-00.jpg"]
[74182,"Affaltrach",-14,null,null,null,{"$f":"IF(Berechnung!$G$269=1,AI47,AL47)","v":"LWZ 304 flex"},5,4.0599999999999996,4.1399999999999997,4.38,4.32,false,false,true,true,false,"-",false,false,true,{"$f":"IF(Berechnung!$G$269=1,AJ47,AM47)","v":235268},false,false,"-","-",false,null,false,"Stratos Para 25/1-7",{"$f":"IF(Berechnung!$G$269=1,AK47,AN47)","v":"PIC00006044-00.jpg"},true,null,0,"LWZ 304 flex",235268,"PIC00006044-00.jpg","THZ 304 flex",190468,"PIC00006097-00.jpg"]
[58809,"Affeln",-12,null,null,null,{"$f":"IF(Berechnung!$G$269=1,AI48,AL48)","v":"LWZ 404 flex"},5,3.74,3.98,4.3600000000000003,6.38,false,false,true,true,false,"-",false,false,true,{"$f":"IF(Berechnung!$G$269=1,AJ48,AM48)","v":235269},false,false,"-","-",false,null,false,"Stratos Para 25/1-7",{"$f":"IF(Berechnung!$G$269=1,AK48,AN48)","v":"PIC00006044-00.jpg"},true,null,0,"LWZ 404 flex",235269,"PIC00006044-00.jpg","THZ 404 flex",190469,"PIC00006097-00.jpg"]
[86444,"Affing",-16,null,null,null,{"$f":"IF(Berechnung!$G$269=1,AI49,AL49)","v":"LWZ smart"},5,2.82,3.46,3.89,6.38,false,true,true,true,false,"-",false,false,false,{"$f":"IF(Berechnung!$G$269=1,AJ49,AM49)","v":235267},false,false,"-","-",false,null,false,"Stratos Para 25/1-7",{"$f":"IF(Berechnung!$G$269=1,AK49,AN49)","v":"PIC00006060-00.jpg"},true,null,235,"LWZ smart",235267,"PIC00006060-00.jpg","THZ 404 eco",190467,"PIC00006124-00.jpg"]
[71083,"Affstätt",-16]
[74858,"Aglasterhausen",-12]
[48683,"Ahaus",-10,null,null,null,"Sole-Wasser-Wärmepumpen"]
[88697,"Ahausen",-12,null,null,null,"WP-Typ","DT","Leistungszahl","Leistungsaufnahme","Leistungsaufnahme","Heizleistung","WP-Set ?","WWB","EC-Pumpe Heizung","WMZ","EC-Pumpe Sole","Bezeichnung","LWM 250","Inverter ?","Sonderbauform","Artikel.nr.","In","EC-Pumpe Brunnen","EC-Pumpe Brunnen","Leistungsaufnahme","WPW ohne","Heizleistung","Kaskadierbar ?","EC-Pumpe","Produktbild","SG-ready ?",null,"Speichergröße","Name","Datenblatt","Produktbild","Name","Datenblatt","Produktbild"]
[37170,"Ahlbershausen",-14,null,null,null,null,"Prüfstand","B0/W35","B0/W35 [KW]","Solepumpe (EC)","B0/W35",null,"integriert","eingebaut ?","integriert ?","eingebaut ?","Solepumpe (EC)","einsetzbar ?",null,"Bafa-Liste ?",null,"Bafa-Liste ?","einsetzbar ?","Typ Grundfos","Brunnenpumpe","Zwischen-WT ?","B10/W35",null,"Heizung",null,null,null,"Warmwasser","Stiebel","Stiebel","Stiebel","tecalor","tecalor","tecalor"]
[72160,"Ahldorf",-16,null,null,null,{"$f":"IF(Berechnung!$G$269=1,AI55,AL55)","v":"WPC 04"},5,4.5199999999999996,1.056,0.04,4.7699999999999996,false,true,true,true,true,"Yonos PARA RS 25/7.5",true,false,false,{"$f":"IF(Berechnung!$G$269=1,AJ55,AM55)","v":232926},true,true,"Grundfos SQE 5-15",0.21,false,6.22,false,"Yonos PARA 25/7.0",{"$f":"IF(Berechnung!$G$269=1,AK55,AN55)","v":"PIC00003663-00.jpg"},true,null,175,"WPC 04",232926,"PIC00003663-00.jpg","TTC 04",190345,"PIC00003777-00.jpg"]
["5922.","Ahlen/Westf.",-12,null,null,null,{"$f":"IF(Berechnung!$G$269=1,AI56,AL56)","v":"WPC 05"},5,4.79,1.214,5.5E-2,5.82,false,true,true,true,true,"Yonos PARA RS 25/7.5",true,false,false,{"$f":"IF(Berechnung!$G$269=1,AJ56,AM56)","v":232927},true,true,"Grundfos SQE 5-15",0.22,false,7.26,false,"Yonos PARA 25/7.0",{"$f":"IF(Berechnung!$G$269=1,AK56,AN56)","v":"PIC00003663-00.jpg"},true,null,175,"WPC 05",232927,"PIC00003663-00.jpg","TTC 05",190346,"PIC00003777-00.jpg"]
[6313,"Ahlsdorf",-14,null,null,null,{"$f":"IF(Berechnung!$G$269=1,AI57,AL57)","v":"WPC 07"},5,4.8499999999999996,1.5449999999999999,7.0000000000000007E-2,7.5,false,true,true,true,true,"Stratos PARA 25/1-8",true,false,false,{"$f":"IF(Berechnung!$G$269=1,AJ57,AM57)","v":232928},true,true,"Grundfos SQE 5-15",0.23,false,9.67,false,"Yonos PARA 25/7.0",{"$f":"IF(Berechnung!$G$269=1,AK57,AN57)","v":"PIC00003663-00.jpg"},true,null,175,"WPC 07",232928,"PIC00003663-00.jpg","TTC 07",190347,"PIC00003777-00.jpg"]
[32609,"Ahlsen",-12,null,null,null,{"$f":"IF(Berechnung!$G$269=1,AI58,AL58)","v":"WPC 10"},5,5.0199999999999996,2.0550000000000002,7.4999999999999997E-2,10.31,false,true,true,true,true,"Stratos PARA 25/1-8",true,false,false,{"$f":"IF(Berechnung!$G$269=1,AJ58,AM58)","v":232929},true,true,"Grundfos SQE 5-15",0.24,false,13.12,false,"Yonos PARA 25/7.5",{"$f":"IF(Berechnung!$G$269=1,AK58,AN58)","v":"PIC00003663-00.jpg"},true,null,162,"WPC 10",232929,"PIC00003663-00.jpg","TTC 10",190348,"PIC00003777-00.jpg"]
[38368,"Ahmstorf",-14,null,null,null,{"$f":"IF(Berechnung!$G$269=1,AI59,AL59)","v":"WPC 13"},5,4.83,2.7360000000000002,9.5000000000000001E-2,13.21,false,true,true,true,true,"Stratos PARA 25/1-8",true,false,false,{"$f":"IF(Berechnung!$G$269=1,AJ59,AM59)","v":232930},true,true,"Grundfos SQE 5-15",0.255,false,16.899999999999999,false,"Yonos PARA 25/7.5",{"$f":"IF(Berechnung!$G$269=1,AK59,AN59)","v":"PIC00003663-00.jpg"},true,null,162,"WPC 13",232930,"PIC00003663-00.jpg","TTC 13",190349,"PIC00003777-00.jpg"]
[34292,"Ahnatal",-14,null,null,null,{"$f":"IF(Berechnung!$G$269=1,AI60,AL60)","v":"WPC 04 cool"},5,4.5199999999999996,1.056,0.04,4.7699999999999996,false,true,true,true,true,"Yonos PARA RS 25/7.5",true,false,false,{"$f":"IF(Berechnung!$G$269=1,AJ60,AM60)","v":232931},true,true,"Grundfos SQE 5-15",0.21,false,6.22,false,"Yonos PARA 25/7.0",{"$f":"IF(Berechnung!$G$269=1,AK60,AN60)","v":"PIC00003663-00.jpg"},true,null,175,"WPC 04 cool",232931,"PIC00003663-00.jpg","TTC 04 cool",190350,"PIC00003777-00.jpg"]
[29353,"Ahnsbeck",-14,null,null,null,{"$f":"IF(Berechnung!$G$269=1,AI61,AL61)","v":"WPC 05 cool"},5,4.79,1.214,5.5E-2,5.82,false,true,true,true,true,"Yonos PARA RS 25/7.5",true,false,false,{"$f":"IF(Berechnung!$G$269=1,AJ61,AM61)","v":232932},true,true,"Grundfos SQE 5-15",0.22,false,7.26,false,"Yonos PARA 25/7.0",{"$f":"IF(Berechnung!$G$269=1,AK61,AN61)","v":"PIC00003663-00.jpg"},true,null,175,"WPC 05 cool",232932,"PIC00003663-00.jpg","TTC 05 cool",190351,"PIC00003777-00.jpg"]
[94527,"Aholming",-18,null,null,null,{"$f":"IF(Berechnung!$G$269=1,AI62,AL62)","v":"WPC 07 cool"},5,4.8499999999999996,1.5449999999999999,7.0000000000000007E-2,7.5,false,true,true,true,true,"Stratos PARA 25/1-8",true,false,false,{"$f":"IF(Berechnung!$G$269=1,AJ62,AM62)","v":232933},true,true,"Grundfos SQE 5-15",0.23,false,9.67,false,"Yonos PARA 25/7.0",{"$f":"IF(Berechnung!$G$269=1,AK62,AN62)","v":"PIC00003663-00.jpg"},true,null,175,"WPC 07 cool",232933,"PIC00003663-00.jpg","TTC 07 cool",190352,"PIC00003777-00.jpg"]
[74744,"Ahorn",-16,null,null,null,{"$f":"IF(Berechnung!$G$269=1,AI63,AL63)","v":"WPC 10 cool"},5,5.0199999999999996,2.0550000000000002,7.4999999999999997E-2,10.31,false,true,true,true,true,"Stratos PARA 25/1-8",true,false,false,{"$f":"IF(Berechnung!$G$269=1,AJ63,AM63)","v":232934},true,true,"Grundfos SQE 5-15",0.24,false,13.12,false,"Yonos PARA 25/7.5",{"$f":"IF(Berechnung!$G$269=1,AK63,AN63)","v":"PIC00003663-00.jpg"},true,null,162,"WPC 10 cool",232934,"PIC00003663-00.jpg","TTC 10 cool",190353,"PIC00003777-00.jpg"]
[96482,"Ahorn",-16,null,null,null,{"$f":"IF(Berechnung!$G$269=1,AI64,AL64)","v":"WPC 13 cool"},5,4.83,2.7360000000000002,9.5000000000000001E-2,13.21,false,true,true,true,true,"Stratos PARA 25/1-8",true,false,false,{"$f":"IF(Berechnung!$G$269=1,AJ64,AM64)","v":232935},true,true,"Grundfos SQE 5-15",0.255,false,16.899999999999999,false,"Yonos PARA 25/7.5",{"$f":"IF(Berechnung!$G$269=1,AK64,AN64)","v":"PIC00003663-00.jpg"},true,null,162,"WPC 13 cool",232935,"PIC00003663-00.jpg","TTC 13 cool",190354,"PIC00003777-00.jpg"]
[95491,"Ahorntal",-16,null,null,null,{"$f":"IF(Berechnung!$G$269=1,AI65,AL65)","v":"WPF 04"},5,4.5199999999999996,1.056,0.04,4.7699999999999996,false,false,true,true,true,"Yonos PARA RS 25/7.5",true,false,false,{"$f":"IF(Berechnung!$G$269=1,AJ65,AM65)","v":232909},true,true,"Grundfos SQE 5-15",0.21,false,6.22,false,"Yonos PARA 25/7.0",{"$f":"IF(Berechnung!$G$269=1,AK65,AN65)","v":"PIC00003403-00.jpg"},true,null,0,"WPF 04",232909,"PIC00003403-00.jpg","TTF 04",190333,"PIC00003730-00.jpg"]
[38707,"Ahrensberg",-12,null,null,null,{"$f":"IF(Berechnung!$G$269=1,AI66,AL66)","v":"WPF 05"},5,4.79,1.214,5.5E-2,5.82,false,false,true,true,true,"Yonos PARA RS 25/7.5",true,false,false,{"$f":"IF(Berechnung!$G$269=1,AJ66,AM66)","v":232910},true,true,"Grundfos SQE 5-15",0.22,false,7.26,false,"Yonos PARA 25/7.0",{"$f":"IF(Berechnung!$G$269=1,AK66,AN66)","v":"PIC00003403-00.jpg"},true,null,0,"WPF 05",232910,"PIC00003403-00.jpg","TTF 05",190334,"PIC00003730-00.jpg"]
[22926,"Ahrensburg",-12,null,null,null,{"$f":"IF(Berechnung!$G$269=1,AI67,AL67)","v":"WPF 07"},5,4.8499999999999996,1.5449999999999999,7.0000000000000007E-2,7.5,false,false,true,true,true,"Stratos PARA 25/1-8",true,false,false,{"$f":"IF(Berechnung!$G$269=1,AJ67,AM67)","v":232911},true,true,"Grundfos SQE 5-15",0.23,false,9.67,false,"Yonos PARA 25/7.0",{"$f":"IF(Berechnung!$G$269=1,AK67,AN67)","v":"PIC00003403-00.jpg"},true,null,0,"WPF 07",232911,"PIC00003403-00.jpg","TTF 07",190335,"PIC00003730-00.jpg"]
[16356,"Ahrensfelde",-14,null,null,null,{"$f":"IF(Berechnung!$G$269=1,AI68,AL68)","v":"WPF 10"},5,5.0199999999999996,2.0550000000000002,7.4999999999999997E-2,10.31,false,false,true,true,true,"Stratos PARA 25/1-8",true,false,false,{"$f":"IF(Berechnung!$G$269=1,AJ68,AM68)","v":232912},true,true,"Grundfos SQE 5-15",0.24,false,13.12,false,"Yonos PARA 25/7.5",{"$f":"IF(Berechnung!$G$269=1,AK68,AN68)","v":"PIC00003403-00.jpg"},true,null,0,"WPF 10",232912,"PIC00003403-00.jpg","TTF 10",190336,"PIC00003730-00.jpg"]
[18320,"Ahrenshagen",-10,null,null,null,{"$f":"IF(Berechnung!$G$269=1,AI69,AL69)","v":"WPF 13"},5,4.83,2.7360000000000002,9.5000000000000001E-2,13.21,false,false,true,true,true,"Stratos PARA 25/1-8",true,false,false,{"$f":"IF(Berechnung!$G$269=1,AJ69,AM69)","v":232913},true,true,"Grundfos SQE 5-15",0.255,false,16.899999999999999,false,"Yonos PARA 25/7.5",{"$f":"IF(Berechnung!$G$269=1,AK69,AN69)","v":"PIC00003403-00.jpg"},true,null,0,"WPF 13",232913,"PIC00003403-00.jpg","TTF 13",190337,"PIC00003730-00.jpg"]
[53945,"Ahrhütte",-14,null,null,null,{"$f":"IF(Berechnung!$G$269=1,AI70,AL70)","v":"WPF 16"},5,4.54,3.7480000000000002,0.14000000000000001,17.02,false,false,true,true,true,"Stratos PARA 25/1-12",true,false,false,{"$f":"IF(Berechnung!$G$269=1,AJ70,AM70)","v":232914},true,true,"Grundfos SQE 5-15",0.26,false,21.68,false,"Stratos Para 25/1-8",{"$f":"IF(Berechnung!$G$269=1,AK70,AN70)","v":"PIC00003403-00.jpg"},true,null,0,"WPF 16",232914,"PIC00003403-00.jpg","TTF 16",190338,"PIC00003730-00.jpg"]
[86551,"Aichach",-16,null,null,null,{"$f":"IF(Berechnung!$G$269=1,AI71,AL71)","v":"WPF 04 cool"},5,4.5199999999999996,1.056,0.04,4.7699999999999996,false,false,true,true,true,"Yonos PARA RS 25/7.5",true,false,false,{"$f":"IF(Berechnung!$G$269=1,AJ71,AM71)","v":232915},true,true,"Grundfos SQE 5-15",0.21,false,6.22,false,"Yonos PARA 25/7.0",{"$f":"IF(Berechnung!$G$269=1,AK71,AN71)","v":"PIC00003403-00.jpg"},true,null,0,"WPF 04 cool",232915,"PIC00003403-00.jpg","TTF 04 cool",190339,"PIC00003730-00.jpg"]
[92262,"Aichach",-16,null,null,null,{"$f":"IF(Berechnung!$G$269=1,AI72,AL72)","v":"WPF 05 cool"},5,4.79,1.214,5.5E-2,5.82,false,false,true,true,true,"Yonos PARA RS 25/7.5",true,false,false,{"$f":"IF(Berechnung!$G$269=1,AJ72,AM72)","v":232916},true,true,"Grundfos SQE 5-15",0.22,false,7.26,false,"Yonos PARA 25/7.0",{"$f":"IF(Berechnung!$G$269=1,AK72,AN72)","v":"PIC00003403-00.jpg"},true,null,0,"WPF 05 cool",232916,"PIC00003403-00.jpg","TTF 05 cool",190340,"PIC00003730-00.jpg"]
[72539,"Aichelau",-16,null,null,null,{"$f":"IF(Berechnung!$G$269=1,AI73,AL73)","v":"WPF 07 cool"},5,4.8499999999999996,1.5449999999999999,7.0000000000000007E-2,7.5,false,false,true,true,true,"Stratos PARA 25/1-8",true,false,false,{"$f":"IF(Berechnung!$G$269=1,AJ73,AM73)","v":232917},true,true,"Grundfos SQE 5-15",0.23,false,9.67,false,"Yonos PARA 25/7.0",{"$f":"IF(Berechnung!$G$269=1,AK73,AN73)","v":"PIC00003403-00.jpg"},true,null,0,"WPF 07 cool",232917,"PIC00003403-00.jpg","TTF 07 cool",190341,"PIC00003730-00.jpg"]
[73101,"Aichelberg",-16,null,null,null,{"$f":"IF(Berechnung!$G$269=1,AI74,AL74)","v":"WPF 10 cool"},5,5.0199999999999996,2.0550000000000002,7.4999999999999997E-2,10.31,false,false,true,true,true,"Stratos PARA 25/1-8",true,false,false,{"$f":"IF(Berechnung!$G$269=1,AJ74,AM74)","v":232918},true,true,"Grundfos SQE 5-15",0.24,false,13.12,false,"Yonos PARA 25/7.5",{"$f":"IF(Berechnung!$G$269=1,AK74,AN74)","v":"PIC00003403-00.jpg"},true,null,0,"WPF 10 cool",232918,"PIC00003403-00.jpg","TTF 10 cool",190342,"PIC00003730-00.jpg"]
[75323,"Aichelberg",-16,null,null,null,{"$f":"IF(Berechnung!$G$269=1,AI75,AL75)","v":"WPF 13 cool"},5,4.83,2.7360000000000002,9.5000000000000001E-2,13.21,false,false,true,true,true,"Stratos PARA 25/1-8",true,false,false,{"$f":"IF(Berechnung!$G$269=1,AJ75,AM75)","v":232919},true,true,"Grundfos SQE 5-15",0.255,false,16.899999999999999,false,"Yonos PARA 25/7.5",{"$f":"IF(Berechnung!$G$269=1,AK75,AN75)","v":"PIC00003403-00.jpg"},true,null,0,"WPF 13 cool",232919,"PIC00003403-00.jpg","TTF 13 cool",190343,"PIC00003730-00.jpg"]
[78733,"Aichhalden",-16,null,null,null,{"$f":"IF(Berechnung!$G$269=1,AI76,AL76)","v":"WPF 16 cool"},5,4.54,3.7480000000000002,0.14000000000000001,17.02,false,false,true,true,true,"Stratos PARA 25/1-12",true,false,false,{"$f":"IF(Berechnung!$G$269=1,AJ76,AM76)","v":232920},true,true,"Grundfos SQE 5-15",0.26,false,21.68,false,"Stratos PARA 25/1-8",{"$f":"IF(Berechnung!$G$269=1,AK76,AN76)","v":"PIC00003403-00.jpg"},true,null,0,"WPF 16 cool",232920,"PIC00003403-00.jpg","TTF 16 cool",190344,"PIC00003730-00.jpg"]
[88317,"Aichstetten",-16,null,null,null,{"$f":"IF(Berechnung!$G$269=1,AI77,AL77)","v":"WPF 5 basic"},5,4.33,1.36,5.5E-2,5.88,false,false,true,true,false,"Stratos 30/1-8",true,false,false,{"$f":"IF(Berechnung!$G$269=1,AJ77,AM77)","v":230944},true,true,"Grundfos SQE 5-15",0.22,false,7.2,false,"Stratos PARA 25/1-8",{"$f":"IF(Berechnung!$G$269=1,AK77,AN77)","v":"PIC00001138-00.jpg"},true,null,0,"WPF 5 basic",230944,"PIC00001138-00.jpg","WPF 5 basic",null,"PIC00001138-00.jpg"]
[72631,"Aichtal",-14,null,null,null,{"$f":"IF(Berechnung!$G$269=1,AI78,AL78)","v":"WPF 7 basic"},5,4.5,1.7,7.0000000000000007E-2,7.64,false,false,true,true,false,"Stratos 30/1-8",true,false,false,{"$f":"IF(Berechnung!$G$269=1,AJ78,AM78)","v":230945},true,true,"Grundfos SQE 5-15",0.23,false,10,false,"Stratos PARA 25/1-8",{"$f":"IF(Berechnung!$G$269=1,AK78,AN78)","v":"PIC00001138-00.jpg"},true,null,0,"WPF 7 basic",230945,"PIC00001138-00.jpg","WPF 7 basic",null,"PIC00001138-00.jpg"]
[73773,"Aichwald",-14,null,null,null,{"$f":"IF(Berechnung!$G$269=1,AI79,AL79)","v":"WPF 10 basic"},5,4.37,2.2200000000000002,7.4999999999999997E-2,9.6999999999999993,false,false,true,true,false,"Stratos 30/1-8",true,false,false,{"$f":"IF(Berechnung!$G$269=1,AJ79,AM79)","v":230946},true,true,"Grundfos SQE 5-15",0.24,false,12.5,false,"Stratos PARA 25/1-8",{"$f":"IF(Berechnung!$G$269=1,AK79,AN79)","v":"PIC00001138-00.jpg"},true,null,0,"WPF 10 basic",230946,"PIC00001138-00.jpg","WPF 10 basic",null,"PIC00001138-00.jpg"]
[84539,"Aidenbach",-16,null,null,null,{"$f":"IF(Berechnung!$G$269=1,AI80,AL80)","v":"WPF 13 basic"},5,4.42,2.85,9.5000000000000001E-2,12.59,false,false,true,true,false,"Stratos 30/1-8",true,false,false,{"$f":"IF(Berechnung!$G$269=1,AJ80,AM80)","v":230947},true,true,"Grundfos SQE 5-15",0.255,false,17.100000000000001,false,"Stratos PARA 25/1-8",{"$f":"IF(Berechnung!$G$269=1,AK80,AN80)","v":"PIC00001138-00.jpg"},true,null,0,"WPF 13 basic",230947,"PIC00001138-00.jpg","WPF 13 basic",null,"PIC00001138-00.jpg"]
[94501,"Aidenbach",-16,null,null,null,{"$f":"IF(Berechnung!$G$269=1,AI81,AL81)","v":"WPF 10 M"},5,4.49,2.2200000000000002,7.4999999999999997E-2,10.02,false,false,false,true,false,"Stratos 30/1-8",true,false,false,{"$f":"IF(Berechnung!$G$269=1,AJ81,AM81)","v":185349},true,true,"Grundfos SQE 5-15",0.24,false,12.5,true,false,{"$f":"IF(Berechnung!$G$269=1,AK81,AN81)","v":"PIC00000594-00.jpg"},true,null,0,"WPF 10 M",185349,"PIC00000594-00.jpg","TTF 10 M",190058,"PIC00003954-00.jpg"]
[97491,"Aidhausen",-16,null,null,null,{"$f":"IF(Berechnung!$G$269=1,AI82,AL82)","v":"WPF 13 M"},5,4.57,2.82,9.5000000000000001E-2,12.98,false,false,false,true,false,"Stratos 30/1-8",true,false,false,{"$f":"IF(Berechnung!$G$269=1,AJ82,AM82)","v":182135},true,true,"Grundfos SQE 5-15",0.255,false,17.100000000000001,true,false,{"$f":"IF(Berechnung!$G$269=1,AK82,AN82)","v":"PIC00000594-00.jpg"},true,null,0,"WPF 13 M",182135,"PIC00000594-00.jpg","TTF 13 M",190045,"PIC00003954-00.jpg"]
[71134,"Aidlingen",-16,null,null,null,{"$f":"IF(Berechnung!$G$269=1,AI83,AL83)","v":"WPF 16 M"},5,4.3499999999999996,3.5,0.09,16.989999999999998,false,false,false,true,false,"Stratos 30/1-8",true,false,false,{"$f":"IF(Berechnung!$G$269=1,AJ83,AM83)","v":220894},true,true,"Grundfos SQE 5-15",0.26,false,21.7,true,false,{"$f":"IF(Berechnung!$G$269=1,AK83,AN83)","v":"PIC00000594-00.jpg"},true,null,0,"WPF 16 M",220894,"PIC00000594-00.jpg","TTF 16 M",190102,"PIC00003954-00.jpg"]
[56459,"Ailertchen",-14,null,null,null,{"$f":"IF(Berechnung!$G$269=1,AI84,AL84)","v":"WPF 20"},5,4.66,4.5,0.18,21.5,false,false,false,true,false,"UPF 40/1-8 E",false,false,false,{"$f":"IF(Berechnung!$G$269=1,AJ84,AM84)","v":233003},true,true,"Grundfos SQE 7-15",0.4,false,27.9,true,false,{"$f":"IF(Berechnung!$G$269=1,AK84,AN84)","v":"PIC00000830-00.jpg"},true,null,0,"WPF 20",233003,"PIC00000830-00.jpg","TTF 20",190363,"PIC00003074-00.jpg"]
[88048,"Ailingen",-12,null,null,null,{"$f":"IF(Berechnung!$G$269=1,AI85,AL85)","v":"WPF 27"},5,4.8499999999999996,6.1,0.22,29.7,false,false,false,true,false,"UPF 40/1-8 E",false,false,false,{"$f":"IF(Berechnung!$G$269=1,AJ85,AM85)","v":233004},true,true,"Grundfos SQE 7-30",0.86,false,37.83,true,false,{"$f":"IF(Berechnung!$G$269=1,AK85,AN85)","v":"PIC00000830-00.jpg"},true,null,0,"WPF 27",233004,"PIC00000830-00.jpg","TTF 27",190364,"PIC00003074-00.jpg"]
[86447,"Aindling",-16,null,null,null,{"$f":"IF(Berechnung!$G$269=1,AI86,AL86)","v":"WPF 27 HT"},5,4.34,6.1,0.22,27.41,false,false,false,true,false,"UPF 40/1-8 E",false,false,false,{"$f":"IF(Berechnung!$G$269=1,AJ86,AM86)","v":233009},true,true,"Grundfos SQE 7-30",0.86,false,35.299999999999997,true,false,{"$f":"IF(Berechnung!$G$269=1,AK86,AN86)","v":"PIC00000830-00.jpg"},true,null,0,"WPF 27 HT",233009,"PIC00000830-00.jpg","TTF 27 HT",190369,"PIC00003074-00.jpg"]
[83404,"Ainring",-16,null,null,null,{"$f":"IF(Berechnung!$G$269=1,AI87,AL87)","v":"WPF 35"},5,4.72,7.98,0.35,37.700000000000003,false,false,false,true,false,"UPF 50/1-12 E",false,false,false,{"$f":"IF(Berechnung!$G$269=1,AJ87,AM87)","v":233005},true,false,"-","-",false,49.03,true,false,{"$f":"IF(Berechnung!$G$269=1,AK87,AN87)","v":"PIC00000830-00.jpg"},true,null,0,"WPF 35",233005,"PIC00000830-00.jpg","TTF 35",190365,"PIC00003074-00.jpg"]
[83026,"Aising",-18,null,null,null,{"$f":"IF(Berechnung!$G$269=1,AI88,AL88)","v":"WPF 40"},5,4.67,9.1,0.45,43.1,false,false,false,true,false,"UPF 50/1-12 E",false,false,false,{"$f":"IF(Berechnung!$G$269=1,AJ88,AM88)","v":233006},true,false,"-","-",false,55.3,true,false,{"$f":"IF(Berechnung!$G$269=1,AK88,AN88)","v":"PIC00000830-00.jpg"},true,null,0,"WPF 40",233006,"PIC00000830-00.jpg","TTF 40",190366,"PIC00003074-00.jpg"]
[89344,"Aislingen",-16,null,null,null,{"$f":"IF(Berechnung!$G$269=1,AI89,AL89)","v":"WPF 52"},5,4.8099999999999996,11.6,0.45,52,false,false,false,true,false,"UPF 50/1-12 E",false,false,false,{"$f":"IF(Berechnung!$G$269=1,AJ89,AM89)","v":233007},true,false,"-","-",false,71.569999999999993,true,false,{"$f":"IF(Berechnung!$G$269=1,AK89,AN89)","v":"PIC00000830-00.jpg"},true,null,0,"WPF 52",233007,"PIC00000830-00.jpg","TTF 52",190367,"PIC00003074-00.jpg"]
[94330,"Aiterhofen",-18,null,null,null,{"$f":"IF(Berechnung!$G$269=1,AI90,AL90)","v":"WPF 66"},5,4.5599999999999996,14.2,0.48,67.099999999999994,false,false,false,true,false,"UPF 50/1-12 E",false,false,false,{"$f":"IF(Berechnung!$G$269=1,AJ90,AM90)","v":233008},true,false,"-","-",false,86.7,true,false,{"$f":"IF(Berechnung!$G$269=1,AK90,AN90)","v":"PIC00000830-00.jpg"},true,null,0,"WPF 66",233008,"PIC00000830-00.jpg","TTF 66",190368,"PIC00003074-00.jpg"]
[88319,"Aitrach",-16,null,null,null,{"$f":"IF(Berechnung!$G$269=1,AI91,AL91)","v":"WPF 20 SET"},5,4.49,4.4400000000000004,0.16,20.04,"2 x WPF 10 M",false,false,true,false,"2 x UPF 30/1-8 E",false,false,false,{"$f":"IF(Berechnung!$G$269=1,AJ91,AM91)","v":185365},true,true,"Grundfos SQE 7-15",0.39,false,25,false,false,{"$f":"IF(Berechnung!$G$269=1,AK91,AN91)","v":"PIC00002716-00.jpg"},true,null,0,"WPF 20 SET",185365,"PIC00002716-00.jpg","TTF 20 SET",190043,"PIC00003956-00.jpg"]
[87648,"Aitrang",-16,null,null,null,{"$f":"IF(Berechnung!$G$269=1,AI92,AL92)","v":"WPF 23 SET"},5,4.53,5.04,0.17,23,"WPF 13 M + WPF 10 M",false,false,true,false,"2 x UPF 30/1-8 E",false,false,false,{"$f":"IF(Berechnung!$G$269=1,AJ92,AM92)","v":185366},true,true,"Grundfos SQE 7-15",0.41,false,29.6,false,false,{"$f":"IF(Berechnung!$G$269=1,AK92,AN92)","v":"PIC00002716-00.jpg"},true,null,0,"WPF 23 SET",185366,"PIC00002716-00.jpg","TTF 23 SET",190044,"PIC00003956-00.jpg"]
[78554,"Aixheim",-18,null,null,null,{"$f":"IF(Berechnung!$G$269=1,AI93,AL93)","v":"WPF 26 SET"},5,4.57,5.64,0.18,25.96,"2 x WPF 13 M",false,false,true,false,"2 x UPF 30/1-8 E",false,false,false,{"$f":"IF(Berechnung!$G$269=1,AJ93,AM93)","v":182139},true,true,"Grundfos SQE 7-15",0.41499999999999998,false,34.200000000000003,false,false,{"$f":"IF(Berechnung!$G$269=1,AK93,AN93)","v":"PIC00002716-00.jpg"},true,null,0,"WPF 26 SET",182139,"PIC00002716-00.jpg","TTF 26 SET",190047,"PIC00003956-00.jpg"]
[37671,"Albaxen",-12,null,null,null,{"$f":"IF(Berechnung!$G$269=1,AI94,AL94)","v":"WPF 29 SET"},5,4.46,6.32,0.19,29.97,"WPF 16 M + WPF 13 M",false,false,true,false,"2 x UPF 30/1-8 E",false,false,false,{"$f":"IF(Berechnung!$G$269=1,AJ94,AM94)","v":220896},true,true,"Grundfos SQE 7-30",0.86,false,38.799999999999997,false,false,{"$f":"IF(Berechnung!$G$269=1,AK94,AN94)","v":"PIC00002716-00.jpg"},true,null,0,"WPF 29 SET",220896,"PIC00002716-00.jpg","TTF 29 SET",190104,"PIC00003956-00.jpg"]
[79774,"Albbruck",-12,null,null,null,{"$f":"IF(Berechnung!$G$269=1,AI95,AL95)","v":"WPF 32 SET"},5,4.3499999999999996,7,0.2,33.979999999999997,"2 x WPF 16 M",false,false,true,false,"2 x UPF 30/1-8 E",false,false,false,{"$f":"IF(Berechnung!$G$269=1,AJ95,AM95)","v":220897},true,true,"Grundfos SQE 7-30",0.86,false,43.4,false,false,{"$f":"IF(Berechnung!$G$269=1,AK95,AN95)","v":"PIC00002716-00.jpg"},true,null,0,"WPF 32 SET",220897,"PIC00002716-00.jpg","TTF 32 SET",190105,"PIC00003956-00.jpg"]
[8280,"Albernau    ",-16]
[92442,"Alberndorf",-16]
[8280,"Alberoda",-16]
[4420,"Albersdorf",-14]
[25767,"Albersdorf, Holst",-12]
[73095,"Albershausen",-16]
[48324,"Albersloh",-12,null,null,null,"Wasser-Wasser-Wärmepumpen"]
[76857,"Albersweiler",-12,null,null,null,"WP-Typ","DT","Leistungszahl","Leistungsaufnahme","Leistungsaufnahme","Heizleistung","WP-Set ?","WWB","EC-Pumpe Heizung","WMZ","EC-Pumpe Sole","Bezeichnung","LWM 250","Inverter ?","Sonderbauform","Artikel.nr.","In","EC-Pumpe Brunnen","EC-Pumpe Brunnen","Leistungsaufnahme","WPW ohne","Heizleistung","Kaskadierbar ?","EC-Pumpe","Produktbild","SG-ready ?",null,"Speichergröße","Name","Datenblatt","Produktbild","Name","Datenblatt","Produktbild"]
[88433,"Alberweiler",-16,null,null,null,null,"Prüfstand","B0/W35","B0/W35 [KW]","Solepumpe (EC)","B0/W35",null,"integriert","eingebaut ?","integriert ?","eingebaut ?","Solepumpe (EC)","einsetzbar ?",null,"Bafa-Liste ?",null,"Bafa-Liste ?","einsetzbar ?","Typ Grundfos","Brunnenpumpe","Zwischen-WT ?","B10/W35",null,"Heizung",null,null,null,"Warmwasser","Stiebel","Stiebel","Stiebel","tecalor","tecalor","tecalor"]
[72458,"Albstadt",-18,null,null,null,{"$f":"IF(Berechnung!$G$269=1,AI105,AL105)","v":"WPW 06 Set"},5,4.5199999999999996,1.056,0.04,4.7699999999999996,"WPF 04",false,true,true,true,"Yonos PARA RS 25/7.5",true,false,false,{"$f":"IF(Berechnung!$G$269=1,AJ105,AM105)","v":232948},true,true,"Grundfos SQE 5-15",0.21,false,6.22,false,"Yonos PARA 25/7.0",{"$f":"IF(Berechnung!$G$269=1,AK105,AN105)","v":"PIC00003715-00.jpg"},true,null,0,"WPW 06 Set",232948,"PIC00003715-00.jpg","TTW 06 Set",190357,"PIC00003715-00.jpg"]
[72461,"Albstadt",-18,null,null,null,{"$f":"IF(Berechnung!$G$269=1,AI106,AL106)","v":"WPW 07 Set"},5,4.79,1.214,5.5E-2,5.82,"WPF 05",false,true,true,true,"Yonos PARA RS 25/7.5",true,false,false,{"$f":"IF(Berechnung!$G$269=1,AJ106,AM106)","v":232949},true,true,"Grundfos SQE 5-15",0.22,false,7.26,false,"Yonos PARA 25/7.0",{"$f":"IF(Berechnung!$G$269=1,AK106,AN106)","v":"PIC00003715-00.jpg"},true,null,0,"WPW 07 Set",232949,"PIC00003715-00.jpg","TTW 07 Set",190358,"PIC00003715-00.jpg"]
[57258,"Alchen",-12,null,null,null,{"$f":"IF(Berechnung!$G$269=1,AI107,AL107)","v":"WPW 10 Set"},5,4.8499999999999996,1.5449999999999999,7.0000000000000007E-2,7.5,"WPF 07",false,true,true,true,"Stratos PARA 25/1-8",true,false,false,{"$f":"IF(Berechnung!$G$269=1,AJ107,AM107)","v":232950},true,true,"Grundfos SQE 5-15",0.23,false,9.67,false,"Yonos PARA 25/7.0",{"$f":"IF(Berechnung!$G$269=1,AK107,AN107)","v":"PIC00003715-00.jpg"},true,null,0,"WPW 10 Set",232950,"PIC00003715-00.jpg","TTW 10 Set",190359,"PIC00003715-00.jpg"]
[52457,"Aldenhoven",-12,null,null,null,{"$f":"IF(Berechnung!$G$269=1,AI108,AL108)","v":"WPW 13 Set"},5,5.0199999999999996,2.0550000000000002,7.4999999999999997E-2,10.31,"WPF 10",false,true,true,true,"Stratos PARA 25/1-8",true,false,false,{"$f":"IF(Berechnung!$G$269=1,AJ108,AM108)","v":232951},true,true,"Grundfos SQE 5-15",0.24,false,13.12,false,"Yonos PARA 25/7.5",{"$f":"IF(Berechnung!$G$269=1,AK108,AN108)","v":"PIC00003715-00.jpg"},true,null,0,"WPW 13 Set",232951,"PIC00003715-00.jpg","TTW 13 Set",190360,"PIC00003715-00.jpg"]
[94501,"Aldersbach",-16,null,null,null,{"$f":"IF(Berechnung!$G$269=1,AI109,AL109)","v":"WPW 18 Set"},5,4.83,2.7360000000000002,9.5000000000000001E-2,13.21,"WPF 13",false,true,true,true,"Stratos PARA 25/1-8",true,false,false,{"$f":"IF(Berechnung!$G$269=1,AJ109,AM109)","v":232952},true,true,"Grundfos SQE 5-15",0.255,false,16.899999999999999,false,"Yonos PARA 25/7.5",{"$f":"IF(Berechnung!$G$269=1,AK109,AN109)","v":"PIC00003715-00.jpg"},true,null,0,"WPW 18 Set",232952,"PIC00003715-00.jpg","TTW 18 Set",190361,"PIC00003715-00.jpg"]
[78554,"Aldingen",-18,null,null,null,{"$f":"IF(Berechnung!$G$269=1,AI110,AL110)","v":"WPW 22 Set"},5,4.54,3.7480000000000002,0.14000000000000001,17.02,"WPF 16",false,true,true,true,"Stratos PARA 25/1-12",true,false,false,{"$f":"IF(Berechnung!$G$269=1,AJ110,AM110)","v":232953},true,true,"Grundfos SQE 5-15",0.26,false,21.68,false,"Stratos Para 25/1-8",{"$f":"IF(Berechnung!$G$269=1,AK110,AN110)","v":"PIC00003715-00.jpg"},true,null,0,"WPW 22 Set",232953,"PIC00003715-00.jpg","TTW 22 Set",190362,"PIC00003715-00.jpg"]
[86733,"Alerheim",-16,null,null,null,{"$f":"IF(Berechnung!$G$269=1,AI111,AL111)","v":"WPW 10 Trend"},5,5.8,1.8,"-",10.4,false,false,true,true,false,"-",false,false,false,{"$f":"IF(Berechnung!$G$269=1,AJ111,AM111)","v":235953},true,true,"Grundfos SQE 5-15",0.24,true,10.4,false,"Stratos Para 25/1-8",{"$f":"IF(Berechnung!$G$269=1,AK111,AN111)","v":"PIC00006519-00.jpg"},true,null,0,"WPW 10 Trend",235953,"PIC00006519-00.jpg","WPW 10 Trend",null,"PIC00006519-00.jpg"]
[91793,"Alesheim",-16,null,null,null,{"$f":"IF(Berechnung!$G$269=1,AI112,AL112)","v":"WPW 12 Trend"},5,5.75,2.1,"-",12.3,false,false,true,true,false,"-",false,false,false,{"$f":"IF(Berechnung!$G$269=1,AJ112,AM112)","v":235954},true,true,"Grundfos SQE 5-15",0.25,true,12.3,false,"Stratos Para 25/1-8",{"$f":"IF(Berechnung!$G$269=1,AK112,AN112)","v":"PIC00006519-00.jpg"},true,null,0,"WPW 12 Trend",235954,"PIC00006519-00.jpg","WPW 12 Trend",null,"PIC00006519-00.jpg"]
[73553,"Alfdorf",-16,null,null,null,{"$f":"IF(Berechnung!$G$269=1,AI113,AL113)","v":"WPW 17 Trend"},5,5.9,2.8,"-",16.600000000000001,false,false,true,true,false,"-",false,false,false,{"$f":"IF(Berechnung!$G$269=1,AJ113,AM113)","v":235955},true,true,"Grundfos SQE 5-15",0.26,true,16.600000000000001,false,"Stratos Para 25/1-8",{"$f":"IF(Berechnung!$G$269=1,AK113,AN113)","v":"PIC00006519-00.jpg"},true,null,0,"WPW 17 Trend",235955,"PIC00006519-00.jpg","WPW 17 Trend",null,"PIC00006519-00.jpg"]
[31061,"Alfeld",-16,null,null,null,{"$f":"IF(Berechnung!$G$269=1,AI114,AL114)","v":"WPW 22 Trend"},5,5.9,3.7,"-",22.1,false,false,true,true,false,"-",false,false,false,{"$f":"IF(Berechnung!$G$269=1,AJ114,AM114)","v":235956},true,true,"Grundfos SQE 5-15",0.27,true,22.1,false,"Stratos Para 25/1-8",{"$f":"IF(Berechnung!$G$269=1,AK114,AN114)","v":"PIC00006519-00.jpg"},true,null,0,"WPW 22 Trend",235956,"PIC00006519-00.jpg","WPW 22 Trend",null,"PIC00006519-00.jpg"]
[91236,"Alfeld",-16,null,null,null,{"$f":"IF(Berechnung!$G$269=1,AI115,AL115)","v":"WPW 7 basic Set"},5,4.33,1.36,5.5E-2,5.88,"WPF 5 basic",false,true,true,false,"Stratos 30/1-8",true,false,false,{"$f":"IF(Berechnung!$G$269=1,AJ115,AM115)","v":230915},true,true,"Grundfos SQE 5-15",0.22,false,7.2,false,"Stratos Para 25/1-7",{"$f":"IF(Berechnung!$G$269=1,AK115,AN115)","v":"PIC00002722-00.jpg"},true,null,0,"WPW 7 basic Set",230915,"PIC00002722-00.jpg","WPW 7 basic Set",null,"PIC00002722-00.jpg"]
[91177,"Alfershausen",-16,null,null,null,{"$f":"IF(Berechnung!$G$269=1,AI116,AL116)","v":"WPW 10 basic Set"},5,4.5,1.7,7.0000000000000007E-2,7.64,"WPF 7 basic",false,true,true,false,"Stratos 30/1-8",true,false,false,{"$f":"IF(Berechnung!$G$269=1,AJ116,AM116)","v":230916},true,true,"Grundfos SQE 5-15",0.23,false,10,false,"Stratos Para 25/1-7",{"$f":"IF(Berechnung!$G$269=1,AK116,AN116)","v":"PIC00002722-00.jpg"},true,null,0,"WPW 10 basic Set",230916,"PIC00002722-00.jpg","WPW 10 basic Set",null,"PIC00002722-00.jpg"]
[49594,"Alfhausen",-12,null,null,null,{"$f":"IF(Berechnung!$G$269=1,AI117,AL117)","v":"WPW 13 basic Set"},5,4.37,2.2200000000000002,7.4999999999999997E-2,9.6999999999999993,"WPF 10 basic",false,true,true,false,"Stratos 30/1-8",true,false,false,{"$f":"IF(Berechnung!$G$269=1,AJ117,AM117)","v":230917},true,true,"Grundfos SQE 5-15",0.24,false,12.5,false,"Stratos Para 25/1-7",{"$f":"IF(Berechnung!$G$269=1,AK117,AN117)","v":"PIC00002722-00.jpg"},true,null,0,"WPW 13 basic Set",230917,"PIC00002722-00.jpg","WPW 13 basic Set",null,"PIC00002722-00.jpg"]
[53347,"Alfter",-12,null,null,null,{"$f":"IF(Berechnung!$G$269=1,AI118,AL118)","v":"WPW 18 basic Set"},5,4.42,2.85,9.5000000000000001E-2,12.59,"WPF 13 basic",false,true,true,false,"Stratos 30/1-8",true,false,false,{"$f":"IF(Berechnung!$G$269=1,AJ118,AM118)","v":230918},true,true,"Grundfos SQE 5-15",0.255,false,17.100000000000001,false,"Stratos Para 25/1-7",{"$f":"IF(Berechnung!$G$269=1,AK118,AN118)","v":"PIC00002722-00.jpg"},true,null,0,"WPW 18 basic Set",230918,"PIC00002722-00.jpg","WPW 18 basic Set",null,"PIC00002722-00.jpg"]
[99310,"Alkersleben",-14,null,null,null,{"$f":"IF(Berechnung!$G$269=1,AI119,AL119)","v":"WPC 04"},5,4.5199999999999996,1.056,0.04,4.7699999999999996,false,true,true,true,true,"Yonos PARA RS 25/7.5",true,false,false,{"$f":"IF(Berechnung!$G$269=1,AJ119,AM119)","v":232926},true,true,"Grundfos SQE 5-15",0.21,false,6.22,false,"Yonos PARA 25/7.0",{"$f":"IF(Berechnung!$G$269=1,AK119,AN119)","v":"PIC00003663-00.jpg"},true,null,175,"WPC 04",232926,"PIC00003663-00.jpg","TTC 04",190345,"PIC00003777-00.jpg"]
[59846,"Allendorf",-14,null,null,null,{"$f":"IF(Berechnung!$G$269=1,AI120,AL120)","v":"WPC 05"},5,4.79,1.214,5.5E-2,5.82,false,true,true,true,true,"Yonos PARA RS 25/7.5",true,false,false,{"$f":"IF(Berechnung!$G$269=1,AJ120,AM120)","v":232927},true,true,"Grundfos SQE 5-15",0.22,false,7.26,false,"Yonos PARA 25/7.0",{"$f":"IF(Berechnung!$G$269=1,AK120,AN120)","v":"PIC00003663-00.jpg"},true,null,175,"WPC 05",232927,"PIC00003663-00.jpg","TTC 05",190346,"PIC00003777-00.jpg"]
[35108,"Allendorf/Eder",-14,null,null,null,{"$f":"IF(Berechnung!$G$269=1,AI121,AL121)","v":"WPC 07"},5,4.8499999999999996,1.5449999999999999,7.0000000000000007E-2,7.5,false,true,true,true,true,"Stratos PARA 25/1-8",true,false,false,{"$f":"IF(Berechnung!$G$269=1,AJ121,AM121)","v":232928},true,true,"Grundfos SQE 5-15",0.23,false,9.67,false,"Yonos PARA 25/7.0",{"$f":"IF(Berechnung!$G$269=1,AK121,AN121)","v":"PIC00003663-00.jpg"},true,null,175,"WPC 07",232928,"PIC00003663-00.jpg","TTC 07",190347,"PIC00003777-00.jpg"]
[90584,"Allersberg",-16,null,null,null,{"$f":"IF(Berechnung!$G$269=1,AI122,AL122)","v":"WPC 10"},5,5.0199999999999996,2.0550000000000002,7.4999999999999997E-2,10.31,false,true,true,true,true,"Stratos PARA 25/1-8",true,false,false,{"$f":"IF(Berechnung!$G$269=1,AJ122,AM122)","v":232929},true,true,"Grundfos SQE 5-15",0.24,false,13.12,false,"Yonos PARA 25/7.5",{"$f":"IF(Berechnung!$G$269=1,AK122,AN122)","v":"PIC00003663-00.jpg"},true,null,162,"WPC 10",232929,"PIC00003663-00.jpg","TTC 10",190348,"PIC00003777-00.jpg"]
[88422,"Alleshausen",-16,null,null,null,{"$f":"IF(Berechnung!$G$269=1,AI123,AL123)","v":"WPC 13"},5,4.83,2.7360000000000002,9.5000000000000001E-2,13.21,false,true,true,true,true,"Stratos PARA 25/1-8",true,false,false,{"$f":"IF(Berechnung!$G$269=1,AJ123,AM123)","v":232930},true,true,"Grundfos SQE 5-15",0.255,false,16.899999999999999,false,"Yonos PARA 25/7.5",{"$f":"IF(Berechnung!$G$269=1,AK123,AN123)","v":"PIC00003663-00.jpg"},true,null,162,"WPC 13",232930,"PIC00003663-00.jpg","TTC 13",190349,"PIC00003777-00.jpg"]
[82239,"Alling",-16,null,null,null,{"$f":"IF(Berechnung!$G$269=1,AI124,AL124)","v":"WPC 04 cool"},5,4.5199999999999996,1.056,0.04,4.7699999999999996,false,true,true,true,true,"Yonos PARA RS 25/7.5",true,false,false,{"$f":"IF(Berechnung!$G$269=1,AJ124,AM124)","v":232931},true,true,"Grundfos SQE 5-15",0.21,false,6.22,false,"Yonos PARA 25/7.0",{"$f":"IF(Berechnung!$G$269=1,AK124,AN124)","v":"PIC00003663-00.jpg"},true,null,175,"WPC 04 cool",232931,"PIC00003663-00.jpg","TTC 04 cool",190350,"PIC00003777-00.jpg"]
[78464,"Allmannsdorf",-12,null,null,null,{"$f":"IF(Berechnung!$G$269=1,AI125,AL125)","v":"WPC 05 cool"},5,4.79,1.214,5.5E-2,5.82,false,true,true,true,true,"Yonos PARA RS 25/7.5",true,false,false,{"$f":"IF(Berechnung!$G$269=1,AJ125,AM125)","v":232932},true,true,"Grundfos SQE 5-15",0.22,false,7.26,false,"Yonos PARA 25/7.0",{"$f":"IF(Berechnung!$G$269=1,AK125,AN125)","v":"PIC00003663-00.jpg"},true,null,175,"WPC 05 cool",232932,"PIC00003663-00.jpg","TTC 05 cool",190351,"PIC00003777-00.jpg"]
[77963,"Allmannsweier",-12,null,null,null,{"$f":"IF(Berechnung!$G$269=1,AI126,AL126)","v":"WPC 07 cool"},5,4.8499999999999996,1.5449999999999999,7.0000000000000007E-2,7.5,false,true,true,true,true,"Stratos PARA 25/1-8",true,false,false,{"$f":"IF(Berechnung!$G$269=1,AJ126,AM126)","v":232933},true,true,"Grundfos SQE 5-15",0.23,false,9.67,false,"Yonos PARA 25/7.0",{"$f":"IF(Berechnung!$G$269=1,AK126,AN126)","v":"PIC00003663-00.jpg"},true,null,175,"WPC 07 cool",232933,"PIC00003663-00.jpg","TTC 07 cool",190352,"PIC00003777-00.jpg"]
[89604,"Allmendingen",-14,null,null,null,{"$f":"IF(Berechnung!$G$269=1,AI127,AL127)","v":"WPC 10 cool"},5,5.0199999999999996,2.0550000000000002,7.4999999999999997E-2,10.31,false,true,true,true,true,"Stratos PARA 25/1-8",true,false,false,{"$f":"IF(Berechnung!$G$269=1,AJ127,AM127)","v":232934},true,true,"Grundfos SQE 5-15",0.24,false,13.12,false,"Yonos PARA 25/7.5",{"$f":"IF(Berechnung!$G$269=1,AK127,AN127)","v":"PIC00003663-00.jpg"},true,null,162,"WPC 10 cool",232934,"PIC00003663-00.jpg","TTC 10 cool",190353,"PIC00003777-00.jpg"]
[71573,"Allmersbach im Tal",-14,null,null,null,{"$f":"IF(Berechnung!$G$269=1,AI128,AL128)","v":"WPC 13 cool"},5,4.83,2.7360000000000002,9.5000000000000001E-2,13.21,false,true,true,true,true,"Stratos PARA 25/1-8",true,false,false,{"$f":"IF(Berechnung!$G$269=1,AJ128,AM128)","v":232935},true,true,"Grundfos SQE 5-15",0.255,false,16.899999999999999,false,"Yonos PARA 25/7.5",{"$f":"IF(Berechnung!$G$269=1,AK128,AN128)","v":"PIC00003663-00.jpg"},true,null,162,"WPC 13 cool",232935,"PIC00003663-00.jpg","TTC 13 cool",190354,"PIC00003777-00.jpg"]
[6507,"Allrode / Harz",-16,null,null,null,{"$f":"IF(Berechnung!$G$269=1,AI129,AL129)","v":"WPF 04 cool"},5,4.5199999999999996,1.056,0.04,4.7699999999999996,false,false,true,true,true,"Yonos PARA RS 25/7.5",true,false,false,{"$f":"IF(Berechnung!$G$269=1,AJ129,AM129)","v":232915},true,true,"Grundfos SQE 5-15",0.21,false,6.22,false,"Yonos PARA 25/7.0",{"$f":"IF(Berechnung!$G$269=1,AK129,AN129)","v":"PIC00003403-00.jpg"},true,null,0,"WPF 04 cool",232915,"PIC00003403-00.jpg","TTF 04 cool",190339,"PIC00003730-00.jpg"]
[6542,"Allstedt",-14,null,null,null,{"$f":"IF(Berechnung!$G$269=1,AI130,AL130)","v":"WPF 05 cool"},5,4.79,1.214,5.5E-2,5.82,false,false,true,true,true,"Yonos PARA RS 25/7.5",true,false,false,{"$f":"IF(Berechnung!$G$269=1,AJ130,AM130)","v":232916},true,true,"Grundfos SQE 5-15",0.22,false,7.26,false,"Yonos PARA 25/7.0",{"$f":"IF(Berechnung!$G$269=1,AK130,AN130)","v":"PIC00003403-00.jpg"},true,null,0,"WPF 05 cool",232916,"PIC00003403-00.jpg","TTF 05 cool",190340,"PIC00003730-00.jpg"]
[31079,"Almstedt",-16,null,null,null,{"$f":"IF(Berechnung!$G$269=1,AI131,AL131)","v":"WPF 07 cool"},5,4.8499999999999996,1.5449999999999999,7.0000000000000007E-2,7.5,false,false,true,true,true,"Stratos PARA 25/1-8",true,false,false,{"$f":"IF(Berechnung!$G$269=1,AJ131,AM131)","v":232917},true,true,"Grundfos SQE 5-15",0.23,false,9.67,false,"Yonos PARA 25/7.0",{"$f":"IF(Berechnung!$G$269=1,AK131,AN131)","v":"PIC00003403-00.jpg"},true,null,0,"WPF 07 cool",232917,"PIC00003403-00.jpg","TTF 07 cool",190341,"PIC00003730-00.jpg"]
[46519,"Alpen",-10,null,null,null,{"$f":"IF(Berechnung!$G$269=1,AI132,AL132)","v":"WPF 10 cool"},5,5.0199999999999996,2.0550000000000002,7.4999999999999997E-2,10.31,false,false,true,true,true,"Stratos PARA 25/1-8",true,false,false,{"$f":"IF(Berechnung!$G$269=1,AJ132,AM132)","v":232918},true,true,"Grundfos SQE 5-15",0.24,false,13.12,false,"Yonos PARA 25/7.5",{"$f":"IF(Berechnung!$G$269=1,AK132,AN132)","v":"PIC00003403-00.jpg"},true,null,0,"WPF 10 cool",232918,"PIC00003403-00.jpg","TTF 10 cool",190342,"PIC00003730-00.jpg"]
[46519,"Alpen-Bönninghardt",-10,null,null,null,{"$f":"IF(Berechnung!$G$269=1,AI133,AL133)","v":"WPF 13 cool"},5,4.83,2.7360000000000002,9.5000000000000001E-2,13.21,false,false,true,true,true,"Stratos PARA 25/1-8",true,false,false,{"$f":"IF(Berechnung!$G$269=1,AJ133,AM133)","v":232919},true,true,"Grundfos SQE 5-15",0.255,false,16.899999999999999,false,"Yonos PARA 25/7.5",{"$f":"IF(Berechnung!$G$269=1,AK133,AN133)","v":"PIC00003403-00.jpg"},true,null,0,"WPF 13 cool",232919,"PIC00003403-00.jpg","TTF 13 cool",190343,"PIC00003730-00.jpg"]
[99195,"Alperstedt",-14,null,null,null,{"$f":"IF(Berechnung!$G$269=1,AI134,AL134)","v":"WPF 16 cool"},5,4.54,3.7480000000000002,0.14000000000000001,17.02,false,false,true,true,true,"Stratos PARA 25/1-12",true,false,false,{"$f":"IF(Berechnung!$G$269=1,AJ134,AM134)","v":232920},true,true,"Grundfos SQE 5-15",0.26,false,21.68,false,"Stratos PARA 25/1-8",{"$f":"IF(Berechnung!$G$269=1,AK134,AN134)","v":"PIC00003403-00.jpg"},true,null,0,"WPF 16 cool",232920,"PIC00003403-00.jpg","TTF 16 cool",190344,"PIC00003730-00.jpg"]
[72275,"Alpirsbach",-16,null,null,null,{"$f":"IF(Berechnung!$G$269=1,AI135,AL135)","v":"WPF 10 M"},5,4.49,2.2200000000000002,7.4999999999999997E-2,10.02,false,false,false,true,false,"Stratos 30/1-8",true,false,false,{"$f":"IF(Berechnung!$G$269=1,AJ135,AM135)","v":185349},true,true,"Grundfos SQE 5-15",0.24,false,12.5,true,false,{"$f":"IF(Berechnung!$G$269=1,AK135,AN135)","v":"PIC00000594-00.jpg"},true,null,0,"WPF 10 M",185349,"PIC00000594-00.jpg","TTF 10 M",190058,"PIC00003954-00.jpg"]
[54668,"Alsdorf",-14,null,null,null,{"$f":"IF(Berechnung!$G$269=1,AI136,AL136)","v":"WPF 13 M"},5,4.57,2.82,9.5000000000000001E-2,12.98,false,false,false,true,false,"Stratos 30/1-8",true,false,false,{"$f":"IF(Berechnung!$G$269=1,AJ136,AM136)","v":182135},true,true,"Grundfos SQE 5-15",0.255,false,17.100000000000001,true,false,{"$f":"IF(Berechnung!$G$269=1,AK136,AN136)","v":"PIC00000594-00.jpg"},true,null,0,"WPF 13 M",182135,"PIC00000594-00.jpg","TTF 13 M",190045,"PIC00003954-00.jpg"]
[52477,"Alsdorf/Rheinl.",-12,null,null,null,{"$f":"IF(Berechnung!$G$269=1,AI137,AL137)","v":"WPF 16 M"},5,4.3499999999999996,3.5,0.09,16.989999999999998,false,false,false,true,false,"Stratos 30/1-8",true,false,false,{"$f":"IF(Berechnung!$G$269=1,AJ137,AM137)","v":220894},true,true,"Grundfos SQE 5-15",0.26,false,21.7,true,false,{"$f":"IF(Berechnung!$G$269=1,AK137,AN137)","v":"PIC00000594-00.jpg"},true,null,0,"WPF 16 M",220894,"PIC00000594-00.jpg","TTF 16 M",190102,"PIC00003954-00.jpg"]
[67722,"Alsenbrück",-12,null,null,null,{"$f":"IF(Berechnung!$G$269=1,AI138,AL138)","v":"WPF 20"},5,4.66,4.5,0.18,21.5,false,false,false,true,false,"UPF 40/1-8 E",false,false,false,{"$f":"IF(Berechnung!$G$269=1,AJ138,AM138)","v":233003},true,true,"Grundfos SQE 7-15",0.4,false,27.9,true,false,{"$f":"IF(Berechnung!$G$269=1,AK138,AN138)","v":"PIC00000830-00.jpg"},true,null,0,"WPF 20",233003,"PIC00000830-00.jpg","TTF 20",190363,"PIC00003074-00.jpg"]
[36304,"Alsfeld",-14,null,null,null,{"$f":"IF(Berechnung!$G$269=1,AI139,AL139)","v":"WPF 27"},5,4.8499999999999996,6.1,0.22,29.7,false,false,false,true,false,"UPF 40/1-8 E",false,false,false,{"$f":"IF(Berechnung!$G$269=1,AJ139,AM139)","v":233004},true,true,"Grundfos SQE 7-30",0.86,false,37.83,true,false,{"$f":"IF(Berechnung!$G$269=1,AK139,AN139)","v":"PIC00000830-00.jpg"},true,null,0,"WPF 27",233004,"PIC00000830-00.jpg","TTF 27",190364,"PIC00003074-00.jpg"]
[67577,"Alsheim",-12,null,null,null,{"$f":"IF(Berechnung!$G$269=1,AI140,AL140)","v":"WPF 27 HT"},5,4.34,6.1,0.22,27.41,false,false,false,true,false,"UPF 40/1-8 E",false,false,false,{"$f":"IF(Berechnung!$G$269=1,AJ140,AM140)","v":233009},true,true,"Grundfos SQE 7-30",0.86,false,35.299999999999997,true,false,{"$f":"IF(Berechnung!$G$269=1,AK140,AN140)","v":"PIC00000830-00.jpg"},true,null,0,"WPF 27 HT",233009,"PIC00000830-00.jpg","TTF 27 HT",190369,"PIC00003074-00.jpg"]
[57515,"Alsting (Frankreich)",-12,null,null,null,{"$f":"IF(Berechnung!$G$269=1,AI141,AL141)","v":"WPF 35"},5,4.72,7.98,0.35,37.700000000000003,false,false,false,true,false,"UPF 50/1-12 E",false,false,false,{"$f":"IF(Berechnung!$G$269=1,AJ141,AM141)","v":233005},true,false,"-","-",false,49.03,true,false,{"$f":"IF(Berechnung!$G$269=1,AK141,AN141)","v":"PIC00000830-00.jpg"},true,null,0,"WPF 35",233005,"PIC00000830-00.jpg","TTF 35",190365,"PIC00003074-00.jpg"]
[19303,"Alt Jabel",-12,null,null,null,{"$f":"IF(Berechnung!$G$269=1,AI142,AL142)","v":"WPF 40"},5,4.67,9.1,0.45,43.1,false,false,false,true,false,"UPF 50/1-12 E",false,false,false,{"$f":"IF(Berechnung!$G$269=1,AJ142,AM142)","v":233006},true,false,"-","-",false,55.3,true,false,{"$f":"IF(Berechnung!$G$269=1,AK142,AN142)","v":"PIC00000830-00.jpg"},true,null,0,"WPF 40",233006,"PIC00000830-00.jpg","TTF 40",190366,"PIC00003074-00.jpg"]
[18236,"Alt Karin",-10,null,null,null,{"$f":"IF(Berechnung!$G$269=1,AI143,AL143)","v":"WPF 52"},5,4.8099999999999996,11.6,0.45,52,false,false,false,true,false,"UPF 50/1-12 E",false,false,false,{"$f":"IF(Berechnung!$G$269=1,AJ143,AM143)","v":233007},true,false,"-","-",false,71.569999999999993,true,false,{"$f":"IF(Berechnung!$G$269=1,AK143,AN143)","v":"PIC00000830-00.jpg"},true,null,0,"WPF 52",233007,"PIC00000830-00.jpg","TTF 52",190367,"PIC00003074-00.jpg"]
[75365,"Altburg ",-16,null,null,null,{"$f":"IF(Berechnung!$G$269=1,AI144,AL144)","v":"WPF 66"},5,4.5599999999999996,14.2,0.48,67.099999999999994,false,false,false,true,false,"UPF 50/1-12 E",false,false,false,{"$f":"IF(Berechnung!$G$269=1,AJ144,AM144)","v":233008},true,false,"-","-",false,86.7,true,false,{"$f":"IF(Berechnung!$G$269=1,AK144,AN144)","v":"PIC00000830-00.jpg"},true,null,0,"WPF 66",233008,"PIC00000830-00.jpg","TTF 66",190368,"PIC00003074-00.jpg"]
[3229,"Altdöbern",-16,null,null,null,{"$f":"IF(Berechnung!$G$269=1,AI145,AL145)","v":"WPF 20 SET"},5,4.49,4.4400000000000004,0.16,20.04,"2 x WPF 10 M",false,false,true,false,"2 x UPF 30/1-8 E",false,false,false,{"$f":"IF(Berechnung!$G$269=1,AJ145,AM145)","v":185365},true,true,"Grundfos SQE 7-15",0.39,false,25,false,false,{"$f":"IF(Berechnung!$G$269=1,AK145,AN145)","v":"PIC00002716-00.jpg"},true,null,0,"WPF 20 SET",185365,"PIC00002716-00.jpg","TTF 20 SET",190043,"PIC00003956-00.jpg"]
[71155,"Altdorf",-16,null,null,null,{"$f":"IF(Berechnung!$G$269=1,AI146,AL146)","v":"WPF 23 SET"},5,4.53,5.04,0.17,23,"WPF 13 M + WPF 10 M",false,false,true,false,"2 x UPF 30/1-8 E",false,false,false,{"$f":"IF(Berechnung!$G$269=1,AJ146,AM146)","v":185366},true,true,"Grundfos SQE 7-15",0.41,false,29.6,false,false,{"$f":"IF(Berechnung!$G$269=1,AK146,AN146)","v":"PIC00002716-00.jpg"},true,null,0,"WPF 23 SET",185366,"PIC00002716-00.jpg","TTF 23 SET",190044,"PIC00003956-00.jpg"]
[72655,"Altdorf",-16,null,null,null,{"$f":"IF(Berechnung!$G$269=1,AI147,AL147)","v":"WPF 26 SET"},5,4.57,5.64,0.18,25.96,"2 x WPF 13 M",false,false,true,false,"2 x UPF 30/1-8 E",false,false,false,{"$f":"IF(Berechnung!$G$269=1,AJ147,AM147)","v":182139},true,true,"Grundfos SQE 7-15",0.41499999999999998,false,34.200000000000003,false,false,{"$f":"IF(Berechnung!$G$269=1,AK147,AN147)","v":"PIC00002716-00.jpg"},true,null,0,"WPF 26 SET",182139,"PIC00002716-00.jpg","TTF 26 SET",190047,"PIC00003956-00.jpg"]
[77955,"Altdorf",-12,null,null,null,{"$f":"IF(Berechnung!$G$269=1,AI148,AL148)","v":"WPF 29 SET"},5,4.46,6.32,0.19,29.97,"WPF 16 M + WPF 13 M",false,false,true,false,"2 x UPF 30/1-8 E",false,false,false,{"$f":"IF(Berechnung!$G$269=1,AJ148,AM148)","v":220896},true,true,"Grundfos SQE 7-30",0.86,false,38.799999999999997,false,false,{"$f":"IF(Berechnung!$G$269=1,AK148,AN148)","v":"PIC00002716-00.jpg"},true,null,0,"WPF 29 SET",220896,"PIC00002716-00.jpg","TTF 29 SET",190104,"PIC00003956-00.jpg"]
[84032,"Altdorf",-16,null,null,null,{"$f":"IF(Berechnung!$G$269=1,AI149,AL149)","v":"WPF 32 SET"},5,4.3499999999999996,7,0.2,33.979999999999997,"2 x WPF 16 M",false,false,true,false,"2 x UPF 30/1-8 E",false,false,false,{"$f":"IF(Berechnung!$G$269=1,AJ149,AM149)","v":220897},true,true,"Grundfos SQE 7-30",0.86,false,43.4,false,false,{"$f":"IF(Berechnung!$G$269=1,AK149,AN149)","v":"PIC00002716-00.jpg"},true,null,0,"WPF 32 SET",220897,"PIC00002716-00.jpg","TTF 32 SET",190105,"PIC00003956-00.jpg"]
[90518,"Altdorf",-16]
[83549,"Alteiselfing",-16]
[58762,"Altena / Westf.",-12,null,null,null,"Warmwasser-Wärmepumpen"]
[53505,"Altenahr",-14,null,null,null,"WP-Typ","Leistungszahl","Temperatur","Faktor","Faktor F2","Kurzbezeichnung",null,null,null,null,null,null,null,null,null,null,null,null,null,null,null,null,null,null,null,null,null,null,"Name","Kurzname","Produktbild","Name","Kurzname","Produktbild"]
[38707,"Altenau",-16,null,null,null,null,"W15/W50","Prüfstand","F1","Kellerluft=0,9, Abluft = 1",null,null,null,null,null,null,null,null,null,null,null,null,null,null,null,null,null,null,null,null,null,null,null,"Stiebel","Stiebel","Stiebel","tecalor","tecalor","tecalor"]
[4828,"Altenbach",-14,null,null,null,{"$f":"IF(Berechnung!$G$269=1,AI158,AL158)","v":"WWK 220 electronic"},3.42,55,{"$f":"IF(I155=\"\",\"\",0.01*I155+0.5)","v":1.05},0.9,{"$f":"IF(Berechnung!$G$269=1,AJ158,AM158)","v":"WWK 220 E"},null,null,null,null,null,null,null,null,null,null,null,null,null,null,null,null,null,null,null,null,null,null,"WWK 300","WWK 300",null,"TTA 300","TTA 300"]
[55585,"Altenbamberg",-12,null,null,null,{"$f":"IF(Berechnung!$G$269=1,AI159,AL159)","v":"WWK 300 electronic"},3.82,55,{"$f":"IF(I156=\"\",\"\",0.01*I156+0.5)","v":1.05},0.9,{"$f":"IF(Berechnung!$G$269=1,AJ159,AM159)","v":"WWK 300 E"},null,null,null,null,null,null,null,null,null,null,null,null,null,null,null,null,null,null,null,null,null,null,"LWA 252","LWA 252",null,"TVD 250","TVD 250"]
[33184,"Altenbeken",-14,null,null,null,{"$f":"IF(Berechnung!$G$269=1,AI160,AL160)","v":"WWK 300 electronic SOL"},3.82,55,{"$f":"IF(I157=\"\",\"\",0.01*I157+0.5)","v":1.05},0.9,{"$f":"IF(Berechnung!$G$269=1,AJ160,AM160)","v":"WWK 300 E SOL"},null,null,null,null,null,null,null,null,null,null,null,null,null,null,null,null,null,null,null,null,null,null,"LWA 100","LWA 100",null,"TVD 100","TVD 100"]
[1773,"Altenberg",-16,null,null,null,{"$f":"IF(Berechnung!$G$269=1,AI161,AL161)","v":"WWK 221 electronic"},3.4,55,1.05,0.9,{"$f":"IF(Berechnung!$G$269=1,AJ161,AM161)","v":"WWK 221 E"},null,null,null,null,null,null,null,null,null,null,null,null,null,null,null,null,null,null,null,null,null,null,"WWK 220 electronic","WWK 220 E",null,"TTA 220 electronic","TTA 220 E"]
[48341,"Altenberge",-12,null,null,null,{"$f":"IF(Berechnung!$G$269=1,AI162,AL162)","v":"WWK 301 electronic"},3.8,55,1.05,0.9,{"$f":"IF(Berechnung!$G$269=1,AJ162,AM162)","v":"WWK 301 E"},null,null,null,null,null,null,null,null,null,null,null,null,null,null,null,null,null,null,null,null,null,null,"WWK 300 electronic","WWK 300 E",null,"TTA 300 electronic","TTA 300 E"]
[49733,"Altenberge",-10,null,null,null,{"$f":"IF(Berechnung!$G$269=1,AI163,AL163)","v":"WWK 301 electronic SOL"},3.8,55,{"$f":"IF(I160=\"\",\"\",0.01*I160+0.5)","v":1.05},0.9,{"$f":"IF(Berechnung!$G$269=1,AJ163,AM163)","v":"WWK 301 E SOL"},null,null,null,null,null,null,null,null,null,null,null,null,null,null,null,null,null,null,null,null,null,null,"WWK 300 electronic SOL","WWK 300 E SOL",null,"TTA 300 electronic SOL","TTA 300 E SOL"]
[34587,"Altenbrunslar",-14,null,null,null,{"$f":"IF(Berechnung!$G$269=1,AI164,AL164)","v":"WWS 20"},3.8,55,1.05,0.9,{"$f":"IF(Berechnung!$G$269=1,AJ164,AM164)","v":"WWS 20"},null,null,null,null,null,null,null,null,null,null,null,null,null,null,null,null,null,null,null,null,null,null,"WWK 221 electronic","WWK 221 E",null,"TTA 221 electronic","TTA 221 E"]
[4600,"Altenburg",-14,null,null,null,{"$f":"IF(Berechnung!$G$269=1,AI156,AL156)","v":"LWA 252"},4.2,55,{"$f":"IF(I162=\"\",\"\",0.01*I162+0.5)","v":1.05},1,{"$f":"IF(Berechnung!$G$269=1,AJ156,AM156)","v":"LWA 252"},null,null,null,null,null,null,null,null,null,null,null,null,null,null,null,null,null,null,null,null,null,null,"WWK 301 electronic","WWK 301 E",null,"TTA 301 electronic","TTA 301 E"]
[34587,"Altenburg",-14,null,null,null,{"$f":"IF(Berechnung!$G$269=1,AI157,AL157)","v":"LWA 100"},2.8,55,{"$f":"IF(I163=\"\",\"\",0.01*I163+0.5)","v":1.05},1,{"$f":"IF(Berechnung!$G$269=1,AJ157,AM157)","v":"LWA 100"},null,null,null,null,null,null,null,null,null,null,null,null,null,null,null,null,null,null,null,null,null,null,"WWK 301 electronic SOL","WWK 301 E SOL",null,"TTA 301 electronic SOL","TTA 301 E SOL"]
[29574,"Altenebstorf",-14,null,null,null,null,null,null,{"$f":"IF(I164=\"\",\"\",0.01*I164+0.5)","v":""},null,null,null,null,null,null,null,null,null,null,null,null,null,null,null,null,null,null,null,null,null,null,null,null,"WWS 20","WWS 20",null,"WWS 20","WWS 20"]
[45329,"Altenessen",-10,null,null,null,null,null,null,{"$f":"IF(I165=\"\",\"\",0.01*I165+0.5)","v":""}]
[98701,"Altenfeld",-16,null,null,null,null,null,null,""]
[66885,"Altenglau",-14,null,null,null,null,null,null,{"$f":"IF(I167=\"\",\"\",0.01*I167+0.5)","v":""}]
[36391,"Altengronau",-14,null,null,null,null,null,null,""]
[31558,"Altenhagen",-14]
[33729,"Altenhagen",-12]
[85356,"Altenhausen",-16]
[77743,"Altenheim",-12]
[16244,"Altenhof",-14]
[96479,"Altenhof",-16]
[24161,"Altenholz",-10]
[57368,"Altenhundem",-14]
[57610,"Altenkirchen",-14]
[66903,"Altenkirchen",-12]
[23730,"Altenkrempe",-10]
[83352,"Altenmarkt",-16]
[29575,"Altenmedingen",-12]
[86450,"Altenmünster",-16,null,null,null,null,null,null,{"$f":"IF(I169=\"\",\"\",0.01*I169+0.5)","v":""}]
[26169,"Altenoythe",-12,null,null,null,null,null,null,{"$f":"IF(I170=\"\",\"\",0.01*I170+0.5)","v":""}]
[95500,"Altenplos",-16,null,null,null,null,null,null,{"$f":"IF(I171=\"\",\"\",0.01*I171+0.5)","v":""}]
[72657,"Altenriet",-16,null,null,null,null,null,null,{"$f":"IF(I172=\"\",\"\",0.01*I172+0.5)","v":""}]
[6642,"Altenrode",-14,null,null,null,null,null,null,{"$f":"IF(I175=\"\",\"\",0.01*I175+0.5)","v":""}]
[63674,"Altenstadt",-12,null,null,null,null,null,null,{"$f":"IF(I187=\"\",\"\",0.01*I187+0.5)","v":""}]
[89281,"Altenstadt",-16,null,null,null,null,null,null,{"$f":"IF(I188=\"\",\"\",0.01*I188+0.5)","v":""}]
[92665,"Altenstadt",-16]
[72213,"Altensteig",-16]
[17087,"Altentreptow",-14]
[97327,"Altertheim",-14]
[66802,"Altforweiler",-12]
[1462,"Altfranken",-14]
[84169,"Altfraunhofen",-16]
[9326,"Altgeringswalde",-14]
[82278,"Althegnenberg",-16]
[72160,"Altheim",-16,null,null,null,"Manuelle Eingabe WW-Wärmepumpe"]
[74731,"Altheim",-16,null,null,null,"Eigene WW-Wärmepumpe",{"$f":"Berechnung!W244","v":"3,4"},{"$f":"LEFT(Berechnung!W245,2)*1","v":55},{"$f":"IF(I199=\"\",\"\",0.01*I199+0.5)","v":1.05},0.9,{"$f":"Berechnung!W243","v":"WWK 222"}]
[77743,"Altheim",-12,null,null,null,"Eigene Abluft-Wärmepumpe",{"$f":"Berechnung!W244","v":"3,4"},{"$f":"LEFT(Berechnung!W245,2)*1","v":55},{"$f":"IF(I200=\"\",\"\",0.01*I200+0.5)","v":1.05},1,{"$f":"Berechnung!W243","v":"WWK 222"}]
[88433,"Altheim",-16]
[89174,"Altheim",-16,null,null,null,"Solarkollektoren"]
[89195,"Altheim",-16,null,null,null,"Typ","Fläche","Wirkungsgrad","Ausführung",null,null,null,null,null,null,null,null,null,null,null,"Artikelnr.",null,null,null,null,null,null,null,null,"Produktbild",null,null,null,"Name","Datenblatt","Produktbild","Name","Datenblatt","Produktbild"]
[89605,"Altheim",-14,null,null,null,null,"m²","-",null,null,null,null,null,null,null,null,null,null,null,null,null,null,null,null,null,null,null,null,null,null,null,null,null,"Stiebel","Stiebel","Stiebel","tecalor","tecalor","tecalor"]
[88499,"Altheim   ( b Riedlingen,Württ )",-14,null,null,null,{"$f":"IF(Berechnung!$G$269=1,AI205,AL205)","v":"SOL 27 premium S"},2.5499999999999998,"82,3 %","Aufdach",null,null,null,null,null,null,null,null,null,null,null,{"$f":"IF(Berechnung!$G$269=1,AJ205,AM205)","v":230016},null,null,null,null,null,null,null,null,{"$f":"IF(Berechnung!$G$269=1,AK205,AN205)","v":"PIC00001016-00.jpg"},null,null,null,"SOL 27 premium S",230016,"PIC00001016-00.jpg","TSK 27 premium S",190235,"PIC00002980-00.jpg"]
[4451,"Althen",-14,null,null,null,{"$f":"IF(Berechnung!$G$269=1,AI206,AL206)","v":"SOL 27 premium W"},2.5499999999999998,"82,5 %","Aufdach",null,null,null,null,null,null,null,null,null,null,null,{"$f":"IF(Berechnung!$G$269=1,AJ206,AM206)","v":230017},null,null,null,null,null,null,null,null,{"$f":"IF(Berechnung!$G$269=1,AK206,AN206)","v":"PIC00001017-00.jpg"},null,null,null,"SOL 27 premium W",230017,"PIC00001017-00.jpg","TSK 27 premium W",190236,"PIC00002981-00.jpg"]
[75382,"Althengstett",-14,null,null,null,{"$f":"IF(Berechnung!$G$269=1,AI207,AL207)","v":"SOL 27 basic S"},2.5299999999999998,"79 %","Aufdach",null,null,null,null,null,null,null,null,null,null,null,{"$f":"IF(Berechnung!$G$269=1,AJ207,AM207)","v":228927},null,null,null,null,null,null,null,null,{"$f":"IF(Berechnung!$G$269=1,AK207,AN207)","v":"PIC00001678-00.jpg"},null,null,null,"SOL 27 basic S",228927,"PIC00001678-00.jpg","TSK 27 basic S",229617,"PIC00003093-00.jpg"]
[71566,"Althütte",-14,null,null,null,{"$f":"IF(Berechnung!$G$269=1,AI208,AL208)","v":"SOL 27 basic W"},2.5299999999999998,"≥78 %","Aufdach",null,null,null,null,null,null,null,null,null,null,null,{"$f":"IF(Berechnung!$G$269=1,AJ208,AM208)","v":230912},null,null,null,null,null,null,null,null,{"$f":"IF(Berechnung!$G$269=1,AK208,AN208)","v":"PIC00001134-00.jpg"},null,null,null,"SOL 27 basic W",230912,"PIC00001134-00.jpg","TSK 27 basic W",230912,"PIC00001134-00.jpg"]
[72119,"Altingen",-16,null,null,null,{"$f":"IF(Berechnung!$G$269=1,AI209,AL209)","v":"SOL 23 premium"},2.33,"81 %","Indach",null,null,null,null,null,null,null,null,null,null,null,{"$f":"IF(Berechnung!$G$269=1,AJ209,AM209)","v":230020},null,null,null,null,null,null,null,null,{"$f":"IF(Berechnung!$G$269=1,AK209,AN209)","v":"PIC00001018-00.jpg"},null,null,null,"SOL 23 premium",230020,"PIC00001018-00.jpg","TSK 23 premium",190234,"PIC00003079-00.jpg"]
[82054,"Altkirchen",-16]
[19288,"Alt-Krenzlin",-14]
[68804,"Altlußheim",-12]
[73479,"Altmannsrot",-16]
[93336,"Altmannstein",-16,null,null,null,null,null,null,{"$f":"IF(I214=\"\",\"\",0.01*I214+0.5)","v":""}]
[23881,"Alt-Mölln",-12,null,null,null,null,null,null,""]
[84453,"Altmühldorf",-16,null,null,null,null,null,null,""]
[85250,"Altomünster",-16,null,null,null,null,null,null,""]
[77815,"Altschweier",-14,null,null,null,null,null,null,""]
[17214,"Alt-Schwerin",-12]
[88361,"Altshausen",-14]
[79263,"Altsimonswald",-16]
[89584,"Altsteußlingen",-14]
[56858,"Altstrimmig",-12]
[88364,"Alttann",-16]
[17375,"Altwarp",-12]
[63755,"Alzenau",-12]
[53783,"Alzenbach",-12]
[75365,"Alzenberg",-16]
[55232,"Alzey",-12]
[56727,"Alzheim",-14]
[86676,"Ambach",-16]
[86854,"Amberg",-16,null,null,null,null,null,null,{"$f":"IF(I219=\"\",\"\",0.01*I219+0.5)","v":""}]
[92224,"Amberg / Oberpf.",-16,null,null,null,null,null,null,{"$f":"IF(I220=\"\",\"\",0.01*I220+0.5)","v":""}]
[48165,"Amelsbüren",-12,null,null,null,null,null,null,{"$f":"IF(I221=\"\",\"\",0.01*I221+0.5)","v":""}]
[37688,"Amelunxen",-14,null,null,null,null,null,null,{"$f":"IF(I222=\"\",\"\",0.01*I222+0.5)","v":""}]
[83123,"Amerang",-16,null,null,null,null,null,null,{"$f":"IF(I225=\"\",\"\",0.01*I225+0.5)","v":""}]
[4683,"Ammelshain",-14,null,null,null,null,null,null,{"$f":"IF(I237=\"\",\"\",0.01*I237+0.5)","v":""}]
[7407,"Ammelstädt",-14,null,null,null,null,null,null,{"$f":"IF(I238=\"\",\"\",0.01*I238+0.5)","v":""}]
[72119,"Ammerbuch",-16,null,null,null,null,null,null,{"$f":"IF(I239=\"\",\"\",0.01*I239+0.5)","v":""}]
[22949,"Ammersbek",-12]
[35287,"Amöneburg",-12]
[85241,"Ampermoching",-16]
[88436,"Ampfelbronn",-16]
[33803,"Amshausen",-14]
[73340,"Amstetten",-16]
[9439,"Amtsberg",-14]
[1855,"Amtshainersdorf",-16]
[88279,"Amtzell",-16]
[84098,"Andermannsdorf",-18]
[56626,"Andernach",-12]
[99189,"Andisleben",-14]
[29413,"Andorf",-14]
[74918,"Angelbachtal",-12]
[35719,"Angelburg",-14]
[48143,"Angelmodde",-12]
[99338,"Angelroda",-16]
[40489,"Angermund",-10]
[16278,"Angermünde",-14]
[56584,"Anhausen",-14]
[72534,"Anhausen",-16]
[86420,"Anhausen",-16]
[17389,"Anklam",-12]
[49577,"Ankum",-12]
[9456,"Annaberg-Buchholz",-16]
[33129,"Anreppen",-12]
[91522,"Ansbach / Mittelfr.",-16]
[9517,"Ansprung",-16]
[82387,"Antdorf",-18]
[36326,"Antrifttal",-14]
[84371,"Anzenkirchen",-16]
[85646,"Anzing",-16]
[31552,"Apelern",-14]
[21641,"Apensen",-12]
[86974,"Apfeldorf",-16]
[72525,"Apfelstetten",-16]
[88437,"Äpfingen",-16]
[99510,"Apolda",-14]
[48301,"Appelhülsen",-12]
[27616,"Appeln",-12]
[25482,"Appen",-10]
[71297,"Appenberg",-14]
[55437,"Appenheim",-12]
[77767,"Appenweier",-12]
[17291,"Arendsee",-14]
[39619,"Arendsee",-14]
[86561,"Aresing",-16]
[23617,"Arfrade",-12]
[88260,"Argenbühl",-16]
[25767,"Arkebek",-12]
[55288,"Armsheim",-12]
[75305,"Arnbach",-14]
[39596,"Arneburg",-14]
[89134,"Arnegg",-14]
[39596,"Arnim",-14]
["59...","Arnsberg",-12]
[93473,"Arnschwang",-18]
[94424,"Arnsdorf",-16]
[99310,"Arnstadt",-14]
[94424,"Arnstorf",-16]
[30966,"Arnum",-14]
[31275,"Arpke",-14]
[93474,"Arrach",-18]
[9326,"Arras",-14]
[91247,"Artelshofen",-16]
[6556,"Artern",-14]
[84095,"Arth",-16]
[21380,"Artlenburg",-12]
[56337,"Arzbach",-12]
[4886,"Arzberg",-16]
[95659,"Arzberg",-18]
[53343,"Arzdorf",-14]
[54687,"Arzfeld",-14]
[76829,"Arzheim",-12]
[53567,"Asbach",-12]
[55758,"Asbach",-14]
[86502,"Asbach",-16]
[94094,"Asbach",-16]
[97708,"Aschach",-14]
["63...","Aschaffenburg",-12]
[83229,"Aschau",-18]
[67753,"Aschbach",-12]
[96132,"Aschbach",-16]
[59387,"Ascheberg",-12]
[98634,"Aschenhausen",-16]
[6449,"Aschersleben",-14]
[85609,"Aschheim",-16]
[49577,"Aslage",-12]
[71546,"Aspach",-14]
[71679,"Asperg",-12]
[55459,"Aspisheim",-12]
[97959,"Assamstadt",-16]
[67269,"Asselheim",-12]
[67126,"Assenheim",-12]
[35614,"Aßlar - Bechlingen",-12]
[35614,"Aßlar-Berghausen",-12]
[85617,"Aßling",-16]
[88433,"Aßmannshardt",-16]
[38685,"Astfeld",-14]
[33165,"Atteln",-14]
[57439,"Attendorn",-14]
[88448,"Attenweiler",-16]
[94348,"Atting",-18]
[91089,"Atzelsberg",-16]
[79280,"Au",-14]
[76474,"Au am Rhein",-12]
[97239,"Aub",-16]
[81245,"Aubing",-16]
[81249,"Aubing",-16]
[4838,"Audenhain",-14]
[8280,"Aue",-16]
[33034,"Auenhausen",-14]
[8066,"Auerbach",-14]
[64625,"Auerbach",-10]
[74834,"Auerbach",-14]
[8209,"Auerbach / Vogtl.",-16]
[8209,"Auerbach / Vogtland",-16]
[9238,"Auerswalde",-14]
[31749,"Auetal",-14]
[73312,"Aufhausen",-16]
[93089,"Aufhausen",-18]
[82281,"Aufkirchen",-16]
[91347,"Aufseß",-16]
[79424,"Auggen",-12]
["86...","Augsburg",-14]
[6308,"Augsdorf",-14]
[32832,"Augustdorf",-12]
[72525,"Auingen",-16]
[24613,"Aukrug",-12]
[88326,"Aulendorf / Württ.",-16]
[65606,"Aumenau",-12]
[94474,"Aunkirchen",-16]
[91589,"Aurach",-16]
[71665,"Aurich",-14]
["2660.","Aurich",-10]
[89335,"Autenried",-16]
[4849,"Authausen",-14]
[27729,"Axstedt",-12]
[54441,"Ayl",-12]
[86482,"Aystetten",-16]
[18586,"Baabe",-10]
[41836,"Baal",-12]
[4457,"Baalsdorf",-14]
[56729,"Baar",-14]
[86672,"Baar",-16]
[85107,"Baar-Ebenhausen",-18]
[14482,"Babelsberg",-14]
[64832,"Babenhausen",-12]
[87727,"Babenhausen",-16]
[83547,"Babensham",-16]
[84149,"Babing",-16]
[93090,"Bach",-18]
[50226,"Bachem",-12]
[74831,"Bachenau",-12]
[86316,"Bacherer",-16]
[82266,"Bachern am Wörthsee",-16]
[96528,"Bachfeld",-16]
[89429,"Bachhagel",-16]
[82335,"Bachhausen",-16]
[83549,"Bachmehring",-16]
[89431,"Bäckingen",-16]
[71522,"Backnang",-12]
[93077,"Bad Abbach",-16]
[83043,"Bad Aibling",-16]
[34454,"Bad Arolsen",-14]
[79415,"Bad Bellingen",-12]
[48455,"Bad Bentheim",-10]
[76887,"Bad Bergzaben",-12]
[99438,"Bad Berka",-14]
[59319,"Bad Berleburg",-16]
[84364,"Bad Birnbach",-16]
[7422,"Bad Blankenburg",-14]
[97708,"Bad Bocklet",-14]
[73087,"Bad Boll",-16]
[24576,"Bad Bramstedt",-12]
[53498,"Bad Breisig",-12]
[88422,"Bad Buchau",-16]
[65520,"Bad Camberg",-14]
[70372,"Bad Cannstatt",-12]
[73342,"Bad Ditzenbach",-18]
[18209,"Bad Doberan",-10]
[33014,"Bad Driburg",-14]
[4849,"Bad Düben",-14]
[67098,"Bad Dürkheim",-12]
[6231,"Bad Dürrenberg",-14]
[78073,"Bad Dürrheim",-18]
[31703,"Bad Eilsen",-14]
[8645,"Bad Elster",-18]
[56130,"Bad Ems",-12]
[34308,"Bad Emstal",-14]
[35080,"Bad Endbach",-14]
[83093,"Bad Endorf",-16]
[49152,"Bad Essen",-12]
[83075,"Bad Feilnbach",-18]
[74177,"Bad Friedrichshall",-12]
[37581,"Bad Gandersheim",-16]
[53173,"Bad Godesberg",-12]
["53...","Bad Godesberg",-10]
[1819,"Bad Gottleuba",-14]
[94086,"Bad Griesbach",-16]
[87730,"Bad Grönenbach",-16]
[38667,"Bad Harzburg",-14]
[83670,"Bad Heilbrunn",-18]
[76332,"Bad Herrenalb",-14]
[36251,"Bad Hersfeld",-14]
[37412,"Bad Herzberg",-16]
["613..","Bad Homburg",-14]
[53604,"Bad Honnef",-12]
[53557,"Bad Hönningen",-12]
[49186,"Bad Iburg",-12]
[34385,"Bad Karlshafen",-12]
[97688,"Bad Kissingen",-14]
[23996,"Bad Kleinen",-10]
[82433,"Bad Kohlgrub",-16]
["555..","Bad Kreuznach",-12]
[79189,"Bad Krozingen",-14]
[57334,"Bad Laasphe",-14]
[49196,"Bad Laer",-12]
[76669,"Bad Langenbrück",-12]
[99947,"Bad Langensalza",-14]
[4651,"Bad Lausick",-14]
[37431,"Bad Lauterberg",-16]
[4924,"Bad Liebenwerda",-16]
[75378,"Bad Liebenzell",-14]
[33175,"Bad Lippspringe",-12]
[7356,"Bad Lobenstein",-18]
[56470,"Bad Marienberg",-14]
[97980,"Bad Mergentheim",-16]
[31848,"Bad Münder ",-14]
[53902,"Bad Münstereifel",-14]
[2953,"Bad Muskau",-16]
[61231,"Bad Nauheim",-14]
[31542,"Bad Nenndorf",-14]
[53474,"Bad Neuenahr-Ahrweiler",-14]
[97616,"Bad Neustadt",-14]
[72108,"Bad Niedernau",-16]
["325..","Bad Oeynhausen",-12]
[23843,"Bad Oldesloe",-12]
[77740,"Bad Peterstal",-16]
[31812,"Bad Pyrmont",-14]
[74906,"Bad Rappenau",-12]
[83435,"Bad Reichenhall",-16]
[76571,"Bad Rotenfels",-14]
[49214,"Bad Rothenfelde",-12]
[37441,"Bad Sachsa",-16]
[79713,"Bad Säckingen",-12]
[31162,"Bad Salzdetfurth",-14]
[36364,"Bad Salzschlirf",-14]
["3210.","Bad Salzuflen",-12]
[36433,"Bad Salzungen ",-16]
[59505,"Bad Sassendorf",-12]
[88348,"Bad Saulgau",-14]
[1814,"Bad Schandau",-14]
[6905,"Bad Schmiedeberg",-14]
[76669,"Bad Schönborn",-12]
[88427,"Bad Schussenried",-16]
[65307,"Bad Schwalbach",-14]
[23611,"Bad Schwartau",-10]
[23795,"Bad Segeberg",-10]
[55566,"Bad Sobernheim",-12]
[65812,"Bad Soden am Taunus",-14]
[63628,"Bad Soden Salmünster",-14]
[6507,"Bad Suderode",-14]
[75385,"Bad Teinach",-16]
[99955,"Bad Tennstedt",-14]
[83646,"Bad Tölz",-18]
[72574,"Bad Urach",-16]
[61118,"Bad Vilbel",-12]
[88339,"Bad Waldsee",-16]
[59597,"Bad Westernkotten",-12]
[83707,"Bad Wiessee",-18]
[75323,"Bad Wildbad",-16]
[19336,"Bad Wilsnack",-14]
[74206,"Bad Wimpfen",-12]
[91438,"Bad Windsheim",-16]
[86825,"Bad Wörishofen",-16]
[33181,"Bad Wünnenberg",-14]
[88410,"Bad Wurzach",-16]
[26160,"Bad Zwischenahn",-12]
[49635,"Badbergen",-12]
[38271,"Baddeckenstedt",-14]
[6493,"Badeborn",-14]
[79227,"Baden",-14]
["765..","Baden-Baden",-12]
[79410,"Badenweiler",-14]
[4720,"Baderitz",-14]
[4769,"Baderitz",-14]
[52499,"Baesweiler",-12]
[3130,"Bagenz",-16]
[79353,"Bahlingen",-12]
[4895,"Bahnsdorf",-16]
[27245,"Bahrenborstel",-12]
[88255,"Baienfurt",-14]
[72270,"Baiersbronn",-16]
[91083,"Baiersdorf",-16]
[88255,"Baindt - Schachen",-14]
[72108,"Baisingen",-16]
[87650,"Baisweil",-16]
[14806,"Baitz",-14]
[73441,"Baldern",-16]
[87538,"Balderschwang",-20]
[85598,"Baldham",-16]
[76532,"Balg",-14]
[31609,"Balge",-12]
[78582,"Balgheim",-18]
[86753,"Balgheim",-16]
[6632,"Balgstädt",-14]
[34308,"Balhorn",-14]
[72336,"Balingen",-18]
[89177,"Ballendorf",-16]
[6493,"Ballenstedt",-14]
[89561,"Ballmertshofen",-16]
[79282,"Ballrechten-Dottingen",-14]
[99869,"Ballstädt",-14]
[73666,"Baltmannsweiler",-14]
[88487,"Baltringen",-16]
[86483,"Balzhausen",-16]
["960..","Bamberg",-16]
[79415,"Bamlach",-12]
[69245,"Bammental",-12]
[91732,"Bammersdorf",-16]
[17506,"Bandelin",-12]
[17449,"Bannemin",-12]
[1728,"Bannewitz",-14]
[17429,"Bansin",-12]
[31029,"Banteln",-14]
[16868,"Bantikow",-14]
[19246,"Bantin",-12]
[30890,"Bantorf",-14]
[19079,"Banzkow",-12]
[93092,"Barbing",-16]
[39249,"Barby",-14]
[27809,"Bardewisch",-12]
[21357,"Bardowick",-12]
[27245,"Barenburg",-12]
[1768,"Bärenstein/Erzgebirge",-16]
[8147,"Bärenwalde",-16]
[73529,"Bargau",-16]
[74921,"Bargen",-12]
[18211,"Bargeshagen",-10]
[23863,"Bargfeld - Stegen",-12]
[22941,"Bargteheide",-12]
[39179,"Barleben",-14]
[46399,"Barlo",-10]
[23968,"Barnekow",-10]
[19089,"Barnin",-12]
[6268,"Barnstädt",-14]
[38446,"Barnstorf",-14]
[49406,"Barnstorf",-12]
[31171,"Barnten",-14]
[32683,"Barntrup",-14]
[41515,"Barrenstein",-10]
[30890,"Barrigsen",-14]
[22885,"Barsbüttel",-12]
[30890,"Barsinghausen",-14]
[21354,"Barskamp",-12]
[26676,"Barßel",-12]
[65388,"Bärstadt",-14]
[71560,"Bartenbach",-14]
[73035,"Bartenbach",-16]
[18356,"Barth",-10]
[73566,"Bartholomä",-16]
[18516,"Bartmannshagen",-12]
[54578,"Basberg",-14]
[56220,"Bassenheim",-14]
[27211,"Bassum",-12]
[97654,"Bastheim",-16]
[21493,"Basthorst",-12]
[35088,"Battenberg",-14]
[86368,"Batzenhofen",-16]
[1561,"Bauda",-16]
[75015,"Bauerbach ( Bretten )",-12]
[35043,"Bauerbach (Marburg)",-12]
[86663,"Bäumenheim",-16]
[34225,"Baunatal",-14]
[75245,"Bauschlott",-14]
[58730,"Bausenhagen",-12]
[54636,"Baustert",-14]
[88471,"Baustetten",-16]
[2625,"Bautzen",-16]
[84092,"Bayerbach",-18]
[86641,"Bayerdilling",-16]
[86513,"Bayersried",-16]
["954..","Bayreuth",-16]
[99976,"Beberstedt",-16]
[39343,"Bebertal",-14]
[36179,"Bebra-Solz",-14]
[51515,"Bechen",-12]
[55608,"Becherbach",-12]
[67827,"Becherbach",-12]
[91572,"Bechhofen",-16]
[88499,"Bechingen",-14]
[88453,"Bechtenrot",-16]
[72379,"Bechtholdsweiler",-16]
[72379,"Bechtoldsweiler",-16]
[55234,"Bechtolsheim",-12]
[38527,"Bechtsbüttel",-14]
[21643,"Beckdorf",-12]
[23968,"Beckerwitz",-10]
[66701,"Beckingen",-12]
[59269,"Beckum / Westf.",-12]
[4889,"Beckwitz",-16]
[50181,"Bedburg",-12]
[47551,"Bedburg-Hau",-10]
[9306,"Beedeln",-14]
[48361,"Beelen",-12]
[14547,"Beelitz",-14]
[36251,"Beenhausen",-14]
[17291,"Beenz",-14]
[64743,"Beerfelden / Odenw.",-14]
[6198,"Beesendorf",-14]
[49832,"Beesten",-12]
[52499,"Beggendorf",-12]
[39356,"Behnsdorf",-14]
[17498,"Behrenhoff",-12]
[37130,"Beienrode",-16]
[1561,"Beiersdorf",-16]
[4924,"Beiersdorf",-16]
[96450,"Beiersdorf",-16]
[72221,"Beihingen",-16]
[92339,"Beilngries",-16]
[4886,"Beilrode",-16]
[35753,"Beilstein",-14]
[71717,"Beilstein",-14]
[89179,"Beimerstetten",-16]
[75378,"Beinberg",-16]
[89143,"Beiningen",-16]
[71334,"Beinstein",-14]
[54340,"Bekond",-12]
[53539,"Belcherath",-14]
[4874,"Belgern",-16]
[56288,"Bell",-14]
[88416,"Bellamont",-16]
[89287,"Bellenberg",-16]
[33034,"Beller",-14]
[33034,"Bellersen",-14]
[49191,"Belm",-12]
[72379,"Belsen",-16]
[56290,"Beltheim",-14]
[14806,"Belzig",-14]
[72658,"Bempflingen",-16]
[21227,"Bendestorf",-12]
[83671,"Benediktbeuern",-18]
[18258,"Benitz",-12]
[6308,"Benndorf",-14]
[4828,"Bennewitz",-14]
[71726,"Benningen",-12]
[51429,"Bensberg",-12]
[64625,"Bensheim (Bensh.-Auerbach)",-10]
[31020,"Benstorf",-14]
[33129,"Bentfeld",-12]
[37547,"Bentierode",-16]
[18182,"Bentwisch",-10]
[93176,"Beratzhausen",-16]
[79777,"Berau",-14]
[92334,"Berching",-16]
[83471,"Berchtesgaden",-16]
[24881,"Berend",-10]
[52385,"Berg",-14]
[53505,"Berg",-14]
[82386,"Berg",-16]
[88276,"Berg",-14]
[92348,"Berg",-16]
[82335,"Berg - Bachhausen",-16]
[83546,"Berg bei Au",-16]
[56357,"Berg/Taunus",-12]
[6536,"Berga",-14]
[7980,"Berga",-14]
[88368,"Bergatreute",-16]
[49626,"Berge",-12]
[2979,"Bergen",-16]
[83346,"Bergen",-18]
[18528,"Bergen / Rügen",-10]
[60388,"Bergen-Enkheim",-12]
[72172,"Bergfelden",-16]
[1819,"Berggrießhübel",-14]
[77791,"Berghaupten",-12]
["5164.","Berghausen",-12]
[32839,"Bergheim",-14]
["501..","Bergheim",-12]
[16306,"Bergholz",-16]
[14558,"Bergholz - Rehbrücke",-14]
[89180,"Berghülen",-16]
["514..","Bergisch-Gladbach",-12]
[51381,"Bergisch-Neukirchen",-10]
[59192,"Bergkamen",-12]
[85232,"Bergkirchen",-16]
[73663,"Berglen",-14]
[85459,"Berglern",-16]
[54426,"Berglicht",-14]
[97493,"Bergrheinfeld",-14]
[22395,"Bergstedt- Hamburg",-12]
[97241,"Bergtheim",-14]
[39307,"Bergzow",-14]
[39624,"Berkau",-14]
[73734,"Berkheim",-14]
[88450,"Berkheim",-16]
["1....","Berlin",-14]
["1....","Berlin",-14]
[16562,"Berlin - Bergfelde",-14]
[99439,"Berlstedt",-14]
[89134,"Bermaringen",-16]
[88697,"Bermatingen",-14]
[77723,"Bermersbach",-12]
[79872,"Bernau",-18]
[83233,"Bernau a. Chiemsee",-16]
[16321,"Bernau b. Berlin",-14]
[76332,"Bernbach",-12]
[6406,"Bernburg / Saale",-14]
[27804,"Berne",-10]
[72213,"Berneck",-16]
[73312,"Berneck",-16]
[92361,"Berngau",-16]
[54470,"Bernkastel-Kues",-10]
[16515,"Bernöwe",-14]
[82347,"Bernried",-16]
[92444,"Bernried",-18]
[94505,"Bernried",-18]
[8315,"Bernsbach",-16]
[2994,"Bernsdorf",-16]
[7952,"Bernsgrün",-16]
[89182,"Bernstadt",-16]
[2748,"Bernstadt auf dem Eigen",-16]
[74744,"Berolzheim",-16]
[49593,"Bersenbrück",-12]
[61200,"Berstadt",-12]
[2747,"Berthelsdorf",-16]
[9600,"Berthelsdorf",-16]
[66802,"Berus , Überherrn",-12]
[65614,"Beselich",-14]
[74354,"Besigheim",-12]
[34295,"Besse",-14]
[63856,"Bessenbach",-14]
[54309,"Beßlich",-14]
[59909,"Bestwig",-14]
[31032,"Betheln",-14]
[72160,"Betra",-16]
[56355,"Bettendorf",-14]
[41470,"Bettikum",-10]
[87764,"Bettrichs",-16]
[57518,"Betzdorf",-12]
[88422,"Betzenweiler",-14]
[87488,"Betzigau",-16]
[72291,"Betzweiler",-16]
[4824,"Beucha",-14]
[4519,"Beuden",-14]
[82547,"Beuerberg",-18]
[54413,"Beuren",-14]
[72226,"Beuren",-16]
[72660,"Beuren",-16]
[78224,"Beuren",-14]
[88316,"Beuren",-16]
[71384,"Beutelsbach",-14]
[94501,"Beutelsbach",-16]
[4924,"Beutersitz",-16]
[9366,"Beutha",-16]
[37639,"Bevern",-12]
[37688,"Beverungen",-12]
[66450,"Bexbach",-12]
[6528,"Beyernaumburg",-14]
[83104,"Beyharting",-16]
[77781,"Biberach",-14]
[88400,"Biberach/Riß",-16]
[86485,"Biberbach",-16]
[68647,"Biblis",-12]
[93354,"Biburg",-18]
[83673,"Bichl",-18]
[72348,"Bickelsberg",-16]
[79235,"Bickensohl",-12]
[87651,"Bidingen",-16]
[55234,"Biebelnheim",-12]
[97243,"Bieberehren",-16]
[63599,"Biebergemünd - Kassel",-14]
[35444,"Biebertal",-12]
[56370,"Biebrich",-14]
[56370,"Biebrich",-14]
[35216,"Biedenkopf",-12]
[79215,"Biederbach",-14]
[39175,"Biederitz",-14]
[2923,"Biehain",-16]
[1920,"Biehla",-16]
[1824,"Bielatal",-16]
["33...","Bielefeld",-12]
[49808,"Biene",-10]
[79189,"Biengen",-14]
[38110,"Bienrode",-14]
[99100,"Bienstädt",-14]
[72108,"Bieringen",-16]
[74214,"Bieringen",-14]
[72181,"Bierlingen",-16]
[88348,"Bierstetten",-16]
[75328,"Bieselsberg",-16]
[16359,"Biesenthal",-14]
[87640,"Biessenhofen",-16]
[72414,"Bietenhausen",-16]
[76467,"Bietigheim",-12]
[74321,"Bietigheim - Bissingen",-12]
[17291,"Bietikow",-14]
[78224,"Bietingen",-12]
[87544,"Bihlerdorf",-18]
[72160,"Bildechingen",-16]
[75236,"Bilfingen",-14]
[18184,"Billenhagen",-12]
[48727,"Billerbeck",-10]
[74842,"Billigheim",-12]
[31319,"Bilm",-14]
[37434,"Bilshausen",-16]
[74862,"Binau",-12]
[99092,"Bindersleben",-14]
[39590,"Bindfelde",-14]
[95463,"Bindlach",-16]
[72511,"Bingen",-14]
[55411,"Bingen/Rhein",-12]
[56754,"Binningen",-14]
[78247,"Binningen",-12]
[72351,"Binsdorf",-16]
[86637,"Binswangen",-16]
[18609,"Binz / Rügen",-10]
[79589,"Binzen",-12]
[54587,"Birgel",-14]
[41849,"Birgelen",-10]
[92262,"Birgland",-16]
[69488,"Birkenau",-12]
[69498,"Birkenau - Hornbach",-12]
[79777,"Birkendorf",-14]
[75217,"Birkenfeld",-14]
[97834,"Birkenfeld",-14]
[55765,"Birkenfeld / Nahe",-14]
[16928,"Birkenfelde",-14]
[15913,"Birkenhainchen",-16]
[88447,"Birkenhard",-16]
[16547,"Birkenwerder",-14]
[16515,"Birkhorst",-14]
[92262,"Birkland",-16]
[79774,"Birndorf",-12]
[97836,"Bischbrunn",-14]
[2708,"Bischdorf",-16]
[3205,"Bischdorf",-16]
[37284,"Bischhausen Kr. Eschwege",-14]
[37130,"Bischhausen Kr. Göttingen",-16]
[1920,"Bischheim",-16]
[67294,"Bischheim",-12]
[99094,"Bischleben",-14]
[35649,"Bischoffen",-14]
[37345,"Bischofferode",-16]
[79235,"Bischoffingen",-12]
[97653,"Bischofsheim",-16]
[94253,"Bischofsmais",-18]
[1877,"Bischofswerda",-16]
[16559,"Bischofswerder",-14]
[83483,"Bischofswiesen",-18]
[72406,"Bisingen",-18]
[39629,"Bismark",-14]
[29646,"Bispingen",-14]
[30900,"Bissendorf",-14]
[49143,"Bissendorf",-12]
[86657,"Bissingen",-16]
[74321,"Bissingen (Bietigheim)",-12]
[73266,"Bissingen an der Teck",-16]
[54634,"Bitburg",-14]
[72160,"Bittelbronn",-16]
[72401,"Bittelbronn",-16]
[72505,"Bittelschieß",-14]
[71336,"Bittenfeld",-12]
[6749,"Bitterfeld",-14]
[72475,"Bitz",-18]
[57539,"Bitzen",-12]
[88094,"Bitzenhofen",-14]
[74626,"Bitzfeld",-14]
[93476,"Blaibach",-18]
[38889,"Blankenburg/Harz",-14]
[15827,"Blankenfelde",-14]
[99444,"Blankenhain",-14]
[53945,"Blankenheim",-14]
[53945,"Blankenheimerdorf",-14]
[56865,"Blankenrath",-14]
[45527,"Blankenstein",-12]
[79588,"Blansingen",-12]
[79859,"Blasiwald",-16]
[66869,"Blaubach",-14]
[89143,"Blaubeuren",-16]
[74572,"Blaufelden",-16]
[89134,"Blaustein",-14]
[79261,"Bleibach",-16]
[53894,"Bleibuir",-14]
[99752,"Bleicherode",-14]
[72813,"Bleichstetten",-18]
[65232,"Bleidenstadt",-14]
[24327,"Blekendorf",-10]
[27337,"Blender",-12]
[35796,"Blessenbach",-14]
[24214,"Blickstedt",-10]
[21640,"Bliedersdorf",-12]
[66440,"Blieskastel",-12]
[89434,"Blindheim",-16]
[88273,"Blitzenreute",-14]
[88512,"Blochingen",-14]
[1561,"Blochwitz",-16]
[32825,"Blomberg",-14]
[4886,"Blumberg",-16]
[78176,"Blumberg",-16]
[31515,"Blumenau",-14]
[2979,"Bluno",-16]
[76891,"Bobenthal",-12]
[86399,"Bobingen",-16]
[73560,"Böbingen",-16]
["7103.","Böblingen",-14]
[3222,"Boblitz",-16]
[78727,"Bochingen",-16]
["463..","Bocholt",-10]
[14913,"Bochow",-14]
[44805,"Bochum",-10]
["44...","Bochum",-10]
[44879,"Bochum - Linden",-12]
[8324,"Bockau",-16]
[4703,"Bockelwitz",-14]
[31167,"Bockenem",-14]
[6728,"Bockenheim",-12]
[26345,"Bockhorn",-12]
[49406,"Bockstedt",-12]
["590..","Bockum-Hövel",-12]
[57392,"Bödefeld",-16]
[72411,"Bodelshausen",-16]
[53539,"Bodenbach",-14]
[55294,"Bodenheim",-12]
[84155,"Bodenkirchen",-16]
[94249,"Bodenmais",-18]
[37308,"Bodenrode",-16]
[37619,"Bodenwerder",-12]
[92439,"Bodenwöhr",-16]
[77694,"Bodersweier",-12]
[37671,"Bödexen",-14]
[78351,"Bodman",-12]
[88285,"Bodnegg",-14]
[88131,"Bodolz",-12]
[37691,"Boffzen",-14]
[4564,"Böhlen",-14]
[4808,"Böhlitz",-14]
[89558,"Böhmenkirch",-16]
[16348,"Böhmerheide",-14]
[72587,"Böhringen",-18]
[3130,"Bohsdorf",-16]
[17268,"Boitzenburg",-12]
[19258,"Boizenburg",-12]
[33034,"Bökendorf",-14]
[2627,"Bolbritz",-16]
[19077,"Boldela",-12]
[89542,"Bolheim",-16]
[72379,"Boll",-16]
[73087,"Boll",-16]
[89160,"Bollingen",-16]
[39517,"Bölsdorf",-14]
[23946,"Boltenhagen",-10]
[79341,"Bombach",-12]
[4938,"Bomsdorf",-16]
[71149,"Bondorf",-16]
[56579,"Bonefeld",-14]
[59199,"Bönen",-12]
[74906,"Bonfeld",-12]
["53...","Bonn",-10]
["53...","Bonn - Beuel",-10]
[53123,"Bonn - Duisdorf",-12]
[53175,"Bonn - Friesdorf",-12]
["53...","Bonn - Hoholz",-12]
[53229,"Bonn - Holzlar",-12]
[53127,"Bonn - Ippendorf",-12]
[53225,"Bonn - Ramersdorf",-12]
[53177,"Bonn - Schweinheim",-12]
[79848,"Bonndorf",-16]
[1796,"Bonnewitz",-14]
[1827,"Bonnewitz",-14]
[74357,"Bönnigheim",-12]
[46519,"Bönninghardt",-10]
[25474,"Bönningstedt",-12]
[61194,"Bönstadt",-12]
[73441,"Bopfingen",-16]
[56154,"Boppard",-14]
[45355,"Borbeck",-10]
[33178,"Borchen",-14]
[31535,"Bordenau",-14]
[24582,"Bordesholm",-10]
[34434,"Borgentreich",-14]
[34434,"Borgholz",-14]
[48565,"Borghorst",-12]
[16556,"Borgsdorf",-14]
[24857,"Borgwedel",-10]
[59379,"Bork",-14]
[46325,"Borken",-10]
[14822,"Borkheide",-14]
[26757,"Borkum",-10]
[14822,"Borkwalde",-14]
[41379,"Born",-10]
[18375,"Born(Darß)",-10]
[4758,"Borna",-14]
[9114,"Borna",-14]
[4552,"Borna, b. Leipzig",-14]
[53332,"Bornheim",-12]
[76879,"Bornheim",-12]
[21039,"Börnsen",-12]
[6295,"Bornstedt",-14]
[4451,"Borsdorf",-14]
[31749,"Borstel",-14]
[9579,"Borstendorf",-16]
[73104,"Börtlingen",-16]
[23715,"Bosau",-12]
[39359,"Bösdorf",-14]
[72285,"Bösingen",-16]
[37671,"Bosseborn",-14]
[74336,"Botenheim",-14]
[77704,"Bottenau",-14]
[66504,"Bottenbach",-12]
[91637,"Bottenweiler",-16]
[6571,"Bottenweiler,Post Zumhaus ",-16]
["462..","Bottrop",-10]
[79268,"Bötzingen",-12]
[16727,"Bötzow",-14]
[37120,"Bovenden",-16]
[44388,"Bövinghausen",-12]
[2943,"Boxberg",-16]
[97944,"Boxberg",-16]
[22145,"Braak",-12]
[74336,"Brackenheim",-12]
[74336,"Brackenheim - Meimsheim ",-12]
[74336,"Brackenheim - Stockheim",-12]
["33...","Brackwede",-12]
[73574,"Brainkofen",-16]
[26919,"Brake",-10]
[33729,"Brake",-12]
[33034,"Brakel",-14]
[33034,"Brakel - Rheder",-14]
[32816,"Brakelsiek (Schieder-Schwalenbg.)",-14]
[49565,"Bramsche",-12]
[27211,"Bramstedt",-12]
[27628,"Bramstedt",-12]
[8060,"Brand",-14]
[52078,"Brand",-12]
[95682,"Brand",-18]
["1477.","Brandenburg/Havel",-14]
[9614,"Brand-Erbisdorf",-16]
[9618,"Brand-Erbisdorf",-16]
[6785,"Brandhorst",-14]
[4821,"Brandis",-14]
[35647,"Brandoberndorf",-14]
[83098,"Brannenburg",-18]
[56338,"Braubach",-12]
[1920,"Brauna",-16]
[54472,"Brauneberg",-10]
[95186,"Braunersgrün",-18]
[35619,"Braunfels",-12]
[35619,"Braunfels - Tiefenbach",-12]
[38700,"Braunlage",-16]
[78199,"Bräunlingen",-18]
["381..","Braunschweig",-14]
[9577,"Braunsdorf",-14]
[9603,"Bräunsdorf",-16]
[64331,"Braunshardt",-12]
[52538,"Breberen",-10]
[58339,"Breckerfeld",-12]
[30974,"Bredenbeck",-14]
[37697,"Bredenborn",-14]
[25821,"Bredstedt",-10]
[29451,"Breese in der Marsch",-12]
[37339,"Brehme",-16]
[6796,"Brehna",-14]
[53797,"Breidt",-12]
[79206,"Breisach",-12]
[82211,"Breitbrunn",-16]
[83254,"Breitbrunn",-16]
[66916,"Breitenbach",-12]
[75389,"Breitenberg",-16]
[63584,"Breitenborn",-14]
[63599,"Breitenborn",-14]
[91238,"Breitenbrunn",-16]
[72119,"Breitenholz",-16]
[37619,"Breitenkamp",-14]
[6547,"Breitenstein",-16]
[65329,"Breithardt",-14]
[89183,"Breitingen",-16]
[35767,"Breitscheid",-14]
[98597,"Breitungen",-16]
[24811,"Brekendorf",-12]
[72525,"Bremelau",-16]
[59469,"Bremen",-12]
["28...","Bremen",-12]
["275..","Bremerhaven",-10]
[27432,"Bremervörde",-12]
[65817,"Bremsthal",-14]
[53332,"Brenig",-12]
[37671,"Brenkhausen",-14]
[93179,"Brennberg",-18]
[64395,"Brensbach",-14]
[19294,"Bresegard",-14]
[1900,"Bretnig",-16]
[74243,"Brettach",-14]
[75015,"Bretten",-12]
[39307,"Brettin",-14]
[55128,"Bretzenheim",-12]
[74626,"Bretzfeld",-14]
[67725,"Breunigweiler",-12]
[56321,"Brey",-12]
[14778,"Brielow",-14]
[14656,"Brieselang",-14]
[1968,"Brieske",-16]
[78086,"Brigachtal",-18]
[59929,"Brilon",-14]
[18055,"Brinckmansdorf",-10]
[4509,"Brinnis",-14]
[79379,"Britzingen",-14]
[37115,"Brochthausen",-16]
[27386,"Brockel, Kr. Rotenburg",-16]
[59510,"Brockhausen",-12]
[17034,"Broda",-14]
[4509,"Brodau",-14]
[16230,"Brodowin",-14]
[91522,"Brodswinden",-16]
[56656,"Brohl - Lützing",-12]
[14822,"Brokheide",-14]
[64753,"Brombachtal",-14]
[59969,"Bromskirchen",-16]
[91257,"Bronn",-16]
[88480,"Bronnen",-16]
[72770,"Bronnweiler",-16]
[66663,"Brotdorf",-12]
[21514,"Bröthen",-12]
[98599,"Brotterode",-16]
[61169,"Bruchenbrücken",-12]
[57539,"Bruchertseifen",-12]
[37671,"Bruchhausen",-14]
[27305,"Bruchhausen-Vilsen",-12]
[66424,"Bruchhof",-12]
[63486,"Bruchköbel",-12]
[66892,"Bruchmühltal",-12]
[76646,"Bruchsal",-12]
[76891,"Bruchweiler-Bärenbach",-12]
[14822,"Brück",-14]
[84079,"Bruckberg",-16]
[46569,"Bruckhausen",-10]
[83052,"Bruckmühl",-16]
[9548,"Brüderwiese",-16]
[52525,"Brüggelchen",-10]
[31033,"Brüggen",-14]
[41379,"Brüggen",-10]
[50169,"Brüggen",-12]
[50321,"Brühl , Rheinl.",-10]
[46499,"Brünen",-10]
[17039,"Brunn",-14]
[98673,"Brünn",-16]
[31863,"Brünnighausen",-14]
[22946,"Brunsbek",-12]
[25541,"Brunsbüttel",-10]
[23883,"Brunsmark",-12]
[17509,"Brünzow",-12]
[19071,"Brüsewitz",-12]
[17326,"Brüssow",-14]
[91088,"Bubenreuth",-16]
[67742,"Buborn",-14]
[73492,"Buch",-16]
[79774,"Buch",-12]
[89171,"Buch",-16]
[89290,"Buch",-16]
[85656,"Buch am Buchrain",-16]
[84172,"Buch am Erlbach",-16]
[91592,"Buch am Wald",-16]
[7334,"Bucha",-14]
[84428,"Buchbach",-16]
[56823,"Büchel",-14]
[21514,"Büchen",-12]
[74722,"Buchen, Odenw.",-14]
[76646,"Büchenau",-12]
[79256,"Buchenbach",-18]
[75180,"Büchenbronn",-14]
[4651,"Buchheim",-14]
[79232,"Buchheim",-12]
[88637,"Buchheim",-16]
[19205,"Buchholz",-12]
[31710,"Buchholz",-14]
[53567,"Buchholz",-12]
[21244,"Buchholz in der Nordheide",-12]
[94124,"Büchlberg",-16]
[86807,"Buchloe",-16]
[90574,"Buchschwabach",-16]
[31675,"Bückeburg",-14]
[75175,"Buckenberg",-14]
[3205,"Buckow",-16]
[24782,"Büdelsdorf",-12]
[55257,"Budenheim",-12]
[46487,"Büderich",-10]
[61137,"Büdesheim",-12]
[63654,"Büdingen",-14]
[99869,"Bufleben",-14]
[86657,"Buggenhofen",-16]
[79426,"Buggingen",-14]
[77815,"Bühl",-12]
[89346,"Bühl",-16]
[77830,"Bühlertal",-14]
[74424,"Bühlertann",-16]
[50170,"Buir",-12]
[21782,"Bülkau",-10]
[56859,"Bullay",-12]
[1936,"Bulleritz",-16]
[18276,"Bülower Burg b. Güstrow",-12]
[32257,"Bünde",-12]
[24613,"Bünzen",-12]
[57299,"Burbach",-14]
[33142,"Büren",-14]
[3096,"Burg",-16]
[91320,"Burg - Gaillenreuth",-16]
[39288,"Burg b. Magdeburg",-14]
[17094,"Burg Stargard",-14]
[45289,"Burgaltendorf",-10]
[89331,"Burgau",-16]
[78126,"Burgberg",-16]
[91593,"Burgbernheim",-16]
[31303,"Burgdorf",-14]
[38272,"Burgdorf",-14]
[7616,"Bürgel",-14]
[56332,"Burgen",-12]
[89429,"Burghagel",-16]
[96152,"Burghaslach",-16]
[36151,"Burghaun",-14]
[76327,"Burghausen",-12]
[86666,"Burgheim",-16]
[61381,"Burgholzhausen",-14]
[93133,"Burglengenfeld",-16]
[97496,"Burgpreppach",-16]
[82467,"Burgrain",-18]
[88483,"Burgrieden",-16]
[6295,"Burgsdorf",-14]
[35606,"Burgsolms",-12]
[9217,"Burgstädt",-14]
[31171,"Burgstemmen",-14]
[71576,"Burgstetten",-14]
[90559,"Burgthann",-16]
[37318,"Burgwalde",-16]
[30938,"Burgwedel",-14]
[96154,"Burgwindheim",-16]
[26969,"Burhave",-10]
[97705,"Burkardroth",-16]
[4603,"Burkersdorf",-14]
[63679,"Burkhards",-14]
[9235,"Burkhardtsdorf",-14]
[8318,"Burkhardtsgrün",-16]
[72393,"Burladingen",-18]
[17089,"Burow",-14]
[51399,"Burscheid",-12]
[68642,"Bürstadt",-12]
[89349,"Burtenbach",-16]
[53913,"Buschhoven",-14]
[50129,"Büsdorf",-12]
[35418,"Buseck",-12]
[76337,"Busenbach",-14]
[76891,"Busenberg",-12]
[25719,"Busenwurth",-10]
[78266,"Büsingen",-12]
[99198,"Büßleben",-14]
[26969,"Butjadingen",-10]
[77764,"Butschbach",-14]
[64572,"Büttelborn",-12]
[99439,"Buttelstedt",-14]
[96155,"Buttenheim",-16]
[86647,"Buttenwiesen",-16]
[86647,"Buttenwiesen-Frauenstetten",-16]
[41564,"Büttgen",-10]
[35510,"Butzbach",-14]
[21683,"Bützfleth",-10]
[54309,"Butzweiler",-14]
[87700,"Buxach",-16]
[87740,"Buxheim",-16]
[21614,"Buxtehude",-12]
[90556,"Cadolzburg",-16]
[39240,"Calbe",-14]
[38547,"Calberlah",-14]
[67829,"Callbach",-12]
[75323,"Calmbach",-16]
[75365,"Calw      (wie mit Willi abgesprochen)",-14]
[19246,"Camin",-12]
[17094,"Cammin",-14]
[4685,"Cannewitz",-14]
[59379,"Cappenberg",-12]
[59379,"Cappenberg",-12]
[14548,"Caputh",-14]
[67316,"Carlsberg",-12]
[2708,"Carlsbrunn",-16]
[95138,"Carlsgrün",-18]
[17291,"Carmzow",-14]
[17219,"Carolinenhof",-14]
[2699,"Caßlau",-16]
["445..","Castrop-Rauxel",-10]
[4758,"Cavertitz",-16]
["292..","Celle",-12]
[93413,"Cham",-18]
[93466,"Chamerau",-18]
[56379,"Charlottenberg",-12]
["0911.","Chemnitz",-14]
[83339,"Chieming",-16]
[4720,"Choren",-14]
[16230,"Chorin",-14]
[9236,"Claußnitz",-14]
[38678,"Clausthal-Zellerfeld",-14]
[74389,"Cleebronn",-14]
[74196,"Cleversulzbach",-14]
[99718,"Clingen",-14]
[49661,"Cloppenburg",-12]
[96450,"Coburg",-14]
[56812,"Cochem",-10]
[6449,"Cochstedt",-14]
[48653,"Coesfeld",-10]
[4680,"Colditz",-14]
[97903,"Collenberg",-14]
[91598,"Colmberg",-16]
[1738,"Colmnitz",-16]
[4680,"Commichau",-14]
[9633,"Conradsdorf",-16]
[75334,"Conweiler",-14]
[31863,"Coppenbrügge",-14]
[1640,"Coswig",-14]
[6869,"Coswig",-14]
[1796,"Cotta B",-14]
["030..","Cottbus",-16]
[74564,"Crailsheim",-16]
[65558,"Cramberg",-12]
[8340,"Crandorf",-16]
[9465,"Cranzahl",-16]
[38162,"Cremlingen",-14]
[72178,"Cresbach",-16]
[16306,"Criewen",-16]
[8451,"Crimmitschau",-14]
[19089,"Crivitz",-12]
[19089,"Crivitz",-12]
[8129,"Crossen",-14]
[9306,"Crossen",-14]
[2681,"Crostau",-16]
[9474,"Crottendorf",-16]
[19322,"Cumlosen",-14]
[9456,"Cunersdorf",-16]
[2733,"Cunewalde",-16]
[1824,"Cunnersdorf b. Königstein",-16]
["274..","Cuxhaven",-10]
[85221,"Dachau",-16]
[91462,"Dachsbach",-16]
[79875,"Dachsberg",-16]
[56340,"Dachsenhausen",-12]
[71134,"Dachtel",-16]
[99100,"Dachwig",-14]
[25899,"Dagebüll",-10]
[33100,"Dahl",-14]
[53949,"Dahlem",-14]
[39326,"Dahlenwarsleben",-14]
[42477,"Dahlerau",-12]
[15366,"Dahlwitz-Hoppegarten",-14]
[66994,"Dahn",-12]
[97980,"Dainbach",-16]
[88718,"Daisendorf",-12]
[19071,"Dalberg",-12]
[73492,"Dalkingen",-16]
[74834,"Dallau",-14]
[14624,"Dallgow",-14]
[67592,"Dalsheim",-12]
[23738,"Damlos",-10]
[17291,"Damme",-14]
[24351,"Damp",-10]
[15936,"Damsdorf",-14]
[23948,"Damshagen",-10]
[6493,"Dankerode",-16]
[38461,"Danndorf",-14]
[38524,"Dannenbüttel",-14]
[67814,"Dannenfels",-12]
[39245,"Dannigkow",-14]
[67661,"Dansenberg",-12]
[38836,"Dardesheim",-14]
[17498,"Dargelin",-12]
[38871,"Darlingerode",-16]
[71063,"Darmsheim",-16]
["642..","Darmstadt",-12]
[54552,"Darscheid",-14]
[34417,"Daseburg",-14]
[86453,"Dasing",-16]
[37586,"Dassel",-14]
[21521,"Dassendorf",-12]
[37574,"Dassensen",-16]
[92358,"Daßwangen",-16]
[45711,"Datteln",-12]
[79379,"Dattingen",-14]
[71120,"Dätzingen",-16]
[56412,"Daubach",-14]
[2906,"Dauban",-16]
[54550,"Daun",-14]
[91522,"Dautenwinden",-16]
[4886,"Dautzschen",-16]
[76185,"Daxlanden",-12]
[27607,"Debstedt",-10]
[18317,"Dechowshof",-10]
[91056,"Dechsendorf",-16]
[75392,"Deckenpfronn",-16]
[30926,"Dedensen",-14]
[37627,"Deensen",-14]
[88456,"Degernau",-16]
[72762,"Degerschlacht",-16]
[94469,"Deggenau",-18]
[94469,"Deggendorf",-18]
[88693,"Deggenhausertal",-14]
[73326,"Deggingen",-16]
[8538,"Dehles",-18]
[67146,"Deidesheim",-12]
[78586,"Deilingen",-18]
[92364,"Deining",-16]
[86738,"Deiningen",-16]
[89420,"Deisingen",-16]
[73779,"Deizisau",-16]
[33129,"Delbrück",-12]
[4509,"Delitzsch",-14]
[31073,"Delligsen",-14]
[89155,"Dellmensingen",-14]
["277..","Delmenhorst",-12]
[19089,"Demen",-12]
[1877,"Demitz - Thumitz",-16]
[85098,"Demling",-18]
[17109,"Demmin",-12]
[73770,"Denkendorf",-14]
[37627,"Denkiehausen",-14]
[88630,"Denkingen",-14]
[14913,"Dennewitz",-14]
[79207,"Denzlingen",-14]
[79211,"Denzlingen",-14]
[39317,"Derben",-14]
[38895,"Derenburg",-14]
[37691,"Derental",-14]
[36466,"Dermbach",-16]
[53507,"Dernau",-14]
[56428,"Dernbach",-14]
[76857,"Dernbach",-12]
[31188,"Derneburg",-14]
["0684.","Dessau",-14]
["327..","Detmold",-12]
[72135,"Dettenhausen",-16]
[76706,"Dettenheim",-12]
[86911,"Dettenschwang",-16]
[72108,"Dettingen",-16]
[72160,"Dettingen",-16]
[73265,"Dettingen",-16]
[88451,"Dettingen",-16]
[89547,"Dettingen",-16]
[89584,"Dettingen",-14]
[72581,"Dettingen an der Erms",-16]
[18320,"Dettmannsdorf",-12]
[71134,"Deufringen",-16]
[54411,"Deuselbach",-12]
[84166,"Deutenkofen",-16]
[9548,"Deutscheinsiedel",-16]
[9548,"Deutschkatharinenberg",-16]
[9548,"Deutschneudorf",-16]
[78355,"Deutwang",-14]
[4574,"Deutzen",-14]
[18439,"Devin",-10]
[55278,"Dexheim",-12]
[38530,"Didderse",-14]
[91583,"Diebach",-16]
[56332,"Dieblich",-12]
[64807,"Dieburg",-14]
[75015,"Diedelsheim",-12]
[67434,"Diedesfeld",-12]
[86420,"Diedorf",-16]
[18119,"Diedrichshagen",-10]
[31199,"Diekholzen",-14]
[69234,"Dielheim",-12]
[86657,"Diemantstein",-16]
[34519,"Diemelsee",-16]
[34474,"Diemelstadt",-14]
[15864,"Diensdorf",-14]
[97941,"Dienstadt",-14]
[31603,"Diepenau",-12]
[91227,"Diepersdorf",-16]
[1665,"Diera",-14]
[77749,"Diersburg",-12]
[77866,"Diersheim",-12]
[6184,"Dieshau",-14]
[91456,"Diespeck",-16]
[86911,"Dießen",-16]
[89165,"Dietenheim",-16]
[90599,"Dietenhofen",-16]
[84378,"Dietersburg",-16]
[88524,"Dieterskirch",-14]
[75210,"Dietlingen",-14]
[88410,"Dietmanns",-16]
[87463,"Dietmannsried",-16]
[63128,"Dietzenbach",-12]
[35716,"Dietzhölztal",-14]
[65582,"Diez",-12]
[71034,"Diezenhalde",-14]
[35683,"Dillenburg",-12]
[89407,"Dillingen/Donau",-16]
[66763,"Dillingen-Diefflen",-12]
[46499,"Dingden",-10]
[78465,"Dingelsdorf",-12]
[37351,"Dingelstädt",-16]
[38838,"Dingelstedt",-14]
[84130,"Dingolfing",-18]
[84130,"Dingolfingen",-16]
[91550,"Dinkelsbühl",-16]
[86424,"Dinkelscherben",-16]
[59514,"Dinker",-12]
[49413,"Dinklage",-12]
["4653.","Dinslaken",-10]
[36160,"Dipperz",-14]
[1744,"Dippoldiswalde",-14]
[27412,"Dipshorn",-12]
[87742,"Dirlewang",-16]
[50374,"Dirmerzheim",-12]
[89561,"Dischingen",-16]
[49201,"Dissen",-12]
[3052,"Dissenchen",-16]
[6484,"Ditfurt",-14]
[97456,"Dittelbrunn",-16]
[67596,"Dittelsheim - Heßloch",-12]
[91723,"Dittenheim",-16]
[1768,"Dittersbach",-16]
[9669,"Dittersbach",-16]
[2748,"Dittersbach auf dem Eigen",-16]
[9573,"Dittmannsdorf",-14]
[9629,"Dittmannsdorf",-14]
[71254,"Ditzingen",-14]
[44287,"Do-Aplerbeck",-12]
[75335,"Dobel",-16]
[4720,"Döbeln",-14]
[4874,"Döbeltitz",-16]
[3253,"Doberlug",-16]
[3159,"Döbern",-16]
[4860,"Döbern",-16]
[2699,"Doberschütz",-16]
[4838,"Doberschütz",-14]
[4703,"Doberschwitz",-14]
[4626,"Dobitschen",-14]
[6729,"Döbitzschen",-14]
[1561,"Dobra",-16]
[1833,"Dobra",-14]
[4924,"Dobra",-16]
[54552,"Dockweiler",-14]
[54518,"Dodenburg",-14]
[4509,"Doebernitz",-14]
[71120,"Döffingen",-16]
[79804,"Dogern",-12]
[95182,"Döhlau",-18]
[1796,"Dohma",-14]
[1809,"Dohna",-14]
[6120,"Dölau",-14]
[6184,"Dölbau",-14]
[3238,"Dollenchen",-16]
[24989,"Dollerup",-10]
[99100,"Döllstädt",-14]
[92364,"Döllwang",-16]
[19303,"Dömitz",-12]
[4880,"Dommitsch",-16]
[4880,"Dommitzsch",-16]
[4924,"Domsdorf",-16]
[19374,"Domsühl",-14]
[78166,"Donaueschingen",-18]
[86609,"Donauwörth",-16]
[6571,"Donndorf",-14]
[27612,"Donnern",-12]
[72587,"Donnstetten",-18]
[73072,"Donzdorf",-16]
[54528,"Dörbach",-14]
[32694,"Dörentrup",-14]
[35415,"Dorf Güll",-14]
[18311,"Dorf Körkwitz",-10]
[23972,"Dorf Mecklenburg",-10]
[29683,"Dorfmark",-14]
[97904,"Dorfprozelten",-14]
[2979,"Dörgenhausen",-16]
[61169,"Dorheim",-12]
[77978,"Dörlinbach",-14]
[41542,"Dormagen",-10]
[72358,"Dormettingen",-16]
[72124,"Dörnach",-16]
[89186,"Dorndorf",-16]
[67585,"Dorn-Dürkheim",-12]
[72175,"Dornhan",-16]
[89160,"Dornstadt",-16]
[72280,"Dornstetten",-16]
[9509,"Dörnthal",-16]
[56370,"Dörsdorf",-14]
["4628.","Dorsten",-10]
["44...","Dortmund",-12]
[44388,"Dortmund - Bövinghausen",-12]
[44309,"Dortmund - Brackel",-12]
[44369,"Dortmund - Deusen",-12]
[44329,"Dortmund - Grevel",-12]
[44263,"Dortmund - Hörde",-12]
[44149,"Dortmund - Kley",-12]
[44229,"Dortmund - Lücklemberg",-12]
["44...","Dortmund - Oespel",-12]
[44328,"Dortmund - Scharnhorst",-12]
[44269,"Dortmund - Schüren",-12]
[44265,"Dortmund - Wichlinghofen",-12]
[27632,"Dorum",-10]
[74677,"Dörzbach",-14]
[4720,"Döschütz",-14]
[79739,"Dossenbach",-12]
[69221,"Dossenheim",-12]
[72359,"Dotternhausen",-18]
[72525,"Dottingen",-18]
[79282,"Dottingen",-14]
[56729,"Döttingen",-14]
[51674,"Drabenderhöhe",-12]
[94256,"Drachselsried",-18]
[73345,"Drackenstein",-18]
[21423,"Drage",-12]
[55127,"Drais",-12]
[31623,"Drakenburg",-12]
[37127,"Dransfeld",-14]
[4938,"Drasdo",-16]
[56330,"Dreckenach",-14]
[53520,"Drees",-14]
[63303,"Dreieich",-12]
[63303,"Dreieichenhain",-12]
[54518,"Dreis",-14]
[54552,"Dreis-Brück",-14]
[25853,"Drelsdorf",-10]
[48317,"Drensteinfurt",-12]
["010..","Dresden",-14]
[1108,"Dresden - Weixdorf",-14]
[59602,"Drewer",-14]
[33014,"Dringenberg",-14]
[19069,"Drispeth",-12]
[21706,"Drochtersen",-10]
[8606,"Dröda",-18]
[21386,"Drögennindorf",-14]
[57489,"Drolshagen",-12]
[91238,"Drosberg",-16]
[52372,"Drove",-14]
[6722,"Droyßig",-14]
[55585,"Duchroth",-12]
[63654,"Düdelsheim",-12]
[63110,"Dudenhofen",-12]
[37115,"Duderstadt",-16]
[66125,"Dudweiler / Saar",-12]
[74889,"Dühren",-12]
[31089,"Duingen",-14]
["47...","Duisburg",-10]
[41751,"Dülken",-10]
[48249,"Dülmen",-12]
[19073,"Dümmer",-12]
[19073,"Dümmerhütte",-12]
[19073,"Dümmerstück-Hof",-12]
[53520,"Dümpelfeld",-14]
[77743,"Dundenheim",-12]
[31226,"Dungelbeck",-14]
[56761,"Düngenheim",-14]
[78655,"Dunningen",-16]
[74582,"Dünsbach",-16]
[27243,"Dünsen",-14]
[54597,"Duppach",-14]
[77770,"Durbach",-12]
[78589,"Dürbheim",-18]
["523..","Düren",-12]
[73568,"Durlangen",-16]
[88525,"Dürmentingen",-14]
[76448,"Durmersheim",-12]
[73105,"Dürnau",-16]
[88422,"Dürnau",-14]
[72172,"Dürrenmettstetten",-16]
[72525,"Dürrenstetten (Münsingen)",-16]
[8396,"Dürrenuhlsdorf",-14]
[2708,"Dürrhennersdorf",-16]
[89350,"Dürrlauingen",-16]
[75248,"Dürrn",-14]
[1833,"Dürröhrsdorf",-14]
[72285,"Durrweiler",-16]
[4668,"Dürrweitzschen",-14]
[4720,"Dürrweitzschen",-14]
[51515,"Dürscheid",-12]
[29664,"Düshorn",-12]
["40...","Düsseldorf",-10]
[40221,"Düsseldorf Hamm",-10]
[72144,"Dußlingen",-16]
[35582,"Dutenhofen",-12]
[19205,"Dutzow",-12]
[39179,"Ebendorf",-14]
[87640,"Ebenhofen",-16]
[96250,"Ebensfeld",-16]
[88370,"Ebenweiler",-14]
[69412,"Eberbach a.N.",-12]
[71735,"Eberdingen",-14]
[88436,"Eberhardzell",-16]
[31079,"Eberholzen",-14]
[91320,"Ebermannstadt",-16]
[96106,"Ebern",-14]
[1561,"Ebersbach",-16]
[2730,"Ebersbach",-16]
[4720,"Ebersbach",-14]
[88371,"Ebersbach",-14]
[73061,"Ebersbach an der Fils",-16]
[85560,"Ebersberg",-16]
[8144,"Ebersbrunn",-14]
[34388,"Eberschütz",-14]
[2708,"Ebersdorf",-16]
[27432,"Ebersdorf",-12]
["091..","Ebersdorf",-14]
[72224,"Ebershardt",-16]
[74246,"Eberstadt",-14]
[74653,"Eberstal",-14]
[16227,"Eberswalde",-14]
[16225,"Eberswalde / Finow",-14]
[67280,"Ebertsheim",-12]
[72224,"Ebhausen",-16]
[72224,"Ebhausen",-16]
[72458,"Ebingen (Albstadt)",-18]
[8626,"Ebmath",-18]
[79117,"Ebnet",-16]
[73667,"Ebni-Kaiserbach",-16]
[79285,"Ebringen",-14]
[35085,"Ebsdorfergrund",-12]
[89423,"Echenbrunn",-16]
[84174,"Eching",-16]
[82279,"Eching am Ammersee",-16]
[89346,"Echlishausen",-16]
[86554,"Echsheim",-16]
[58739,"Echthausen",-12]
[77731,"Eckartsweier",-12]
[90542,"Eckental",-16]
[72108,"Eckenweiler",-16]
[24340,"Eckernförde",-10]
[37339,"Ecklingerode",-16]
[14913,"Eckmannsdorf",-14]
[99195,"Eckstedt",-14]
[97215,"Eckwarhofen",-16]
[29575,"Eddelstorf",-12]
[6388,"Edderitz",-14]
[88453,"Edelbeuren",-16]
[72285,"Edelweiler",-16]
[31234,"Edemissen",-14]
[88416,"Edenbachen",-16]
[67480,"Edenkoben",-12]
[34295,"Edermünde",-14]
[26188,"Edewecht",-12]
[26169,"Edewechterdamm/Friesoythe",-12]
[6420,"Edlau",-14]
[83533,"Edling",-16]
[41849,"Effeld",-10]
[50354,"Efferen",-12]
[72218,"Effringen",-16]
[79588,"Efringen-Kirchen",-12]
[88048,"Efrizweiler",-12]
[39435,"Egeln",-14]
[63329,"Egelsbach",-12]
[72227,"Egenhausen",-16]
[91238,"Egensbach",-16]
[78592,"Egesheim",-18]
[31848,"Egestorf a. Süntel",-14]
[86698,"Eggelstetten",-16]
[84307,"Eggenfelden",-16]
[73479,"Eggenrot",-16]
[76344,"Eggenstein",-12]
[49577,"Eggermühlen",-12]
[79805,"Eggingen",-14]
[89079,"Eggingen",-14]
[84385,"Egglham",-16]
[88410,"Eggmannsried",-16]
[91330,"Eggolsheim",-16]
[83125,"Eggstätt",-16]
[94535,"Eging a. See",-18]
[86492,"Egling a.d. Paar",-16]
[72531,"Eglingen",-18]
[89561,"Eglingen",-16]
[71634,"Eglosheim",-12]
[79588,"Egringen",-12]
[86676,"Ehekirchen",-16]
[72534,"Ehestetten",-16]
[89584,"Ehingen",-14]
[91725,"Ehingen",-16]
[31303,"Ehlershausen",-14]
[38442,"Ehmen",-14]
[71139,"Ehningen",-16]
[4430,"Ehrenberg",-14]
[4603,"Ehrenberg",-14]
[27248,"Ehrenburg",-12]
[79238,"Ehrenkirchen",-14]
[35630,"Ehringhausen",-12]
[35630,"Ehringshausen",-12]
[2739,"Eibau",-16]
[35713,"Eibelshausen",-14]
[8309,"Eibenstock",-16]
[67575,"Eich",-12]
[4720,"Eichardt",-14]
[76684,"Eichelberg",-12]
[57632,"Eichen",-14]
[82223,"Eichenau",-16]
[39167,"Eichenbarleben",-14]
[94428,"Eichendorf",-16]
[36148,"Eichenried",-14]
[36124,"Eichenzell",-14]
[85464,"Eicherloh",-16]
[52152,"Eicherscheid",-14]
[79618,"Eichsel",-12]
[85072,"Eichstätt",-16]
[39596,"Eichstedt",-14]
[79356,"Eichstetten",-12]
[15732,"Eichwalde",-14]
[39221,"Eickendorf",-14]
[35713,"Eiershausen",-14]
[4838,"Eilenburg",-14]
[38838,"Eilenstedt",-14]
[31535,"Eilvese",-14]
[31036,"Eime",-14]
[79591,"Eimeldingen",-12]
[37632,"Eimen",-14]
[39943,"Eimersleben",-14]
[37574,"Einbeck",-16]
[88356,"Einhart",-14]
[64683,"Einhausen",-12]
[66424,"Einöd",-12]
[85254,"Einsbach",-16]
[89079,"Einsingen",-14]
[27337,"Einste",-12]
[83549,"Eiselfing",-16]
[99817,"Eisenach",-16]
[67304,"Eisenberg",-12]
[87637,"Eisenberg",-18]
[88260,"Eisenharz",-16]
[97247,"Eisenheim",-14]
[85253,"Eisenhofen",-16]
[15890,"Eisenhüttenstadt",-16]
[77815,"Eisental",-12]
[98673,"Eisfeld",-16]
[75239,"Eisingen",-14]
[86447,"Eisingersdorf",-16]
[6295,"Eisleben",-14]
[73054,"Eislingen",-16]
[82272,"Eismerszell",-16]
[56337,"Eitelborn",-12]
[85117,"Eitensheim",-16]
[53783,"Eitorf",-12]
[85462,"Eitting",-16]
[31035,"Eitzum",-14]
[38170,"Eitzum",-14]
[57482,"Elben",-14]
[34311,"Elbenberg",-14]
[39326,"Elbeu",-14]
[4651,"Elbisbach",-14]
[76477,"Elchesheim",-12]
[76477,"Elchesheim - Illingen",-12]
[19294,"Eldena",-14]
[77656,"Elgersweier",-12]
[57578,"Elkenroth",-14]
[59955,"Elkeringhausen",-16]
[85567,"Elkofen",-16]
[8236,"Ellefeld",-16]
[73488,"Ellenberg",-16]
[40625,"Eller",-10]
[25479,"Ellerau",-12]
[25474,"Ellerbek",-12]
[35110,"Ellershausen",-14]
[86679,"Ellgau",-16]
[74248,"Ellhofen ",-14]
[91792,"Ellingen",-16]
[75210,"Ellmendingen",-14]
[99755,"Ellrich",-16]
[88430,"Ellwangen",-16]
[73479,"Ellwangen / Jagst",-16]
[89352,"Ellzee",-16]
[18107,"Elmenhorst",-10]
[23869,"Elmenhorst",-12]
[41372,"Elmpt",-10]
["2533.","Elmshorn",-12]
[67471,"Elmstein",-12]
[35041,"Elnhausen",-14]
[97990,"Elpersheim",-16]
[50189,"Elsdorf / Rheinl.",-12]
[33106,"Elsen",-12]
[63820,"Elsenfeld",-12]
[75031,"Elsenz",-14]
[26931,"Elsfleth",-10]
[57368,"Elspe",-14]
[6918,"Elster",-14]
[4523,"Elstertrebnitz",-14]
[4910,"Elsterwerda",-16]
[1920,"Elstra",-16]
[46446,"Elten",-10]
[97483,"Eltmann",-16]
[37269,"Eltmannshausen",-14]
[65346,"Eltville",-12]
[31311,"Eltze",-14]
[32052,"Elverdissen",-12]
[65604,"Elz (Westerwald)",-14]
[79215,"Elzach",-16]
[79215,"Elzach-Yach",-16]
[31008,"Elze",-14]
[74834,"Elztal",-14]
[21409,"Embsen",-12]
["2672.","Emden",-10]
[88499,"Emeringen",-16]
[86494,"Emersacker",-16]
[72535,"Emmabäuren",-18]
[56281,"Emmelshausen",-14]
[79312,"Emmendingen",-14]
[37627,"Emmerborn",-14]
[46446,"Emmerich",-10]
[82275,"Emmering",-16]
[31180,"Emmerke",-14]
[31860,"Emmern",-12]
[31860,"Emmerthal",-12]
[69126,"Emmertsgrund",-12]
[72202,"Emmingen",-16]
[78576,"Emmingen-Liptingen",-16]
[30952,"Empelde",-14]
[72186,"Empfingen",-16]
[72186,"Empfingen-Dommelsberg",-16]
[48488,"Emsbüren",-10]
[48282,"Emsdetten",-12]
[91448,"Emskirchen",-16]
[95233,"Enchenreuth",-18]
[71384,"Endersbach",-14]
[79346,"Endingen",-12]
[82544,"Endlhausen",-16]
[6333,"Endorf",-14]
[30855,"Engelbostel",-14]
[8606,"Engelhartsgrün",-18]
[27305,"Engeln",-12]
[56729,"Engeln",-14]
[75331,"Engelsbrand",-14]
[21710,"Engelschoff",-12]
[4439,"Engelsdorf",-14]
[51766,"Engelskirchen",-10]
[51766,"Engelskirchen",-12]
[55270,"Engelstadt",-12]
[91238,"Engelthal",-16]
[65527,"Engenhahn",-14]
[30938,"Engensen",-14]
[32130,"Enger",-12]
[4618,"Engertsdorf",-14]
[94530,"Engolling",-18]
[72829,"Engstingen",-18]
[72339,"Engstlatt",-16]
[72800,"Eningen",-16]
[58256,"Ennepetal",-12]
[57439,"Ennest",-14]
[88512,"Ennetach",-14]
[59320,"Ennigerloh",-12]
[66806,"Ensdorf",-12]
[59469,"Ense",-12]
[55232,"Ensheim",-12]
[71665,"Ensingen",-14]
[72119,"Entringen",-16]
[75417,"Enzberg",-14]
[75337,"Enzklösterle",-16]
[71665,"Enzweihingen",-14]
[86920,"Epfach",-16]
[74925,"Epfenbach",-12]
[78736,"Epfendorf",-16]
[66571,"Eppelborn",-12]
[69214,"Eppelheim",-12]
[66957,"Eppenbrunn",-12]
[9575,"Eppendorf",-16]
[65779,"Eppenhain",-14]
[94536,"Eppenschlag",-18]
[75031,"Eppingen",-14]
[86450,"Eppishofen",-16]
[65817,"Eppstein",-14]
[64711,"Erbach",-14]
[65346,"Erbach",-12]
[89155,"Erbach",-14]
[65205,"Erbenheim",-12]
[21365,"Erbstorf",-12]
[32689,"Erder",-12]
[85435,"Erding",-16]
[71729,"Erdmannhausen",-12]
[9573,"Erdmannsdorf",-14]
[85253,"Erdweg",-16]
[86922,"Eresing",-16]
[50374,"Erftstadt",-12]
["990..","Erfurt",-14]
[99094,"Erfurt-Hochheim",-14]
[66996,"Erfweiler",-12]
[72108,"Ergenzingen",-16]
[84030,"Ergolding",-16]
[84061,"Ergoldsbach",-18]
[58239,"Ergste",-12]
[88521,"Erisdorf",-14]
[88097,"Eriskirch",-12]
[87778,"Erisried",-16]
[41812,"Erkelenz",-10]
[33034,"Erkeln",-14]
[73268,"Erkenbrechtsweiler",-16]
[15537,"Erkner",-14]
[40699,"Erkrath",-10]
[97250,"Erlabrunn",-14]
[77871,"Erlach",-12]
[72651,"Erlaheim",-16]
["9105.","Erlangen",-16]
[8265,"Erlbach",-18]
[9326,"Erlbach",-14]
[46348,"Erle",-10]
[74235,"Erlenbach",-12]
[97837,"Erlenbach b.Marktheidenfeld",-12]
[76872,"Erlenbach bei Kandel, Palz",-12]
[88416,"Erlenmoos",-16]
[63526,"Erlensee",-12]
[74391,"Erligheim",-12]
[86405,"Erlingen",-16]
[87487,"Ermengerst",-16]
[89081,"Ermingen",-14]
[6463,"Ermsleben",-14]
[85119,"Ernsgaden",-18]
[35099,"Ernsthausen",-14]
[75365,"Ernstmühl",-14]
[88453,"Erolzheim",-16]
[72820,"Erpfingen",-18]
[67167,"Erpolzheim",-12]
[75236,"Ersingen",-14]
[89155,"Ersingen",-14]
[88521,"Ertingen",-14]
[59597,"Erwitte",-12]
[33039,"Erwitzen",-14]
[39343,"Erxleben",-14]
[72297,"Erzgrube",-16]
[64390,"Erzhausen",-12]
[72336,"Erzingen",-18]
[54585,"Esch",-14]
[73569,"Eschach",-16]
[61250,"Eschbach",-14]
[79427,"Eschbach",-12]
[65760,"Eschborn",-12]
[78664,"Eschbronn",-16]
[29348,"Eschede",-14]
[85283,"Eschelbach",-18]
[90542,"Eschenau",-16]
[73107,"Eschenbach",-16]
[92676,"Eschenbach",-16]
[97483,"Eschenbach",-16]
[99869,"Eschenberg",-14]
[35713,"Eschenburg",-14]
[92295,"Eschenfelden",-16]
[63679,"Eschenrod",-14]
[37632,"Eschershausen",-14]
[93458,"Eschlkam",-18]
[53840,"Eschmar",-12]
[37269,"Eschwege",-14]
[52249,"Eschweiler / Rheinl.",-12]
[88271,"Esenhausen",-14]
[53804,"Esinghausen",-12]
[59889,"Eslohe",-14]
[32339,"Espelkamp",-12]
[65391,"Espenschied",-14]
[24887,"Esperstoft",-12]
[97839,"Esselbach",-14]
[49632,"Essen",-12]
["45...","Essen",-10]
["45...","Essen - Burgaltenburg",-12]
[45239,"Essen - Fischlaken",-10]
[45239,"Essen - Heidhausen",-10]
[45259,"Essen - Heisingen",-10]
[45219,"Essen - Kettwig",-10]
[45359,"Essen - Schönebeck",-10]
[45133,"Essen - Schuir",-10]
[45141,"Essen - Stoppenberg",-10]
[45277,"Essen - Überruhr-Hinsel",-10]
[45277,"Essen - Überruhr-Holthausen",-10]
[45239,"Essen - Werden",-10]
[45149,"Essen Haarzopf",-10]
[84051,"Essenbach",-16]
[55270,"Essenheim",-12]
[73457,"Essingen",-16]
[97440,"Eßleben",-14]
[78532,"Eßlingen",-16]
["737..","Esslingen am Neckar",-14]
[97230,"Estenfeld",-14]
[26897,"Esterwegen",-12]
[31629,"Estorf",-12]
[27299,"Etelsen",-12]
[66871,"Etschberg",-12]
[33178,"Etteln",-14]
[89358,"Ettenbeuren",-16]
[99819,"Ettenhausen a. d. Suhl",-16]
[77955,"Ettenheim",-12]
[77955,"Ettenheimmünster",-14]
[88048,"Ettenkirch",-14]
[82237,"Etterschlag",-16]
[86641,"Etting",-16]
[76275,"Ettlingen",-12]
[76275,"Ettlingenweier",-12]
[72226,"Ettmannsweiler",-16]
[26446,"Etzel",-10]
[92268,"Etzelwang",-16]
[76337,"Etzenrot",-14]
[9128,"Euba",-14]
[74744,"Eubigheim",-16]
[53879,"Euenheim",-14]
[4651,"Eulatal",-14]
[1623,"Eulitz",-14]
[3149,"Eulo",-16]
[82547,"Eurasburg",-16]
["538..","Euskirchen",-12]
[97776,"Eussenheim",-16]
[23701,"Eutin",-10]
[72184,"Eutingen",-16]
[29379,"Eutzen",-14]
[83552,"Evenhausen",-16]
[31085,"Everode",-16]
[29303,"Eversen",-14]
[18055,"Evershagen",-10]
[48351,"Everswinkel",-12]
[32699,"Extertal",-14]
[72184,"Eyach",-16]
[73312,"Eybach",-16]
[21376,"Eyendorf",-14]
[27324,"Eystrup",-12]
[56133,"Fachbach",-12]
[73434,"Fachsenfeld",-16]
[24857,"Fahrdorf",-10]
[23999,"Fährdorf",-10]
[74864,"Fahrenbach",-14]
[14476,"Fahrland",-14]
[79868,"Falkau",-18]
[4880,"Falkenberg",-16]
[4895,"Falkenberg",-16]
[34590,"Falkenberg",-14]
[39615,"Falkenberg",-14]
[84326,"Falkenberg",-16]
[1776,"Falkenhain",-16]
[14612,"Falkensee",-14]
[93167,"Falkenstein/Oberpf.",-18]
[29683,"Fallingbostel",-12]
[29328,"Faßberg",-14]
[97906,"Faulbach",-14]
[73035,"Faurndau",-16]
[77855,"Fautenbach",-12]
[78628,"Feckenheim",-18]
[25779,"Fedderingen",-10]
[64625,"Fehlheim",-12]
[23769,"Fehmarn",-10]
[49733,"Fehndorf",-10]
[3096,"Fehrow",-16]
[36325,"Feldatal",-14]
[17258,"Feldberg",-14]
[79868,"Feldberg / Schwarzwald",-18]
[61389,"Feldberg/Taunus",-16]
[24242,"Felde",-10]
[46244,"Feldhausen",-10]
[72501,"Feldhausen",-16]
[79258,"Feldkirch",-12]
[85622,"Feldkirchen",-16]
[83620,"Feldkirchen-Westerham",-18]
[46483,"Feldmark",-18]
[80995,"Feldmoching",-16]
[75334,"Feldrennach",-14]
[3130,"Felixsee OT Reuthen",-16]
["7073.","Fellbach / Württ.",-12]
[72181,"Felldorf",-16]
[87748,"Fellheim",-16]
[34587,"Felsberg",-14]
[92269,"Fensterbach",-16]
[53577,"Fernthal",-14]
[35463,"Fernwald",-14]
[77654,"Fessenbach",-12]
[90537,"Feucht",-16]
[91555,"Feuchtwangen",-16]
[79400,"Feuerbach",-14]
["70...","Feuerbach",-12]
[54584,"Feusdorf",-14]
[95686,"Fichtelberg / Oberfr.",-16]
[74579,"Fichtenau",-16]
[4931,"Fichtenberg",-16]
[74427,"Fichtenberg",-16]
[14547,"Fichtenwalde",-14]
[94405,"Fichtheim",-18]
[70794,"Filderstadt",-14]
[89281,"Filzingen",-16]
[64757,"Finkenbach",-14]
[21129,"Finkenwerder / Hamburg",-12]
[57413,"Finnentrop",-14]
[86923,"Finning",-16]
[89435,"Finningen",-16]
[89233,"Finningen ( Neu Ulm )",-14]
[16244,"Finowfurt",-14]
[85464,"Finsing",-16]
[3238,"Finsterwalde",-16]
[65779,"Fischbach",-14]
[88048,"Fischbach",-12]
[83730,"Fischbachau",-18]
[64405,"Fischbachtal",-14]
[31840,"Fischbeck",-14]
[21149,"Fischbek",-12]
[47807,"Fischeln",-10]
[87538,"Fischen",-20]
[50354,"Fischenich",-12]
[77716,"Fischerbach",-14]
[72172,"Fischingen",-16]
[79592,"Fischingen",-12]
[91604,"Flachslanden",-16]
[53879,"Flamersheim",-14]
[75038,"Flehingen",-14]
[74223,"Flein",-12]
[88373,"Fleischwangen",-14]
[16306,"Flemsdorf",-16]
["249..","Flensburg",-10]
[54597,"Fleringen",-14]
[38539,"Flettmar",-14]
[36103,"Flieden",-14]
[24220,"Flintbek",-10]
[83126,"Flintsbach",-18]
[98593,"Floh",-16]
[9557,"Flöha",-14]
[98593,"Floh-Seligenthal",-16]
[61197,"Florstadt",-12]
[4651,"Flößberg",-14]
[92696,"Flossenbürg",-18]
[52499,"Floverich",-12]
[78658,"Flözlingen",-16]
[24787,"Fockbek",-12]
[37603,"Fohlenplacken",-14]
[31061,"Föhrste",-16]
[76596,"Forbach",-16]
[79362,"Forchheim / Breisgau",-12]
[9509,"Forchheim / Erzgebirge",-16]
[91301,"Forchheim / Oberfr.",-16]
[71540,"Fornsbach",-16]
[76694,"Forst",-12]
[3149,"Forst/Lausitz",-16]
[81476,"Forstenried",-16]
[85659,"Forstern",-16]
[4668,"Förstgen",-14]
[94550,"Forsthart",-18]
[85661,"Forstinning",-16]
[90542,"Forth",-16]
[17091,"Fouquettin",-14]
[97833,"Frammersbach",-14]
[35110,"Frankenau",-14]
[9669,"Frankenberg",-16]
[35066,"Frankenberg",-14]
[93179,"Frankenberg",-18]
[15926,"Frankendorf",-16]
[99441,"Frankendorf",-14]
[4430,"Frankenheim",-14]
[98634,"Frankenheim",-16]
[89584,"Frankenhofen",-16]
[92726,"Frankenreuth",-18]
[67227,"Frankenthal / Pfalz",-12]
["60...","Frankfurt / Main",-12]
["1523.","Frankfurt / Oder",-16]
[60437,"Frankfurt-Harheim",-12]
[65934,"Frankfurt-Nied",-12]
[94258,"Frauenau",-18]
[91056,"Frauenaurach",-16]
[93339,"Frauenberghausen",-16]
[4643,"Frauendorf",-14]
[1609,"Frauenhain",-16]
[83553,"Frauenneuharting",-16]
[9623,"Frauenstein",-16]
[98711,"Frauenwald",-16]
[8427,"Fraureuth",-16]
[50226,"Frechen",-10]
[39317,"Frechland",-14]
[48231,"Freckenhorst",-12]
[31084,"Freden",-16]
[15370,"Fredersdorf b.Berlin",-14]
[17440,"Freest",-12]
[79348,"Freiamt",-14]
[9599,"Freiberg",-16]
[71691,"Freiberg",-12]
["79...","Freiburg i. Br.",-12]
[16559,"Freienhagen",-14]
[59872,"Freienohl",-14]
[35321,"Freienseen",-14]
[36399,"Freiensteinau",-14]
[24991,"Freienwill",-10]
[63579,"Freigericht",-12]
[55234,"Freimersheim",-12]
[66629,"Freisen",-14]
[53505,"Freisheim",-14]
["8535.","Freising",-16]
[27259,"Freistatt",-12]
[77866,"Freistett",-12]
[1705,"Freital",-14]
[45127,"Freital",-14]
[15910,"Freiwalde",-16]
[4685,"Fremdiswalde",-14]
[96158,"Frensdorf",-16]
[49832,"Freren",-12]
[57413,"Fretter",-14]
[57258,"Freudenberg",-12]
[92272,"Freudenberg",-16]
[97896,"Freudenberg",-14]
[72250,"Freudenstadt",-16]
[75438,"Freudenstein",-14]
[74392,"Freudental",-12]
[72419,"Freudenweiler",-18]
[92342,"Freystadt",-16]
[94078,"Freyung",-18]
[72636,"Frickenhausen",-16]
[97252,"Frickenhausen",-14]
[88699,"Frickingen",-14]
[78567,"Fridingen",-16]
[78567,"Fridingen an der Donau",-16]
[61169,"Friedberg",-12]
[86316,"Friedberg",-16]
[95688,"Friedenfels",-18]
[79877,"Friedenweiler",-18]
[24327,"Friederikental",-10]
[2829,"Friedersdorf",-16]
[15306,"Friedersdorf",-14]
[15754,"Friedersdorf",-14]
[36289,"Friedewald ",-14]
[32469,"Friedewalde",-12]
[78224,"Friedingen",-14]
[15848,"Friedland",-16]
[17098,"Friedland",-14]
[37133,"Friedland",-16]
[6507,"Friedrichsbrunn",-16]
[61381,"Friedrichsdorf / Taunus",-14]
[8149,"Friedrichsgrün",-14]
["8804.","Friedrichshafen",-12]
[15754,"Friedrichshof",-14]
[85049,"Friedrichshofen",-16]
[74639,"Friedrichsruhe",-14]
[56112,"Friedrichssegen",-12]
[16306,"Friedrichsthal",-14]
[16247,"Friedrichswalde",-14]
[30826,"Frielingen (Garbsen 8)",-14]
[51789,"Frielingsdorf",-12]
[96317,"Friesen",-16]
[51598,"Friesenhagen",-12]
[77948,"Friesenheim",-12]
[93092,"Friesheim",-18]
[26169,"Friesoythe",-12]
[71292,"Friolzheim",-16]
[78665,"Frittlingen",-18]
[53343,"Fritzdorf",-14]
[33034,"Frohnhausen",-14]
[90542,"Frohnhof",-16]
[92256,"Frohnhof",-16]
[72510,"Frohnstetten",-16]
[58730,"Fröndenberg",-12]
[86657,"Fronhofen",-16]
[88273,"Fronhofen",-14]
[88273,"Fronreute",-14]
[84160,"Frontenhausen",-16]
[6464,"Frose",-14]
[85646,"Frotzhofen",-16]
[86925,"Fuchstal-Leeder",-16]
[50769,"Fühlingen",-10]
[30938,"Fuhrberg",-12]
["360..","Fulda",-14]
[34277,"Fuldabrück",-14]
[88348,"Fulgenstadt",-14]
[38304,"Fümmelse",-14]
[88436,"Füramoos",-16]
[55546,"Fürfeld",-12]
[74906,"Fürfeld",-14]
[92262,"Fürnried",-16]
[37671,"Fürstenau",-14]
[49584,"Fürstenau",-12]
[33181,"Fürstenberg",-14]
[37699,"Fürstenberg",-14]
[16798,"Fürstenberg Havel",-14]
[82256,"Fürstenfeldbruck",-16]
[17235,"Fürstensee",-14]
[94538,"Fürstenstein",-18]
[15517,"Fürstenwalde / Spree",-14]
[17291,"Fürstenwerder",-14]
[94081,"Fürstenzell",-16]
[3246,"Fürstlich Drehna",-16]
[84095,"Furth",-16]
["9076.","Fürth / Bay.",-16]
[93437,"Furth im Wald",-18]
[77723,"Fußbach",-14]
[53909,"Füssenich",-14]
[67136,"Fussgönheim",-12]
[24327,"Futterkamp",-10]
[2953,"Gablenz",-16]
[86456,"Gablingen",-16]
[55288,"Gabsheim",-12]
[82813,"Gächingen",-18]
[56412,"Gackenbach",-12]
[19089,"Gädebehn",-12]
[19205,"Gadebusch",-12]
[31246,"Gadenstedt",-14]
[64686,"Gadernheim",-14]
[4720,"Gadewitz",-14]
[23968,"Gägelow",-10]
[76571,"Gaggenau",-14]
[74592,"Gaggstatt",-16]
[9569,"Gahlenz",-16]
[4618,"Gähsnitz",-14]
[97332,"Gaibach",-14]
[69251,"Gaiberg",-12]
[78343,"Gaienhofen",-12]
[63743,"Gailbach (Aschaffenburg)",-12]
[74405,"Gaildorf",-16]
[74523,"Gailenkirchen",-16]
[30891,"Gailhof",-14]
[78262,"Gailingen",-12]
[85080,"Gaimersheim",-16]
[74653,"Gaisbach",-12]
[88339,"Gaisbeuren",-16]
[86480,"Gaismarkt",-16]
[83674,"Gaißach",-18]
[92539,"Gaisthal",-18]
[79423,"Gallenweiler",-14]
[3058,"Gallinchen (Cottbus)",-16]
[4720,"Gallschütz",-14]
[19230,"Gammelin",-12]
[85408,"Gammelsdorf",-16]
[73108,"Gammelshausen",-16]
[72501,"Gammertingen",-16]
[74572,"Gammesfeld",-16]
[77855,"Gamshurst",-12]
[99192,"Gamstädt",-14]
[19309,"Gandow",-14]
[52538,"Gangelt",-10]
[84140,"Gangkofen",-16]
[18276,"Ganschow",-12]
[19205,"Ganzow",-12]
[30826,"Garbsen",-14]
[4618,"Garbus",-14]
[84518,"Garching",-16]
[39638,"Gardelegen",-14]
[25836,"Garding",-10]
[59558,"Garfeln",-12]
[27711,"Garlstedt",-12]
[21376,"Garlstorf",-12]
[92245,"Gärmersdorf",-16]
[82467,"Garmisch-Partenkirchen",-18]
[6571,"Garnbach",-14]
[9238,"Garnsdorf",-14]
[49681,"Garrel",-12]
[72213,"Garrweiler",-16]
[71116,"Gärtringen",-16]
[16307,"Gartz",-14]
[6466,"Gatersleben",-14]
[14089,"Gatow",-14]
[95185,"Gattendorf",-18]
[55435,"Gau-Algesheim",-12]
[69181,"Gauangelloch",-12]
[55599,"Gau-Bickelheim",-12]
[55296,"Gau-Bischofsheim",-12]
[4769,"Gaudlitz",-14]
[71126,"Gäufelden",-16]
[97253,"Gaukönigshofen",-14]
[72393,"Gauselfingen",-18]
[82131,"Gauting",-16]
[86444,"Gebenhofen",-16]
[71229,"Gebersheim",-14]
[99189,"Gebesee",-14]
[88299,"Gebrazhofen",-16]
[91607,"Gebsattel",-16]
[75391,"Gechingen",-16]
[21502,"Geesthacht",-12]
[27607,"Geestland",-10]
[17375,"Gegensee",-12]
[32312,"Gehlenbeck",-12]
[26169,"Gehlenberg",-12]
[49596,"Gehrde",-12]
[30989,"Gehrden",-14]
[33034,"Gehrden",-14]
[73642,"Gehren",-16]
[98708,"Gehren",-16]
[53909,"Geich",-14]
[52511,"Geilenkirchen",-12]
[56379,"Geilnau",-12]
[8538,"Geilsdorf",-18]
[36419,"Geisa",-16]
[58239,"Geisecke",-12]
[63826,"Geiselbach",-14]
[82140,"Geiselbullach",-16]
[85290,"Geisenfeld",-18]
[84144,"Geisenhausen",-16]
[65366,"Geisenheim",-12]
[1778,"Geising",-16]
[78187,"Geisingen",-16]
[72351,"Geislingen",-16]
[73312,"Geislingen / Steige",-16]
[4643,"Geithain",-14]
[18182,"Gelbensande",-10]
[97255,"Gelchsheim",-16]
[47608,"Geldern",-10]
[97505,"Geldersheim",-16]
[37130,"Gelliehausen",-16]
[63571,"Gelnhausen",-12]
[63571,"Gelnhausen-Hailer",-14]
["458..","Gelsenkirchen",-10]
[45889,"Gelsenkirchen - Bismarck",-10]
[45857,"Gelsenkirchen - Buer",-10]
[45891,"Gelsenkirchen - Erle",-10]
[45883,"Gelsenkirchen - Heßler",-10]
[45881,"Gelsenkirchen - Schalke-Nord",-10]
[45897,"Gelsenkirchen - Scheffrath",-10]
[82269,"Geltendorf",-16]
[85652,"Gelting",-16]
[1877,"Gemitz - Thumitz",-16]
[75050,"Gemmingen",-14]
[74376,"Gemmrigheim",-12]
[74376,"Gemmringheim",-12]
[35329,"Gemünden",-14]
[55490,"Gemünden",-14]
[97737,"Gemünden a. Main",-14]
[86682,"Genderkingen",-16]
[77723,"Gengenbach",-12]
[72820,"Genkingen",-18]
[86853,"Gennach",-16]
[55457,"Gensingen",-12]
[39307,"Genthin",-14]
[65388,"Georgenborn",-14]
[91166,"Georgensgmünd",-16]
[49124,"Georgsmarienhütte",-12]
["075..","Gera",-14]
[98716,"Geraberg",-16]
[74582,"Gerabronn",-16]
[73630,"Geradstetten",-14]
[37318,"Gerbershausen",-16]
[41812,"Gerderath",-10]
[86947,"Geretshausen",-16]
[82538,"Geretsried",-16]
[4827,"Gerichshain",-14]
[97950,"Gerichsheim",-14]
[74736,"Gerichtstetten",-16]
[56751,"Gering",-14]
[9326,"Geringswalde",-14]
[97922,"Gerlachsheim (Lauda-Königshofen, Baden )",-14]
[89223,"Gerlenhofen",-16]
[57482,"Gerlingen",-14]
[70839,"Gerlingen",-14]
[94051,"Germannsdorf",-18]
[82110,"Germering",-16]
[82216,"Germerswang",-16]
[37339,"Gernrode",-16]
[76593,"Gernsbach",-14]
[64579,"Gernsheim",-12]
[97779,"Geroda",-16]
[37345,"Gerode",-16]
[97447,"Gerolzhofen",-16]
[1920,"Gersdorf",-16]
[2829,"Gersdorf",-16]
[9355,"Gersdorf",-14]
[9661,"Gersdorf",-14]
[36129,"Gersfeld",-16]
[66453,"Gersheim",-12]
[4617,"Gerstenberg",-14]
[89547,"Gerstetten",-16]
[86368,"Gersthofen",-16]
[99834,"Gerstungen",-16]
[17268,"Gerswalde",-14]
[48712,"Gescher",-10]
[79674,"Geschwend",-16]
[59590,"Geseke",-12]
[28857,"Gessel",-12]
[4552,"Gestewitz",-14]
[36269,"Gethsemane",-14]
[58285,"Gevelsberg",-12]
[9456,"Geyersdorf",-16]
[37434,"Gieboldehausen",-16]
[89537,"Giengen a.d. Brenz",-16]
[41363,"Gierath",-10]
[65558,"Giershausen",-14]
[99100,"Gierstädt",-14]
[34399,"Gieselwerder",-12]
[31180,"Giesen",-14]
["353..","Gießen",-12]
[38518,"Gifhorn",-14]
[82205,"Gilching",-16]
[54558,"Gillenfeld",-14]
[52511,"Gillrath",-12]
[34630,"Gilserberg",-14]
[29690,"Gilten",-12]
[67578,"Gimbsheim",-12]
[48268,"Gimbte",-12]
[55767,"Gimbweiler",-14]
[67435,"Gimmeldingen",-12]
[53343,"Gimmersdorf",-14]
[46487,"Ginderich",-10]
[73333,"Gingen",-16]
[67742,"Ginsweiler",-12]
[54584,"Glaadt",-14]
["4596.","Gladbeck / Westf.",-10]
[37181,"Gladebeck",-16]
[66887,"Glanbrücken",-14]
[49219,"Glandorf",-12]
[66907,"Glan-Münchweiler",-12]
[74731,"Glashofen",-14]
[1768,"Glashütte",-14]
[31195,"Glashütte",-16]
[61479,"Glashütten/Taunus",-14]
[72172,"Glatt",-16]
[72293,"Glatten",-16]
[63695,"Glauburg",-12]
[8371,"Glauchau",-14]
[56653,"Glees",-14]
[41352,"Glehn",-10]
[37130,"Gleichen",-16]
[93339,"Gleislhof",-16]
[93477,"Gleißenberg",-18]
[72555,"Glems",-16]
[4435,"Glesien",-14]
[4509,"Glesien",-14]
[50129,"Glessen",-12]
[19306,"Glewe",-14]
[15806,"Glienick",-14]
[16548,"Glienicke",-14]
[21509,"Glinde",-12]
[39248,"Glinde",-14]
[39326,"Glindenberg",-14]
[56588,"Glockscheid",-12]
[4769,"Glossen",-14]
[79286,"Glottertal",-14]
[18551,"Glowe",-10]
[24960,"Glücksburg",-10]
[25348,"Glückstadt",-10]
[83703,"Gmund",-18]
[27442,"Gnarrenburg",-12]
[2692,"Gnaschwitz",-16]
[19065,"Gneven",-12]
[7616,"Gniebsdorf",-14]
[24622,"Gnutz",-12]
[47574,"Goch",-10]
[97469,"Gochsheim",-14]
[2633,"Göda",-16]
[37671,"Godelheim",-14]
[31061,"Godenau",-14]
[54310,"Godendorf",-12]
[19065,"Godern",-12]
[39264,"Gödnitz",-14]
[31157,"Gödringen",-14]
[88527,"Göffingen",-14]
[85653,"Göggenhofen",-16]
[72505,"Göggingen",-14]
[73571,"Göggingen",-16]
[86199,"Göggingen",-16]
[4420,"Göhrenz",-14]
[1824,"Gohrisch",-14]
[1824,"Gohrisch",-16]
[85399,"Goldach",-16]
[63773,"Goldbach",-12]
[39596,"Goldbeck",-14]
[4720,"Göldnitz",-14]
[6567,"Göllingen",-14]
[86657,"Göllingen",-16]
[4509,"Gollmenz",-14]
[17291,"Gollmitz",-14]
[37640,"Golmbach",-14]
[7751,"Golmsdorf",-14]
[14913,"Gölsdorf",-14]
[75015,"Gölshausen",-12]
[6785,"Goltewitz",-14]
[4668,"Golzern",-14]
[52399,"Golzheim",-12]
[72532,"Gomadingen",-18]
[72810,"Gomaringen",-16]
[39245,"Gommern",-14]
[14822,"Gömnigk",-14]
[75053,"Gondelsheim",-12]
[35719,"Gönnern",-14]
[54584,"Gönnersdorf",-14]
[67161,"Gönnheim",-12]
[72770,"Gönningen",-16]
[35315,"Gontershausen",-14]
["7303.","Göppingen",-14]
[73035,"Göppingen-Bezgenriet",-16]
[73037,"Göppingen-Hohenstaufen",-16]
[73037,"Göppingen-Holzheim",-16]
[73037,"Göppingen-Maitis",-16]
[17291,"Göritz",-14]
[1809,"Gorknitz",-14]
["0282.","Görlitz",-16]
[17121,"Görmin",-12]
[9405,"Gornau",-16]
[4703,"Gorschmitz",-14]
[6577,"Gorsleben",-14]
[79733,"Görwihl",-14]
[69517,"Gorxheimertal",-12]
[73342,"Gosbach",-18]
[4720,"Goselitz",-14]
[78559,"Gosheim",-18]
["3864.","Goslar",-14]
[8427,"Gospersgrün",-16]
[19249,"Gößlow",-12]
[4639,"Gößnitz",-14]
[91327,"Gössweinstein",-16]
[4838,"Gotha",-14]
[99867,"Gotha",-14]
[39240,"Göthe",-14]
[72297,"Göttelfingen",-16]
[79288,"Gottenheim",-12]
[19209,"Gottesgabe",-12]
[94239,"Gotteszell",-18]
[84177,"Gottfrieding",-18]
["3707.","Göttingen",-16]
[14712,"Göttlin",-14]
[84166,"Göttlkofen",-16]
[78244,"Gottmadingen",-12]
[94107,"Gottsdorf",-18]
[14778,"Götz",-14]
[18181,"Graal-Müritz",-10]
[71577,"Grab",-16]
[21493,"Grabau",-12]
[76676,"Graben Neudorf",-12]
[86836,"Graben, Lechfeld",-16]
[72582,"Grabenstetten",-16]
[14823,"Grabow",-14]
[19300,"Grabow",-14]
[4886,"Graditz",-16]
[49626,"Grafeld",-12]
[31079,"Grafelde",-16]
[82166,"Gräfelfing",-16]
[71120,"Grafenau",-16]
[94481,"Grafenau",-18]
[72661,"Grafenberg",-16]
[91322,"Gräfenberg",-16]
[4916,"Gräfendorf",-16]
[72532,"Grafeneck an der Lauter",-18]
[6772,"Gräfenhainichen",-14]
[77966,"Grafenhausen",-12]
[79865,"Grafenhausen",-16]
[75217,"Gräfenhausen",-14]
[99330,"Gräfenroda",-16]
[93479,"Grafenwiesen",-18]
[92655,"Grafenwöhr",-16]
[89264,"Grafertshofen",-16]
[98704,"Gräfinau",-16]
[85567,"Grafing",-16]
[82284,"Grafrath",-16]
[53501,"Grafschaft",-14]
[53501,"Grafschaft-Birresdorf",-14]
[82491,"Grainau",-18]
[83122,"Grainbach",-18]
[17375,"Grambin",-12]
[17375,"Grambin-Zeltplatz",-12]
[23968,"Gramkow",-10]
[17291,"Gramzow",-14]
[89584,"Granheim",-16]
[16775,"Gransee",-14]
[41812,"Granterath",-12]
[28879,"Grasberg",-12]
[31188,"Grasdorf",-14]
[64689,"Grasellenbach",-14]
[39579,"Grassau",-14]
[94541,"Grattersdorf",-18]
[1796,"Graupa",-14]
[1827,"Graupa",-14]
[37647,"Grave",-12]
[61279,"Grävenwiesbach",-14]
[17419,"Graz",-12]
[19374,"Grebbin",-14]
[4509,"Grebehna",-14]
[37276,"Grebendorf",-16]
[34393,"Grebenstein",-14]
[91171,"Greding",-16]
[33428,"Greffen",-12]
[77836,"Greffern",-12]
[47929,"Grefrath",-10]
[86926,"Greifenberg",-16]
[9661,"Greifendorf",-14]
[3116,"Greifenhain",-16]
[35753,"Greifenstein",-14]
["174..","Greifswald",-12]
[83677,"Greiling",-18]
[87755,"Greimeltshofen",-16]
[7973,"Greiz",-16]
[48167,"Gremmendorf",-12]
[24975,"Gremmerup",-10]
[79639,"Grenzach - Wyhlen",-12]
[48268,"Greven / Westf.",-12]
["4151.","Grevenbroich",-10]
[23936,"Grevesmühlen",-10]
[79206,"Grezhausen",-12]
[18516,"Griebenow",-12]
[77740,"Griesbach",-16]
[94086,"Griesbach",-16]
[6786,"Griesen",-14]
[64347,"Griesheim",-12]
[77652,"Griesheim",-12]
[89608,"Griesingen",-14]
[9112,"Griffen / Österreich",-18]
[4668,"Grimma",-14]
[18507,"Grimmen",-12]
[79395,"Grißheim",-12]
[17498,"Gristow",-12]
[8538,"Grobau",-16]
[82194,"Gröbenzell",-16]
[6184,"Gröbers",-14]
[1609,"Gröditz",-16]
[2627,"Gröditz",-16]
[88456,"Grodt",-16]
[31860,"Grohnde",-12]
[4539,"Groitzsch",-14]
[4838,"Groitzsch",-14]
[74906,"Grombach",-12]
[72294,"Grömbach",-16]
[23743,"Grömitz",-10]
[31028,"Gronau",-14]
[71720,"Gronau",-14]
[48599,"Gronau / Westf.",-10]
[39397,"Gröningen",-14]
[95701,"Groschlattengrün",-18]
[19258,"Groß Bengerstorf",-12]
[31855,"Groß Berkel",-14]
[38319,"Groß Biewende",-14]
[39435,"Groß Börnecke",-14]
[69509,"Groß Breitenbach",-14]
[31171,"Groß Escherde",-14]
[64521,"Gross Gerau",-12]
[23627,"Groß Grönau",-12]
[18442,"Groß Kordshagen",-10]
[15746,"Groß Köris",-14]
[23966,"Groß Krankow",-12]
[19288,"Groß Laasch",-14]
[31246,"Groß Lafferde",-14]
[15913,"Groß Leine",-16]
[19336,"Groß Lüben",-14]
[18445,"Groß Mohrdorf",-10]
[19217,"Groß Molzahn",-12]
[3058,"Groß Oßnig",-16]
[17489,"Groß Petershagen",-12]
[68649,"Groß Rohrheim",-12]
[39240,"Groß Rosenburg",-14]
[23627,"Groß Sarau",-12]
[2999,"Groß Särchen",-16]
[16348,"Groß Schönebeck",-14]
[15806,"Groß Schulzendorf",-14]
[39579,"Groß Schwechten",-14]
[23972,"Groß Stieten",-12]
[64823,"Groß Umstadt",-14]
[24802,"Groß Vollstedt",-12]
[17166,"Groß Wokern",-12]
[64846,"Groß Zimmern",-14]
[86845,"Großaiting",-16]
[86845,"Großaitingen",-16]
[63457,"Grossauheim",-12]
[14979,"Großbeeren",-14]
[72663,"Großbettlingen",-16]
[64401,"Groß-Bieberau",-14]
[71723,"Großbottwar",-14]
[30938,"Großburgwedel",-14]
[4460,"Großdalzig",-14]
[73527,"Großdeinbach",-16]
[1665,"Großdobritz",-16]
[97633,"Großeibstadt",-16]
[72415,"Grosselfingen",-16]
[31812,"Großenberg",-14]
[34582,"Großenenglis",-14]
[99991,"Großengottern",-14]
[1558,"Großenhain",-16]
[31515,"Grossenheidorn",-14]
[71577,"Großenlach",-16]
[36137,"Großenlüder",-14]
[91091,"Großenseebach",-16]
[21712,"Großenwörden",-12]
[1454,"Großerkmannsdorf",-14]
[99100,"Großfahner",-14]
[8541,"Großfriesen",-16]
[99706,"Großfurra",-14]
[75417,"Großglattbach",-14]
[6686,"Großgörschen",-14]
[2994,"Großgrabe",-16]
[6246,"Großgräfendorf",-14]
[90427,"Großgründlach",-16]
[90613,"Großhabersdorf",-16]
[1906,"Großhänchen",-16]
[1909,"Großharthau",-14]
[9618,"Großhartmannsdorf",-16]
[83607,"Großhartpenning",-18]
[96269,"Großheirath",-16]
[2747,"Großhennersdorf",-16]
[63920,"Großheubach",-14]
[85244,"Großinzemoos",-16]
[83109,"Großkarolinenfeld",-16]
[1990,"Großkmehlen",-16]
[7407,"Großkochberg",-14]
[89359,"Grosskötz",-16]
[89518,"Großkuchen",-16]
[4420,"Großlehna",-14]
[15907,"Groß-Lubolz",-16]
[56276,"Großmaischeid",-14]
[85098,"Großmehring",-18]
[39221,"Großmühlingen",-14]
[1936,"Großnaundorf",-14]
[67259,"Großniedesheim",-12]
[63762,"Großostheim",-12]
[4463,"Großpösna",-14]
[2692,"Großpostwitz",-16]
[4539,"Großprießligk",-14]
[1983,"Großräschen",-16]
[97950,"Großrinderfeld",-14]
[1825,"Großröhrsdorf",-14]
[1900,"Großröhsdorf",-14]
[4895,"Großrössen",-16]
[99195,"Großrudestedt",-14]
[39517,"Groß-Schwarzlosen",-14]
[2708,"Großschweidnitz",-16]
[4668,"Großsteinberg",-14]
[4932,"Großthiemig",-16]
[9575,"Großwaltersdorf",-16]
[91174,"Großweingarten",-16]
[4720,"Großweitzschen",-14]
[4860,"Großwig",-16]
[6905,"Großwig",-14]
[39319,"Großwulkow",-14]
[8538,"Großzöbern",-18]
[6632,"Gröst",-14]
[52511,"Grotenrath",-12]
[9474,"Grottendorf",-16]
[50181,"Grottenherten",-12]
[72631,"Grötzingen",-14]
[21493,"Grove",-12]
[96271,"Grub am Forst",-16]
[73344,"Gruibingen",-16]
[9224,"Grüna",-14]
[8223,"Grünbach",-16]
[35305,"Grünberg",-14]
[63584,"Gründau",-14]
[23948,"Grundshagen",-10]
[89613,"Grundsheim",-16]
[31073,"Grünenplan",-14]
[79219,"Grunern",-14]
[1945,"Grünewald",-16]
[39218,"Grünewalde",-14]
[8358,"Grünhain",-16]
[9579,"Grünhainichen",-16]
[88499,"Grüningen",-14]
[88287,"Grünkraut",-14]
[9661,"Grünlichtenberg",-14]
[72160,"Grünmettstetten",-16]
[17291,"Grünow",-14]
[97947,"Grünsfeld",-16]
[97947,"Grünsfeldhausen",-14]
[67269,"Grünstadt",-12]
[76228,"Grünwettersbach",-12]
[72401,"Gruol",-16]
[74417,"Gschwend b. Gaildorf",-16]
[83257,"Gstadt an Chiemsee",-16]
[3172,"Guben",-16]
[34281,"Gudensberg",-14]
[74363,"Güglingen",-14]
[15913,"Guhlen",-16]
[55452,"Guldental",-12]
[56072,"Güls",-14]
[72218,"Gültlingen",-16]
[71083,"Gültstein",-16]
[17089,"Gültz",-14]
[21483,"Gülzow",-12]
["5164.","Gummersbach",-12]
[7751,"Gumperda",-14]
[71665,"Gündelbach",-14]
[79194,"Gundelfingen",-14]
[89423,"Gundelfingen",-16]
[74831,"Gundelsheim",-12]
[64380,"Gundernhausen",-14]
[79206,"Gündlingen",-12]
[89355,"Gundremmingen",-16]
[59519,"Günne",-12]
[97261,"Güntersleben",-14]
[91224,"Guntersrieth",-16]
[89312,"Günzburg",-16]
[91710,"Gunzenhausen",-16]
[79761,"Gurtweil",-12]
[39317,"Güsen",-14]
[54413,"Gusenburg",-14]
[17509,"Gustebin",-12]
[39439,"Güsten",-14]
[91189,"Gustenfelden",-16]
[21514,"Güster",-12]
[19205,"Güstow",-12]
[18273,"Güstrow",-12]
[77793,"Gutach",-16]
[79261,"Gutach",-14]
[1945,"Guteborn",-16]
[86869,"Gutenberg",-16]
[72488,"Gutenstein",-16]
[88484,"Gutenzell",-16]
["3333.","Gütersloh",-12]
[78187,"Gutmadingen",-16]
[17506,"Gützkow",-12]
[50374,"Gymnich",-12]
[85410,"Haag",-16]
[91126,"Haag",-16]
[4758,"Haage",-14]
[42781,"Haan",-10]
[85540,"Haar",-16]
[94542,"Haarbach",-16]
[97720,"Haard",-14]
[19336,"Haaren",-14]
[3058,"Haasow",-16]
[82392,"Habach",-16]
[99706,"Hachelbich",-14]
[57627,"Hachenburg",-14]
[31188,"Hackenstedt",-14]
[65589,"Hadamar (Westerwald)",-14]
[29693,"Hademstorf",-12]
[89356,"Hafenhofen",-16]
[74343,"Häfnerhaslach",-14]
[76889,"Haftelhof",-12]
[32839,"Hagedorn",-14]
[79685,"Häg-Ehrsberg",-16]
[93095,"Hagelstadt",-18]
[27628,"Hagen",-10]
[29378,"Hagen",-14]
["58...","Hagen",-12]
[49170,"Hagen a. T.W.",-12]
[76767,"Hagenbach",-12]
[91161,"Hagenbuch",-16]
[91469,"Hagenbüchbach",-16]
[31558,"Hagenburg",-14]
[17194,"Hagenow",-12]
[19230,"Hagenow",-12]
[88709,"Hagnau/Bodensee",-12]
[64319,"Hahn",-12]
[92256,"Hahnbach",-16]
[38640,"Hahndorf",-14]
[55278,"Hahnheim",-12]
[63808,"Haibach",-12]
[94353,"Haibach",-18]
[4910,"Haida",-16]
[7926,"Haidefeld",-18]
[3130,"Haidemühl",-16]
[94501,"Haidenburg",-16]
[88410,"Haidgau",-16]
[93142,"Haidhof",-16]
[94522,"Haidlfing",-18]
[35708,"Haiger",-14]
[72401,"Haigerloch",-16]
[35708,"Haigerseelbach",-14]
[72108,"Hailfingen",-16]
[88525,"Hailtingen",-14]
[31319,"Haimar",-14]
[63512,"Hainburg",-12]
[2779,"Hainewalde",-16]
[76835,"Hainfeld",-12]
[86356,"Hainhofen",-16]
[4567,"Hainichen",-14]
[9661,"Hainichen",-14]
[99735,"Hainrode",-14]
[86744,"Hainsfarth",-16]
[72221,"Haiterbach",-16]
[63571,"Haitz",-14]
[38820,"Halberstadt",-14]
[57489,"Halbhusten",-12]
[32351,"Haldem",-12]
[39340,"Haldensleben",-14]
[89356,"Haldenwang",-16]
[46459,"Haldern",-10]
[83128,"Halfing",-16]
[85399,"Hallbergmoos",-16]
[6116,"Halle",-14]
["061..","Halle / Kröllwitz",-14]
[33790,"Halle / Westf. ",-12]
[59969,"Hallenberg",-16]
[91352,"Hallerndorf",-16]
[67826,"Hallgarten",-12]
[96103,"Hallstadt",-16]
[9633,"Halsbrücke",-16]
[56283,"Halsenbach",-14]
[45721,"Haltern",-10]
[79576,"Haltingen",-12]
[58553,"Halver",-12]
[97456,"Hambach",-16]
[75242,"Hamberg",-14]
[23619,"Hamberge",-12]
[27729,"Hambergen",-12]
[76707,"Hambrücken",-12]
[56761,"Hambuch",-14]
[29313,"Hambühren",-12]
[22393,"Hamburg",-12]
[22589,"Hamburg",-10]
["22...","Hamburg",-12]
[22117,"Hamburg - Billstedt",-12]
[21077,"Hamburg - Eißendorf",-12]
[22529,"Hamburg - Lockstedt",-12]
[22453,"Hamburg - Niendorf",-12]
[22143,"Hamburg - Rahlstedt",-12]
[21037,"Hamburg - Reitbrook",-12]
[27324,"Hämelhausen",-12]
["3178.","Hameln",-12]
["590..","Hamm / Westf.",-12]
[99765,"Hamma",-14]
[21714,"Hammah",-12]
[97762,"Hammelburg",-14]
[16559,"Hammer",-14]
[52152,"Hammer",-14]
[4849,"Hammermühle",-14]
[63546,"Hammersbach",-12]
[99441,"Hammerstedt",-14]
[46499,"Hamminkeln",-10]
[22929,"Hammoor",-12]
["6345.","Hanau",-12]
[24983,"Handewitt",-10]
[21447,"Handorf",-12]
[48157,"Handorf",-12]
[15537,"Hangelsberg",-14]
[67374,"Hanhofen",-12]
[31311,"Hänigsen",-14]
[29386,"Hankensbüttel",-14]
[34346,"Hann.- Münden",-12]
["30...","Hannover",-14]
[21271,"Hanstedt",-12]
[29582,"Hanstedt",-14]
[86655,"Harburg",-16]
[74736,"Hardheim",-14]
[78739,"Hardt",-16]
[49733,"Haren",-10]
[55595,"Hargesheim",-12]
[79713,"Harpolingen",-12]
[27243,"Harpstedt",-12]
[66919,"Harsberg",-12]
[21698,"Harsefeld",-12]
[33428,"Harsewinkel",-12]
[38829,"Harsleben",-14]
[31177,"Harsum",-14]
[72401,"Hart",-16]
[8134,"Härtensdorf",-14]
[8118,"Hartenstein",-16]
[91235,"Hartenstein",-16]
[4746,"Hartha",-14]
[9569,"Hartha",-14]
[67376,"Harthausen",-12]
[72501,"Harthausen",-16]
[86316,"Harthausen",-16]
[79258,"Hartheim",-12]
[56459,"Härtlingen",-14]
[8107,"Hartmannsdorf",-16]
[9232,"Hartmannsdorf",-14]
[8468,"Hartmannsgrün",-16]
[91224,"Hartmannshof",-16]
[55296,"Harxheim",-12]
[6493,"Harzgerode",-16]
[49205,"Hasbergen",-12]
[79686,"Hasel",-14]
[9509,"Haselbach",-14]
[96523,"Haselbach",-16]
[25489,"Haseldorf",-10]
[49740,"Haselünne",-12]
[71083,"Haslach",-16]
[77716,"Haslach",-16]
[88430,"Haslach",-16]
[1920,"Häslich",-16]
[25474,"Hasloh",-12]
[82285,"Haspelmoor",-16]
[38899,"Hasselfelde",-16]
[63594,"Hasselroth",-12]
[61520,"Hassenroth",-14]
[8112,"Haßlau",-14]
[17291,"Haßleben",-14]
[67545,"Haßloch",-12]
[74855,"Haßmersheim",-12]
[31559,"Haste",-14]
[88416,"Hattenburg",-16]
[65347,"Hattenheim",-12]
[73110,"Hattenhofen",-16]
[82285,"Hattenhofen",-16]
[65795,"Hattersheim",-12]
[78194,"Hattingen",-16]
["4552.","Hattingen / Ruhr",-12]
[37197,"Hattorf",-16]
[25856,"Hattstedt",-10]
[76770,"Hatzenbühl",-12]
[76846,"Hauenstein",-12]
[79725,"Hauenstein",-12]
[88410,"Hauerz",-16]
[91729,"Haundorf",-16]
[91249,"Haunritz",-16]
[89437,"Haunsheim",-16]
[86179,"Haunstetten",-16]
[8468,"Hauptmannsgrün",-16]
[34626,"Hauptschwenda",-14]
[94481,"Haus im Wald",-18]
[77756,"Hausach",-16]
[82467,"Hausberg",-20]
[35415,"Hausen",-14]
[36280,"Hausen",-16]
[63840,"Hausen",-14]
[71263,"Hausen",-16]
[72393,"Hausen",-18]
[73337,"Hausen",-16]
[79688,"Hausen",-14]
[91353,"Hausen",-16]
[97262,"Hausen",-14]
[89604,"Hausen ob Allmendingen",-14]
[78595,"Hausen ob Verena",-18]
[78183,"Hausen vor Wald",-16]
[79837,"Häusern",-16]
[83734,"Hausham",-18]
[1900,"Hauswalde",-14]
[6577,"Hauteroda",-14]
[94051,"Hauzenberg",-18]
[39539,"Havelberg",-14]
[38275,"Haverlah",-14]
[48329,"Havixbeck",-12]
[87749,"Hawangen",-16]
[72534,"Hayingen",-16]
[37339,"Haynrode",-16]
[95168,"Hebanz",-18]
[84332,"Hebertsfelden",-16]
[6571,"Hechendorf",-14]
[82229,"Hechendorf",-16]
[72379,"Hechingen",-16]
[21755,"Hechthausen",-12]
[55129,"Hechtsheim",-12]
[54518,"Heckenmünster",-14]
[65614,"Heckholzhausen",-14]
[79341,"Hecklingen ",-12]
[36275,"Heddersdorf",-14]
[56564,"Heddesdorf",-12]
[68542,"Heddesheim",-12]
[25355,"Heede",-12]
[33719,"Heepen",-12]
[1833,"Heeselicht",-14]
[27404,"Heeslingen",-12]
[31707,"Heeßen",-14]
[65510,"Heftrich",-14]
[73669,"Hegenlohe",-16]
[33142,"Hegensdorf",-14]
[57413,"Heggen",-14]
[71334,"Hegnach",-12]
[16559,"Heidchen",-14]
[19294,"Heiddorf",-12]
[53797,"Heide",-12]
[25746,"Heide / Holst.",-10]
[91180,"Heideck",-16]
["691..","Heidelberg",-10]
[76646,"Heidelsheim",-12]
[46359,"Heiden",-10]
[1809,"Heidenau",-14]
[54426,"Heidenburg",-12]
[55262,"Heidenfahrt",-12]
["895..","Heidenheim / Brenz",-16]
[65321,"Heidenrod",-14]
[15754,"Heidesee",-14]
[55262,"Heidesheim",-12]
[54518,"Heidweiler",-12]
[24226,"Heikendorf",-10]
["740..","Heilbronn / Neckar",-12]
[88633,"Heiligenberg",-14]
[78731,"Heiligenbronn",-16]
[23774,"Heiligenhafen",-10]
[42579,"Heiligenhaus b. Velbert",-12]
[67699,"Heiligenmoschel",-12]
[34266,"Heiligenrode",-12]
[37308,"Heiligenstadt",-16]
[6347,"Heiligenthal",-14]
[77948,"Heiligenzell",-12]
[72348,"Heiligenzimmern",-16]
[69253,"Heiligkreuzsteinach",-12]
[91560,"Heilsbronn",-16]
[79331,"Heimbach",-12]
[53474,"Heimersheim",-14]
[71296,"Heimsheim",-16]
[37627,"Heinade",-14]
[73092,"Heiningen",-16]
[52525,"Heinsberg",-10]
[8468,"Heinsdorfergrund",-16]
[37649,"Heinsen",-12]
[74906,"Heinsheim",-12]
[67742,"Heinzenhausen",-12]
[54497,"Heinzerath",-14]
[87493,"Heising",-16]
[85276,"Heißmanning",-16]
[25492,"Heist",-10]
[53639,"Heisterbacherrott",-12]
[79423,"Heitersheim",-14]
[6311,"Helbra",-14]
[85414,"Helfenbrunn",-16]
[56244,"Helferskirchen",-14]
[37627,"Hellental",-14]
[53940,"Hellenthal",-14]
[95233,"Helmbrechts",-18]
[77866,"Helmlingen",-12]
[17498,"Helmshagen",-12]
[76646,"Helmsheim",-12]
[74921,"Helmstadt",-12]
[97264,"Helmstadt",-14]
[38350,"Helmstedt",-14]
[21218,"Helmstorf",-12]
[34298,"Helsa",-14]
[31535,"Helstorf",-14]
[93115,"Hemau",-16]
[33034,"Hembsen",-14]
[58675,"Hemer",-12]
[91334,"Hemhofen",-16]
[72108,"Hemmendorf",-16]
[97258,"Hemmersheim",-16]
[71282,"Hemmingen",-14]
[30966,"Hemmingen ",-14]
[25770,"Hemmingstedt",-10]
[92353,"Heng",-16]
[72574,"Hengen",-18]
[94491,"Hengersberg",-18]
[53773,"Hennef",-12]
[53773,"Hennef/Sieg",-12]
[16761,"Hennigsdorf",-14]
[16761,"Henningsdorf b. Berlin",-14]
[24558,"Henstedt-Ulzburg",-12]
[64646,"Heppenheim",-12]
[67551,"Heppenheim",-12]
[73235,"Hepsisau",-16]
[88518,"Herbertingen",-14]
[85241,"Herbertshausen",-16]
[86405,"Herbertshofen",-16]
[74861,"Herbolzheim",-12]
[79336,"Herbolzheim",-12]
[91478,"Herbolzheim",-16]
[35745,"Herborn",-14]
[89542,"Herbrechtingen",-16]
[99955,"Herbsleben",-14]
[97980,"Herbsthausen",-16]
[36355,"Herchenhain",-14]
[58313,"Herdecke",-12]
[88634,"Herdwangen",-14]
["320..","Herford",-12]
[36318,"Hergersdorf",-14]
[6313,"Hergisdorf",-14]
[97534,"Hergolshausen",-14]
[36266,"Heringen/Werra",-14]
[23777,"Heringsdorf",-10]
[37293,"Herleshausen",-14]
[73527,"Herlikofen",-16]
[29320,"Hermannsburg",-14]
[66919,"Hermersberg",-12]
[1776,"Hermsdorf",-16]
[1945,"Hermsdorf",-16]
[7629,"Hermsdorf",-14]
["446..","Herne",-10]
[72535,"Heroldstatt",-16]
[71083,"Herrenberg",-16]
[9217,"Herrenhaide",-14]
[78662,"Herrenzimmern",-16]
[56729,"Herresbach",-14]
[50374,"Herrig",-12]
[79737,"Herrischried",-14]
[23923,"Herrnburg",-10]
[2747,"Herrnhut",-16]
[67550,"Herrnsheim",-12]
[82211,"Herrsching am Ammersee",-16]
[2899,"Hersbach",-16]
[91217,"Hersbruck",-16]
[58849,"Herscheid",-14]
[53332,"Hersel",-12]
["45...","Herten / Westf.",-10]
[79415,"Hertingen",-12]
[71364,"Hertmannsweiler",-14]
[76863,"Herxheim",-12]
[67273,"Herxheim am Berg",-12]
[33442,"Herzebrock-Clarholz",-12]
[91074,"Herzogenaurach",-16]
[52134,"Herzogenrath",-12]
[59969,"Hesborn",-16]
[72336,"Heselwangen",-18]
[35085,"Heskem",-12]
[91093,"Heßdorf",-16]
[63607,"Hesseldorf",-14]
[38835,"Hessen",-14]
[74394,"Hessigheim",-12]
[37235,"Hessisch Lichtenau",-14]
[31840,"Hessisch Oldendorf",-12]
[74722,"Hettigenbeuern",-16]
[97265,"Hettstadt",-14]
[6333,"Hettstedt",-14]
[41812,"Hetzerath",-12]
[54523,"Hetzerath",-10]
[91077,"Hetzlers",-16]
[91077,"Hetzles",-16]
[73540,"Heubach",-16]
[72589,"Heuberg",-18]
[73572,"Heuchlingen",-16]
[89547,"Heuchlingen",-16]
[78253,"Heudorf im Hegau",-14]
[83052,"Heufeld",-16]
[63150,"Heusenstamm",-12]
[97618,"Heustreu",-14]
[66265,"Heusweiler",-12]
[79194,"Heuweiler",-14]
[93336,"Hexenagger",-16]
[31171,"Heyersum",-14]
[32120,"Hiddenhausen",-12]
[59457,"Hilbeck",-12]
[2894,"Hilbersdorf",-16]
[9627,"Hilbersdorf",-16]
[57271,"Hilchenbach",-14]
[98646,"Hildburghausen",-16]
[99976,"Hildebrandshausen",-16]
["4072.","Hilden",-10]
[36115,"Hilders",-14]
["311..","Hildesheim",-14]
[71157,"Hildrizhausen",-16]
[57612,"Hilgenroth/Westerw.",-12]
[56206,"Hilgert",-12]
[32479,"Hille",-12]
[32694,"Hillentrup",-14]
[54576,"Hillesheim",-14]
[56204,"Hillscheid",-12]
[91161,"Hilpoltstein",-16]
[74889,"Hilsbach",-12]
[91355,"Hiltpoltstein",-16]
[48165,"Hiltrup",-12]
[78247,"Hilzingen",-12]
[39596,"Hindenburg",-14]
[6386,"Hinsdorf",-14]
[1855,"Hinterhermsdorf",-16]
[98553,"Hinternah",-16]
[17375,"Hintersee",-12]
[36396,"Hintersteinau",-14]
[79856,"Hinterzarten",-18]
[27432,"Hipstedt",-12]
[72145,"Hirrlingen",-16]
[75365,"Hirsau ",-16]
[96114,"Hirschaid",-16]
[72070,"Hirschau",-16]
[7927,"Hirschberg",-18]
[9526,"Hirschberg",-16]
[69493,"Hirschberg",-12]
[18311,"Hirschburg",-10]
[98678,"Hirschendorf",-16]
[4932,"Hirschfeld",-16]
[37235,"Hirschhagen",-14]
[57635,"Hirzbach",-14]
[63697,"Hirzenhain",-14]
[21522,"Hittbergen",-12]
[39279,"Hobeck",-14]
[88348,"Hochberg",-14]
[71686,"Hochdorf",-14]
[71735,"Hochdorf",-14]
[72202,"Hochdorf",-16]
[72297,"Hochdorf",-16]
[73269,"Hochdorf",-16]
[88454,"Hochdorf",-16]
[72151,"Hochdorf  bei Horb / Neckar",-16]
[79862,"Höchenschwand",-16]
[2627,"Hochkirch",-16]
[41363,"Hochneukirch",-10]
[64739,"Höchst",-14]
[95186,"Höchstädt",-18]
[76351,"Hochstetten",-12]
[79206,"Hochstetten",-12]
[55606,"Hochstetten-Dhaun",-14]
[86163,"Hochzoll",-16]
[68766,"Hockenheim",-12]
[88662,"Hödingen (Überlingen)",-12]
[56472,"Hof",-14]
["950..","Hof, Saale",-18]
[36145,"Hofbieber",-16]
[84152,"Hofdorf",-18]
[75339,"Höfen",-16]
[90431,"Höfen",-16]
[92342,"Höfen",-16]
[74889,"Hoffenheim",-12]
[51503,"Hoffnungsthal",-12]
[34369,"Hofgeismar",-14]
[4668,"Höfgen",-14]
[65719,"Hofheim",-12]
[97461,"Hofheim / Unterfr.",-14]
[71229,"Höfingen",-14]
[84082,"Hofkirchen",-18]
[94544,"Hofkirchen",-18]
[77716,"Hofstetten",-16]
[86928,"Hofstetten",-16]
[77749,"Hofweier",-12]
[77749,"Hohberg",-12]
[4808,"Hohburg",-14]
[38700,"Hohegeiß",-16]
[37696,"Hohehaus",-14]
[66989,"Höheischweiler",-12]
[16540,"Hohen Neuendorf",-14]
[23996,"Hohen Viecheln",-12]
[83229,"Hohenaschau",-18]
[94545,"Hohenau",-18]
[83670,"Hohenbirken",-14]
[30890,"Hohenbostel",-14]
[85521,"Hohenbrunn",-14]
[18445,"Hohendorf",-10]
[31185,"Hoheneggelsen",-14]
[16306,"Hohenfelde ",-14]
[86978,"Hohenfurch",-16]
[73666,"Hohengehren",-14]
[31249,"Hohenhameln",-14]
[74420,"Hohenhardtsweiler",-16]
[74343,"Hohenhaslach",-12]
[4448,"Hohenheida",-14]
[26434,"Hohenkirchen",-10]
[85635,"Höhenkirchen-Siegertsbrunn",-16]
[7958,"Hohenleiben",-16]
[4934,"Hohenleipisch",-16]
[58119,"Hohenlimburg",-12]
[85664,"Hohenlinden",-16]
[6773,"Hohenlubast",-14]
[89537,"Hohenmemmingen",-16]
[82383,"Hohenpeißenberg",-16]
[82335,"Höhenrain",-16]
[86637,"Hohenreichen",-16]
[16307,"Hohenreinkendorf",-14]
[36284,"Hohenroda",-14]
[16248,"Hohensaaten",-14]
[82069,"Hohenschäftlarn",-16]
[87645,"Hohenschwangau",-18]
[73453,"Hohenstadt",-16]
[65329,"Hohenstein",-14]
[72531,"Hohenstein",-18]
[9337,"Hohenstein-Ernstthal",-14]
[79801,"Hohentengen",-12]
[88367,"Hohentengen",-14]
[83104,"Hohenthann",-16]
[75181,"Hohenwart",-14]
[93480,"Hohenwarth",-18]
[39291,"Hohenwarthe",-14]
[6179,"Hohenweiden",-14]
[24594,"Hohenwestedt",-12]
[76228,"Hohenwettersbach",-12]
[1561,"Hohndorf",-16]
[7985,"Hohndorf",-16]
[9434,"Hohndorf",-14]
[29362,"Hohne",-14]
[31559,"Hohnhorst",-14]
[77694,"Hohnhurst",-12]
[6179,"Höhnstedt",-14]
[56203,"Höhr - Grenzhausen",-12]
[42655,"Höhscheid",-12]
[41469,"Hoisten",-10]
[49451,"Holdorf",-12]
[31188,"Holle",-14]
[23883,"Hollenbek",-12]
[49584,"Hollenstede",-12]
[21279,"Hollenstedt",-12]
[37154,"Hollenstedt",-16]
[83098,"Höllenstein",-18]
[53940,"Hollerath",-14]
[21723,"Hollern-Twielenfleth",-10]
[96142,"Hollfeld",-16]
[24876,"Hollingstedt",-12]
[32257,"Holsen",-12]
[41069,"Holt ",-10]
[46147,"Holten",-10]
[31787,"Holtensen",-12]
[26629,"Holtrop",-10]
[41363,"Holz",-12]
[66265,"Holz",-12]
[56379,"Holzappel",-12]
[9623,"Holzau",-16]
[75365,"Holzbronn",-14]
[6926,"Holzdorf",-16]
[72805,"Holzelfingen",-18]
[37632,"Holzen",-14]
[79400,"Holzen",-12]
[71088,"Holzgerlingen",-16]
[87752,"Holzgünz",-16]
[4454,"Holzhausen",-14]
[32457,"Holzhausen",-12]
[35753,"Holzhausen",-14]
[77866,"Holzhausen",-12]
[79232,"Holzhausen",-12]
[86919,"Holzhausen a. Ammersee",-16]
[32805,"Holzhausen-Externsteine",-14]
[41472,"Holzheim",-10]
[89438,"Holzheim",-16]
[90453,"Holzheim",-16]
[89183,"Holzkirch",-16]
[83607,"Holzkirchen ",-18]
[73271,"Holzmaden",-16]
[37603,"Holzminden",-12]
[53501,"Holzweiler",-14]
[6808,"Holzweißig",-14]
[59439,"Holzwickede",-12]
[34576,"Homberg",-14]
[67744,"Homberg",-14]
[35315,"Homberg (Ohm)",-14]
["47...","Homberg / Niederrh.",-10]
[40882,"Homberg-Meiersberg",-10]
[44227,"Hombruch",-12]
[66424,"Homburg / Saar",-12]
[31177,"Hönnersum",-14]
[15366,"Hönow",-14]
[59737,"Honrath",-12]
[44869,"Höntrop",-12]
[66606,"Hoof",-12]
[49846,"Hoogstede",-10]
[72172,"Hopfau",-16]
[71711,"Höpfigheim",-12]
[74746,"Höpfingen",-14]
[14641,"Hoppenrade",-14]
[48496,"Hopsten",-12]
[72160,"Horb",-16]
[56412,"Horbach",-12]
[35745,"Hörbach",-14]
[79289,"Horben",-16]
[76771,"Hördt",-12]
[88477,"Hörenhausen",-16]
[86497,"Horgau",-16]
[88263,"Horgenzell",-14]
[85413,"Hörgertshausen",-16]
[79793,"Horheim",-12]
[74417,"Horlachen",-16]
[1986,"Hörlitz",-16]
[32805,"Horn-Bad Meinberg",-14]
[2763,"Hörnitz",-16]
[3130,"Hornow",-16]
[71665,"Horrheim",-14]
[55457,"Horrweiler",-12]
[96231,"Horsdorf",-16]
[99976,"Horsmar",-16]
[21220,"Horst",-12]
[45899,"Horst",-10]
[6785,"Horstdorf",-14]
[32791,"Hörste",-14]
[63755,"Hörstein",-12]
[48477,"Hörstel",-12]
[63768,"Hösbach",-14]
[1996,"Hosena",-16]
[88374,"Hoßkirch",-14]
[88374,"Hoßkirch",-14]
[73663,"Hößlinswart",-14]
[55758,"Hottenbach",-14]
[79736,"Hottingen",-14]
[53902,"Houverath",-14]
[33161,"Hövelhof",-12]
[37671,"Höxter",-12]
[27318,"Hoyerhagen",-12]
[31093,"Hoyershausen",-14]
[2977,"Hoyerswerda",-16]
[6308,"Hübitz",-14]
[75181,"Huchenfeld",-14]
[32609,"Huchzen",-12]
[41836,"Hückelhoven",-10]
[47259,"Huckingen",-10]
[31177,"Hüddessum",-14]
[27798,"Hude",-12]
[74928,"Hüffenhardt",-12]
[78183,"Hüfingen",-16]
[76549,"Hügelsheim",-12]
[82386,"Huglfing",-16]
[79232,"Hugstetten",-12]
[77933,"Hugsweier",-12]
[47551,"Huisberden",-10]
[72584,"Hülben",-16]
[32609,"Hüllhorst",-12]
[31867,"Hülsede",-14]
[66773,"Hülzweiler",-12]
[32676,"Hummersen",-14]
[98634,"Hümpfershausen",-16]
[94336,"Hunderdorf",-18]
[88518,"Hundersingen",-14]
[67749,"Hundheim",-14]
[97900,"Hundheim",-14]
[39343,"Hundisburg",-14]
[36088,"Hünfeld",-14]
[35410,"Hungen",-12]
[65510,"Hünstetten",-14]
[49163,"Hunteburg",-12]
[46569,"Hünxe",-10]
[54518,"Hupperath",-14]
[52393,"Hürtgenwald",-14]
[52393,"Hürtgenwald-Gey",-14]
[50354,"Hürth",-10]
[24850,"Hüsby",-12]
[39579,"Hüselitz",-14]
[31632,"Husum",-12]
[25813,"Husum / Nordsee",-10]
[66882,"Hütschenhausen",-12]
[35625,"Hüttenberg",-14]
[76661,"Huttenheim",-12]
[84152,"Hüttenkofen",-18]
[38889,"Hüttenrode",-16]
[54636,"Hüttingen/Kyll",-14]
[89185,"Hüttisheim",-16]
[73460,"Hüttlingen",-16]
[36110,"Hutzdorf",-14]
[29646,"Hützel",-14]
[79837,"Ibach-Mutterslehen",-16]
["4947.","Ibbenbüren",-12]
[89335,"Ichenhausen",-16]
[77743,"Ichenheim",-12]
[99334,"Ichtershausen",-14]
[55743,"Idar-Oberstein",-12]
[65510,"Idstein",-14]
[82393,"Iffeldorf",-18]
[76473,"Iffezheim",-12]
[91338,"Igensdorf",-16]
[97999,"Igersheim",-16]
[67471,"Iggelbach",-12]
[94547,"Iggensbach",-18]
[73574,"Iggingen",-16]
[86859,"Igling",-16]
[72160,"Ihlingen",-16]
[79241,"Ihringen",-12]
[34233,"Ihringshausen",-14]
[93346,"Ihrlerstein",-16]
[38723,"Ildehausen",-16]
[99958,"Illeben",-14]
[89269,"Illerberg",-16]
[89281,"Illereichen",-16]
[89171,"Illerkirchberg",-16]
[89186,"Illerrieden",-16]
[89257,"Illertissen",-16]
[89269,"Illerzell",-16]
[75428,"Illingen",-14]
[88636,"Illmensee",-14]
[98693,"Ilmenau",-16]
[99326,"Ilmtal",-14]
[31241,"Ilsede",-14]
[38871,"Ilsenburg",-16]
[74360,"Ilsfeld",-12]
[74532,"Ilshofen",-16]
[68549,"Ilvesheim",-12]
[78194,"Immendingen",-16]
[56077,"Immendorf",-12]
[34376,"Immenhausen",-14]
[72127,"Immenhausen",-16]
[73463,"Immenhofen",-16]
[95505,"Immenreuth",-18]
[31275,"Immensen",-14]
[88090,"Immenstaad",-12]
[87509,"Immenstadt",-18]
[97941,"Impfingen",-14]
[72534,"Indelhausen",-16]
[94428,"Indersbach",-16]
[74653,"Ingelfingen",-14]
[55218,"Ingelheim",-12]
[88456,"Ingoldingen",-16]
["850..","Ingolstadt",-16]
[35410,"Inheiden",-12]
[72513,"Inneringen",-16]
[94548,"Innernzell",-18]
[24613,"Innien",-12]
[86199,"Inningen",-16]
[98599,"Inselsberg",-16]
[53520,"Insul",-14]
[83334,"Inzell",-16]
[72514,"Inzigkofen",-14]
[97258,"Ippesheim",-16]
[91472,"Ipsheim",-16]
[75446,"Iptingen",-14]
[8485,"Irfersgrün",-16]
[85049,"Irgertsheim",-16]
[52388,"Irresheim",-12]
[83737,"Irschenberg",-18]
[87660,"Irsee",-16]
[39167,"Irxleben",-14]
["5863.","Iserlohn",-12]
[30916,"Isernhagen",-14]
[85737,"Ismaning",-16]
[88316,"Isny",-16]
[75228,"Ispringen",-14]
[54338,"Issel",-10]
[65558,"Isselbach",-14]
[46419,"Isselburg",-10]
[47661,"Issum",-10]
[88677,"Ittendorf",-12]
[49847,"Itterbeck",-10]
[76307,"Ittersbach",-14]
[88048,"Ittingen",-12]
[88515,"Ittingen",-16]
[74930,"Ittlingen",-14]
[25524,"Itzehoe",-12]
[15236,"Jacobsdorf",-16]
[26349,"Jade",-10]
[7768,"Jägersdorf",-14]
[74249,"Jagsthausen",-14]
[73489,"Jagstzell",-16]
[37688,"Jakobsberg",-14]
[3130,"Jämlitz",-16]
[2906,"Jänkendorf",-16]
[1945,"Jannowitz",-16]
[17126,"Jarmen",-12]
[73035,"Jebenhausen",-16]
[79361,"Jechtingen",-12]
[89257,"Jedesheim",-16]
["0774.","Jena",-14]
[39319,"Jerichow",-14]
[3159,"Jerischke",-16]
[4838,"Jesewitz",-14]
[73230,"Jesingen",-16]
[1689,"Jessen",-16]
[2699,"Jeßnitz",-16]
[4720,"Jeßnitz",-14]
[21266,"Jesteburg",-12]
[98708,"Jesuborn",-16]
[66887,"Jettenbach",-14]
[72127,"Jettenburg",-16]
[71131,"Jettingen",-16]
[89343,"Jettingen-Scheppach",-16]
[8543,"Jocketa",-16]
[76751,"Jockgrim",-12]
[8349,"Johanngeorgenstadt",-18]
[96328,"Johannisthal",-16]
[75045,"Jöhlingen",-12]
[1768,"Johnsbach",-16]
[33739,"Jöllenbeck",-12]
[2796,"Jonsdorf",-16]
[63637,"Jossgrund",-14]
[41363,"Jüchen",-10]
[37127,"Jühnde",-14]
[52428,"Jülich",-12]
[72417,"Jungingen",-18]
[54584,"Jünkerath",-14]
[17214,"Jürgenshof",-12]
[17153,"Jürgenstorf",-14]
[14913,"Jüterbog",-14]
[37345,"Jützenbach",-16]
[41564,"Kaarst",-10]
[79790,"Kadelburg",-12]
[89284,"Kadeltshofen",-16]
[56337,"Kadenbach",-12]
[4668,"Kaditzsch",-14]
[63796,"Kahl am Main",-12]
[72479,"Kaiseringen",-16]
[73667,"Kaisersbach",-16]
[56759,"Kaisersesch",-14]
["676..","Kaiserslautern",-12]
[86687,"Kaisheim",-16]
[6785,"Kakau",-14]
[36148,"Kalbach",-14]
[60437,"Kalbach",-12]
[91720,"Kalbensteinberg",-16]
[63755,"Kälberau",-12]
[90562,"Kalchreuth",-16]
[53505,"Kalenborn",-14]
[23942,"Kalkhorst",-10]
[78355,"Kalkofen",-14]
[88356,"Kalkreute",-14]
[1561,"Kalkreuth",-16]
[53925,"Kall",-14]
[32689,"Kalldorf ",-12]
[59602,"Kallenhardt",-14]
[32689,"Kalletal",-14]
[56294,"Kalt",-14]
[82269,"Kaltenberg",-16]
[82269,"Kalteneck",-16]
[24568,"Kaltenkirchen",-12]
[87662,"Kaltental",-16]
[98634,"Kaltenwestheim",-16]
[52156,"Kalterherberg ",-14]
[9661,"Kaltofen",-14]
[59174,"Kamen / Westf.",-12]
[1917,"Kamenz",-16]
[39524,"Kamern",-14]
[4886,"Kamitz",-16]
[83278,"Kammer",-16]
[91126,"Kammerstein",-16]
[26169,"Kampe",-12]
[75236,"Kämpfelbach",-14]
[47475,"Kamp-Lintfort",-10]
[76870,"Kandel, Pfalz",-12]
[18516,"Kandelin",-12]
[79400,"Kandern",-14]
[18299,"Kankel",-12]
[21514,"Kankelau",-12]
[88422,"Kanzach",-14]
[41516,"Kapellen",-10]
[99510,"Kapellendorf",-14]
[75339,"Kapfenhardt",-14]
[84186,"Kapfing",-16]
[77966,"Kappel",-12]
[79853,"Kappel",-18]
[88263,"Kappel",-14]
[91355,"Kappel",-16]
[24376,"Kappeln",-10]
[77876,"Kappelrodeck",-14]
[61184,"Karben",-12]
[52525,"Karken",-10]
[76307,"Karlsbad",-14]
[17495,"Karlsburg",-12]
[76689,"Karlsdorf",-12]
[17449,"Karlshagen",-12]
[27442,"Karlshöfen",-12]
[86668,"Karlshuld",-16]
["76...","Karlsruhe",-12]
[97753,"Karlstadt",-14]
[63791,"Karlstein",-12]
[23966,"Karow",-10]
[94094,"Karpfham",-16]
[17498,"Karrendorf",-12]
[17440,"Karrin",-12]
[79618,"Karsau",-12]
[19357,"Karstädt",-14]
["341..","Kassel",-12]
[84556,"Kastl",-16]
[92280,"Kastl",-16]
[95506,"Kastl",-16]
[31311,"Katensen",-14]
[37191,"Katlenburg",-16]
[49536,"Kattenvenne",-12]
[4749,"Kattwitz",-14]
[35630,"Katzenfurt",-14]
[79297,"Katzenmoos",-16]
[17509,"Katzow",-12]
[67734,"Katzweiler",-12]
[4886,"Kaucklitz",-16]
[6231,"Kauern",-14]
[87600,"Kaufbeuren",-16]
[86916,"Kaufering",-16]
[34260,"Kaufungen",-14]
[71083,"Kayh",-16]
[18513,"Keffenbrink",-12]
[77694,"Kehl",-12]
[88074,"Kehlen",-14]
[65779,"Kelkheim",-14]
[89293,"Kellmünz",-16]
[65451,"Kelsterbach",-12]
[75210,"Keltern",-14]
[6901,"Kemberg",-14]
[88212,"Kemmerlang",-14]
[73760,"Kemnat",-14]
[95478,"Kemnath",-16]
[8538,"Kemnitz",-18]
[17509,"Kemnitz",-12]
[17509,"Kemnitzerhagen",-12]
[47906,"Kempen",-10]
[56746,"Kempenich",-14]
["8743.","Kempten / Allgäu",-16]
[54344,"Kenn",-10]
[79341,"Kenzingen",-12]
[79348,"Keppenbach",-14]
[47647,"Kerken",-10]
[3172,"Kerkwitz",-16]
[71394,"Kernen im Remstal",-14]
[50171,"Kerpen",-12]
[54589,"Kerschenbach",-14]
[8373,"Kertzsch",-14]
[16845,"Kerzlin",-14]
[65510,"Kesselbach",-14]
[52152,"Kesternich",-14]
[36325,"Kestrich",-14]
[68775,"Ketsch",-12]
[72501,"Kettenacker",-16]
[49577,"Kettenkamp",-12]
[86498,"Kettershausen",-16]
[14669,"Ketzin",-14]
[99713,"Keula",-14]
[47623,"Kevelaer",-10]
[89407,"Kicklingen",-16]
[72108,"Kiebingen",-16]
[4720,"Kiebitz",-14]
[65399,"Kiedrich",-12]
[3058,"Kiekebusch",-16]
["241..","Kiel",-10]
[2899,"Kiesdorf",-16]
[36460,"Kieselbach",-16]
[75249,"Kieselbronn",-14]
[72072,"Kilchberg",-16]
[61137,"Kilianstädten",-12]
[73667,"Killenhof",-16]
[72393,"Killer",-18]
[87452,"Kimratshofen",-16]
[48159,"Kinderhaus",-12]
[66862,"Kindsbach",-12]
[52249,"Kinzweiler",-12]
[77971,"Kippenheim",-12]
[74912,"Kirchardt",-14]
[88486,"Kirchberg",-16]
[8107,"Kirchberg / Sachsen",-16]
[74592,"Kirchberg a.d. Jagst",-16]
[71737,"Kirchberg an der Murr",-14]
[89584,"Kirchbierlingen",-14]
[29664,"Kirchboitzen",-12]
[37619,"Kirchbrak",-14]
[78086,"Kirchdorf",-18]
[88457,"Kirchdorf",-16]
[93348,"Kirchdorf",-18]
[85414,"Kirchdorf a. d. Amper",-16]
[94261,"Kirchdorf i. Wald",-18]
[91356,"Kirchehrenbach",-16]
[57548,"Kirchen",-12]
[95158,"Kirchenlamitz",-18]
[91241,"Kirchensittenbach",-16]
[72138,"Kirchentellinsfurt",-16]
[91281,"Kirchenthumbach",-16]
[21394,"Kirchgellersen",-12]
[97268,"Kirchheim",-14]
[99334,"Kirchheim",-14]
[73230,"Kirchheim / Teck",-16]
[74366,"Kirchheim am Neckar",-12]
[73467,"Kirchheim am Ries",-16]
[36275,"Kirchheim, Hess",-14]
[67292,"Kirchheimbolanden",-12]
[46244,"Kirchhellen",-10]
[50181,"Kirchherten",-12]
[79238,"Kirchhofen",-14]
[52525,"Kirchhoven",-10]
[57399,"Kirchhundem",-14]
[32278,"Kirchlengern",-12]
[27308,"Kirchlinteln",-12]
[53505,"Kirchsahr",-14]
[27412,"Kirchtimke",-12]
[57368,"Kirchveischede",-14]
[56729,"Kirchwald",-14]
[21037,"Kirchwerder",-12]
[79199,"Kirchzarten",-16]
[77756,"Kirnbach",-16]
[68753,"Kirrlach",-12]
[64646,"Kirschhausen",-14]
[7919,"Kirschkau",-16]
[24629,"Kisdorf",-12]
[86438,"Kissing",-16]
[88353,"Kisslegg",-16]
[97270,"Kist",-14]
[23911,"Kittlitz",-12]
[4460,"Kitzen",-14]
[97318,"Kitzingen",-14]
[4567,"Kitzscher",-14]
[39579,"Kläden",-14]
[17087,"Klatzow",-14]
[18445,"Klausdorf",-10]
[21224,"Klecken",-12]
[16766,"Klein - Ziethen",-14]
[31789,"Klein Berkel",-12]
[31171,"Klein Escherde",-14]
[19348,"Klein Gottschow",-14]
[85293,"Klein Gurnibach",-16]
[15746,"Klein Köris",-14]
[37130,"Klein Legden",-16]
[37130,"Klein Lengden",-16]
[31319,"Klein Lobke",-14]
[3130,"Klein Loitz",-16]
[18445,"Klein Mohrdorf",-10]
[3116,"Klein Oßnig",-16]
[21516,"Klein Pampau",-12]
[23948,"Klein Pravtshagen",-10]
[23942,"Klein Schwansee",-10]
[19069,"Klein Trebbow",-12]
[18276,"Klein Upahl",-12]
[23992,"Klein Warin",-12]
[86507,"Kleinaitingen",-16]
[63456,"Klein-Auheim",-12]
[2627,"Kleinbautzen",-16]
[66271,"Kleinblittersdorf",-12]
[4668,"Kleinbothen",-14]
[30938,"Kleinburgwedel",-14]
[2708,"Kleindehsa",-16]
[73527,"Kleindeinbach",-16]
[72829,"Kleinengstingen",-18]
[67483,"Kleinfischlingen",-12]
[99735,"Kleinfurra",-14]
[6686,"Kleingörschen",-14]
[9575,"Kleinhartmannsdorf",-16]
[1824,"Kleinhennersdorf",-16]
[63924,"Kleinheubach",-14]
[91177,"Kleinhöbing 2",-16]
[79588,"Kleinkems",-12]
[1990,"Kleinkmehlen",-16]
[6926,"Kleinkorga",-14]
[6184,"Kleinkugel",-14]
[36137,"Kleinlüder",-14]
[14532,"Kleinmachnow",-14]
[91235,"Kleinmeinfeld",-16]
[39221,"Kleinmühlingen",-14]
[1516,"Kleinnaundorf",-16]
[39167,"Klein-Rodensleben",-14]
[1900,"Kleinröhrsdorf",-14]
[2694,"Kleinsaubernitz",-16]
[1259,"Kleinschachwitz",-14]
[17291,"Klein-Sperrenwalde",-14]
[76327,"Kleinsteinbach",-12]
[1561,"Kleinthiemig",-16]
[63839,"Kleinwallstadt",-12]
[2627,"Kleinwelka",-16]
[24969,"Kleinwiehe",-10]
[75378,"Kleinwildbad",-16]
[64846,"Klein-Zimmern",-14]
[8538,"Kleinzöbern",-18]
[99102,"Klettbach",-14]
[1998,"Klettwitz",-16]
[47533,"Kleve",-10]
[18516,"Klevenow",-12]
[39524,"Klietz",-14]
[4668,"Klinga",-14]
[86551,"Klingen",-16]
[63911,"Klingenberg",-14]
[74246,"Klingenhof",-14]
[8248,"Klingenthal",-18]
[78588,"Klippeneck",-18]
[1665,"Klipphausen",-14]
[18311,"Klockenhagen",-10]
[8527,"Kloschwitz",-16]
[14797,"Kloster Lehnin OT Rietz",-14]
[49124,"Kloster Oesede",-12]
[6308,"Klostermansfeld",-14]
[72270,"Klosterreichenbach",-16]
[88048,"Kluftern",-12]
[23948,"Klütz",-10]
[2977,"Knappenrode",-16]
[4420,"Knautnaundorf",-14]
[29379,"Knesebeck",-14]
[97478,"Knetzgau",-16]
[72250,"Kniebis",-16]
[75438,"Knittlingen",-14]
[34593,"Knüllwald",-14]
[23881,"Koberg",-12]
[56330,"Kobern-Gondorf",-12]
[2999,"Koblenz",-16]
["5607.","Koblenz",-12]
[56077,"Koblenz-Arzheim",-12]
[82431,"Kochel am See",-18]
[39517,"Köckte",-14]
[39649,"Köckte",-14]
[2923,"Kodersdorf",-16]
[2924,"Kodersdorf-Bahnhof",-16]
[95189,"Köditz",-18]
[72664,"Kohlberg",-16]
[27624,"Köhlen",-12]
[52134,"Kohlscheid",-12]
[72829,"Kohlstetten",-18]
[4683,"Köhra",-14]
[83059,"Kolbermoor",-16]
[78600,"Kolbingen",-16]
[56459,"Kölbingen",-14]
[31515,"Kolenfeld",-14]
[3099,"Kolkwitz",-16]
[99625,"Kölleda",-14]
[37696,"Kollerbeck",-14]
[4886,"Köllitsch",-16]
[79312,"Kollmarsreute",-14]
[79183,"Kollnau",-14]
[94262,"Kollnburg",-18]
[21527,"Kollow",-12]
["5....","Köln",-10]
[51149,"Köln - Gremberghoven",-10]
[50999,"Köln - Weiß",-12]
[50765,"Köln-Auweiler",-10]
[50769,"Köln-Fühlingen",-10]
[50935,"Köln-Lindenthal",-12]
[50737,"Köln-Longerich",-10]
[50769,"Köln-Seeberg",-10]
[50858,"Köln-Weiden",-10]
[50737,"Köln-Weidenpesch",-10]
[4509,"Kölsa",-14]
[4579,"Kömmlitz",-14]
[79331,"Köndringen",-12]
[54329,"Könen",-10]
[73257,"Köngen",-14]
[6493,"Königerode",-16]
[97953,"Königheim",-14]
[15711,"Königs Wusterhausen",-14]
[75203,"Königsbach-Stein",-14]
[39175,"Königsborn",-14]
[89551,"Königsbronn",-16]
[89551,"Königsbronn - Zang",-16]
[1936,"Königsbrück",-16]
[86343,"Königsbrunn",-16]
[79346,"Königschaffhausen",-12]
[82549,"Königsdorf",-18]
[78126,"Königsfeld",-16]
[2829,"Königshain",-16]
[9306,"Königshain",-14]
[38154,"Königslutter",-14]
[83471,"Königssee",-18]
[1824,"Königstein",-14]
[1824,"Königstein / OT Ebenheit",-14]
[61462,"Königstein/Taunus",-12]
[8412,"Königswalde",-14]
[53639,"Königswinter",-12]
[7336,"Könitz",-14]
[86872,"Konradshofen",-16]
[95176,"Konradsreuth",-18]
["7846.","Konstanz",-12]
[54329,"Konz",-10]
[52156,"Konzen",-14]
[89356,"Konzenberg",-16]
[71404,"Korb",-14]
[34497,"Korbach",-14]
[59519,"Körbecke",-12]
[39175,"Körbelitz",-14]
[6905,"Korgau",-14]
[77694,"Kork",-12]
[34327,"Körle",-12]
[96317,"Kornach",-16]
[4808,"Kornhain",-14]
[70825,"Korntal",-14]
[70806,"Kornwestheim",-12]
[41352,"Korschenbroich",-10]
[85092,"Kösching",-18]
[24354,"Kosel",-10]
[1609,"Koselitz",-16]
[17459,"Koserow",-12]
[52428,"Koslar",-12]
[4603,"Kosma",-14]
[4849,"Kossa",-14]
[4895,"Koßdorf",-16]
[4668,"Kössern",-14]
[3226,"Koßwig",-16]
[6366,"Köthen / Anhalt",-14]
[9249,"Köthensdorf",-14]
[2627,"Kotitz",-16]
[8223,"Kottengrün",-16]
[56736,"Kottenheim",-14]
[91189,"Kottensdorf",-16]
[1809,"Köttewitz",-14]
[82284,"Kottgeisering",-16]
[2730,"Kottmarsdorf",-16]
[93444,"Kötzting",-18]
[54340,"Köwerich",-10]
[19077,"Kraak",-12]
[19243,"Kraft",-12]
[7586,"Kraftsdorf",-14]
[53797,"Krahwinkel",-12]
[76703,"Kraichtal",-12]
[82152,"Krailling",-16]
[47559,"Kranenburg",-10]
[4889,"Kranichau",-16]
[99195,"Kranichborn",-14]
[99448,"Kranichfeld",-14]
[85402,"Kranzberg",-16]
[72505,"Krauchenwies",-14]
[2957,"Krauschwitz",-16]
[52355,"Krauthausen",-12]
[54673,"Krautscheid",-14]
[8538,"Krebes",-18]
[97839,"Kredenbach",-14]
[88637,"Kreenheinstetten",-16]
["47...","Krefeld",-10]
[37547,"Kreiensen",-16]
[1731,"Kreischa",-14]
[16766,"Kremmen",-14]
[25361,"Krempe",-10]
[79761,"Krenkingen",-14]
[4509,"Krensitz",-14]
[19288,"Krenzliner Hütte",-12]
[88079,"Kressbronn",-12]
[6712,"Kretschau",-14]
[52372,"Kreuzau",-12]
[16559,"Kreuzbruch",-14]
[57223,"Kreuztal",-14]
[16559,"Kreuzthal",-14]
[97892,"Kreuzwertheim",-14]
[17094,"Krickow",-14]
[4617,"Kriebitzsch",-14]
[17391,"Krien",-12]
[65830,"Kriftel",-12]
[18198,"Kritzmow",-10]
[35435,"Krofdorf-Gleiberg",-14]
[65510,"Kroftel",-14]
[6237,"Kröllwitz",-14]
[63829,"Krombach",-14]
[96317,"Kronach",-16]
[76709,"Kronau",-12]
[61476,"Kronberg",-14]
[24119,"Kronshagen",-10]
[39397,"Kroppenstedt",-14]
[17440,"Kröslin",-12]
[4509,"Krostitz",-14]
[54536,"Kröv",-10]
[56642,"Kruft",-14]
[86381,"Krumbach",-16]
[9633,"Krummenhennersdorf",-16]
[92703,"Krummennaab",-16]
[23974,"Krusenhagen",-10]
[1920,"Kuchau",-16]
[73329,"Kuchen",-16]
[86556,"Kühbach",-16]
[39524,"Kuhlhausen",-14]
[18225,"Kühlungsborn",-10]
[4420,"Kulkwitz",-14]
[95508,"Kulmain",-18]
[95326,"Kulmbach",-16]
[97900,"Külsheim",-14]
[92245,"Kümmersbruck",-16]
[2829,"Kunnersdorf",-16]
[7922,"Künsdorf",-16]
[74653,"Künzelsau",-14]
[94550,"Künzing",-18]
[95362,"Kupferberg",-16]
[74635,"Kupferzell",-16]
[76456,"Kuppenheim",-12]
[71083,"Kuppingen",-16]
[96328,"Küps",-16]
[97273,"Kürnach",-14]
[75057,"Kürnbach",-14]
[88427,"Kürnbach",-16]
[1737,"Kurort Hartha",-14]
[9484,"Kurort Oberwiesental",-18]
[9548,"Kurort Seiffen",-18]
[6543,"Kurort Wippra",-16]
[53773,"Kurscheid",-12]
[51515,"Kürten",-12]
[77974,"Kürzell",-12]
[91802,"Kurzenaltheim",-16]
[66869,"Kusel",-14]
[72127,"Kusterdingen",-16]
[97490,"Kützberg",-16]
[86500,"Kutzenhausen",-16]
[99955,"Kutzleben",-14]
[54655,"Kyllberg",-14]
[16866,"Kyritz",-14]
[67610,"La Wantzenau",-12]
[93164,"Laaber",-16]
[3205,"Laasow",-16]
[30880,"Laatzen",-14]
[47665,"Labbeck",-10]
[23898,"Labenz",-12]
[84082,"Laberweinting",-18]
[24235,"Laboe",-10]
[29331,"Lachendorf",-14]
[78655,"Lackendorf",-16]
[49549,"Ladbergen",-12]
[16321,"Ladeburg",-14]
[68526,"Ladenburg",-12]
[48366,"Laer",-12]
[32791,"Lage",-12]
[49774,"Lähden",-12]
[35633,"Lahnau",-12]
[56112,"Lahnstein",-12]
[77933,"Lahr / Schwarzwald",-12]
[77933,"Lahrsulz",-12]
[31246,"Lahstedt",-14]
[89150,"Laichingen",-18]
[88069,"Laimnau",-14]
[93462,"Lam",-18]
[67245,"Lambsheim",-12]
[52152,"Lammersdorf",-14]
[68623,"Lampertheim",-12]
[1561,"Lampertswalde",-16]
[4758,"Lampertswalde",-14]
[31195,"Lamspringe",-16]
[94405,"Landau / Isar",-18]
[76829,"Landau / Pfalz",-12]
[89361,"Landensberg",-16]
[31628,"Landesbergen",-12]
[56814,"Landkern",-14]
[37136,"Landolfshausen",-16]
[6188,"Landsberg",-14]
[86899,"Landsberg am Lech",-16]
[85652,"Landsham",-16]
["840..","Landshut / Bay.",-16]
["79...","Landwasser",-16]
[31087,"Landwehr",-16]
[52538,"Langbroich",-10]
[1844,"Langburkersdorf",-14]
[33014,"Langeland",-14]
[38871,"Langeln",-14]
[38685,"Langelsheim",-14]
[27607,"Langen",-10]
[49838,"Langen",-12]
[63225,"Langen / Hessen",-12]
[75334,"Langenalb",-14]
[88085,"Langenargen",-12]
[79650,"Langenau",-12]
[89129,"Langenau/Württ.",-16]
[35708,"Langenaubach",-14]
[33449,"Langenberg",-12]
[8428,"Langenbernsdorf",-14]
[74243,"Langenbeutingen",-14]
[6179,"Langenbogen",-12]
[75328,"Langenbrand",-16]
[74243,"Langenbrettach",-14]
[74595,"Langenburg",-16]
[65599,"Langendernbach",-14]
[6667,"Langendorf",-14]
[6729,"Langendorf",-14]
[44894,"Langendreer",-12]
[57368,"Langenei",-14]
[6268,"Langeneichstädt",-14]
[88515,"Langenenslingen",-14]
[91474,"Langenfeld",-16]
[40764,"Langenfeld / Rheinl.",-10]
["3085.","Langenhagen / Han.",-14]
[56459,"Langenhahn",-14]
[1819,"Langenhennersdorf",-14]
[8439,"Langenhessen",-14]
[1849,"Langenheunersdorf",-14]
[37154,"Langenholtensen",-16]
[32689,"Langenholzhausen",-14]
[25842,"Langenhorn",-10]
[55450,"Langenlonsheim",-12]
[85465,"Langenpreising",-16]
[97737,"Langenprozelten",-14]
[8439,"Langenreinsdorf",-14]
[6571,"Langenroda",-14]
[7407,"Langenschade",-14]
[65558,"Langenscheid",-12]
[78112,"Langenschiltach",-16]
[63505,"Langenselbold",-12]
[88515,"Langenslingen",-14]
[38895,"Langenstein",-14]
[9569,"Langenstriegis",-14]
[39171,"Langenweddingen",-14]
[90579,"Langenzenn",-16]
[26465,"Langeoog",-10]
[86853,"Langerringen",-16]
[52379,"Langerwehe",-12]
[52379,"Langerwehe",-12]
[98704,"Langewiesen",-16]
[35428,"Langgöns",-14]
[29364,"Langlingen",-14]
[84085,"Langquaid",-18]
[30890,"Langreder",-14]
[40668,"Langst Kierst",-10]
[27299,"Langwedel",-12]
[86462,"Langweid",-16]
[67746,"Langweiler b. Lauterecken",-14]
[81249,"Langwied",-16]
[66894,"Langwieden",-12]
[23881,"Lankau",-12]
[19053,"Lankow",-12]
[19057,"Lankow",-12]
[19309,"Lanz",-14]
[93138,"Lappersdorf",-16]
[19246,"Lassahn",-12]
[49688,"Lastrup",-12]
[30926,"Lathwehren",-14]
[73453,"Laubach",-16]
[88416,"Laubach",-16]
[87493,"Lauben",-16]
[90579,"Laubendorf",-16]
[1979,"Lauchhammer",-16]
[1979,"Lauchhammer - Ost",-16]
[73466,"Lauchheim",-16]
[79787,"Lauchringen",-12]
[97922,"Lauda-Königshofen",-16]
[63925,"Laudenbach",-14]
[69514,"Laudenbach",-12]
[31867,"Lauenau",-14]
[37697,"Lauenförde",-12]
[1778,"Lauenstein",-16]
[31020,"Lauenstein",-14]
[77886,"Lauf",-14]
[91207,"Lauf",-16]
[54533,"Laufeld",-14]
[79295,"Laufen",-14]
[83410,"Laufen",-16]
[79725,"Laufenburg",-12]
[74348,"Lauffen a. N.",-12]
[89415,"Lauingen",-16]
[88437,"Laupertshausen",-16]
[88471,"Laupheim",-16]
[56379,"Laurenburg",-12]
[8491,"Lauschgrün",-16]
[79780,"Lausheim",-16]
[2627,"Lauske",-16]
[1936,"Laußnitz",-16]
[2991,"Lauta",-16]
[36289,"Lautenhausen",-14]
[8312,"Lauter",-16]
[89584,"Lauterach",-14]
[1561,"Lauterbach",-16]
[9496,"Lauterbach",-16]
[78730,"Lauterbach",-16]
[85232,"Lauterbach",-16]
[36341,"Lauterbach-Blitzenrod",-14]
[86465,"Lauterbrunn",-16]
[67742,"Lauterecken",-12]
[92283,"Lauterhofen",-16]
[53501,"Lautershofen",-14]
[73111,"Lauterstein",-16]
[56355,"Lautert",-12]
[64686,"Lautertal-Elmshausen",-14]
[72459,"Lautlingen",-18]
[2708,"Lawalde",-16]
[66822,"Lebach",-12]
[17091,"Lebbin",-14]
[50374,"Lechenich",-12]
[86169,"Lechhausen",-16]
[49134,"Lechtingen",-12]
[16767,"Leegebruch",-14]
[64560,"Leeheim",-12]
[26789,"Leer / Ostfriesland",-10]
[90596,"Leerstetten",-16]
[28844,"Leeste",-12]
[19067,"Leezen",-12]
[23816,"Leezen",-12]
[87764,"Legau",-16]
[48739,"Legden",-10]
[99438,"Legefeld",-14]
[77731,"Legelshurst",-12]
[7349,"Lehesten",-18]
[56332,"Lehmen (Mosel)",-12]
[86732,"Lehmingen",-16]
[1920,"Lehndorf",-16]
[16565,"Lehnitz",-14]
[31275,"Lehrte",-14]
[76547,"Leiberstung",-12]
[88637,"Leibertingen",-16]
[94339,"Leiblfing",-18]
[42799,"Leichlingen",-10]
[63849,"Leidersbach",-14]
[61197,"Leidhecken",-12]
[72348,"Leidringen",-16]
[38542,"Leiferde",-14]
[88677,"Leimbach",-14]
[69181,"Leimen",-12]
[53501,"Leimersdorf",-14]
[97274,"Leinach",-14]
[91227,"Leinburg",-16]
[70771,"Leinfelden-Echterdingen",-14]
[76829,"Leinsweiler",-12]
[73575,"Leinzell",-16]
[78187,"Leipferdingen",-16]
[89340,"Leipheim",-16]
[2991,"Leippe",-16]
[4319,"Leipzig",-14]
["04...","Leipzig",-14]
[4277,"Leipzig-Connewitz",-14]
[4155,"Leipzig-Gohlis",-14]
[4207,"Leipzig-Grünau",-14]
[4357,"Leipzig-Mockau",-14]
[79361,"Leiselheim",-12]
[4703,"Leisnig",-14]
[15848,"Leißnitz",-16]
[86391,"Leitershofen",-16]
[39279,"Leitzkau",-14]
[54340,"Leiwen",-10]
[16866,"Lellichow",-14]
[32657,"Lemgo",-12]
[23769,"Lemkenhafen",-10]
[7819,"Lemnitz",-14]
[4519,"Lemsel",-14]
[27809,"Lemwerder",-12]
[52355,"Lendersdorf",-12]
[9514,"Lengefeld",-16]
[27419,"Lengenborstel",-12]
[8485,"Lengenfeld",-16]
[86869,"Lengenfeld",-16]
[86932,"Lengenfeld",-16]
[49525,"Lengerich / Westf.",-12]
[36266,"Lengers",-14]
[83661,"Lenggries",-18]
[37627,"Lenne",-14]
[42897,"Lennep",-12]
[57368,"Lennestadt",-14]
[73252,"Lenningen",-16]
[23738,"Lensahn",-10]
[85101,"Lenting",-18]
[19309,"Lenzen",-14]
[79853,"Lenzkirch",-18]
[71229,"Leonberg",-12]
[95666,"Leonberg",-18]
[76344,"Leopoldshafen",-12]
[33818,"Leopoldshöhe",-12]
[39264,"Leps",-14]
[4720,"Leschen",-14]
[38228,"Lesse",-14]
[58642,"Letmathe",-12]
[30926,"Letter",-14]
[8539,"Leubnitz",-16]
[9573,"Leubsdorf",-16]
[92705,"Leuchtenberg",-16]
[26180,"Leuchtenburg",-12]
[6237,"Leuna",-14]
[95191,"Leupoldsgrün",-18]
[88239,"Leupolz",-16]
[51570,"Leuscheid",-12]
[71397,"Leutenbach",-14]
[2794,"Leutersdorf",-16]
[69493,"Leutershausen",-12]
[77694,"Leutersheim",-12]
[56559,"Leutesdorf",-12]
[88299,"Leutkirch",-16]
["513..","Leverkusen",-10]
[51371,"Leverkusen - Rheindorf",-10]
[51375,"Leverkusen - Schlebusch",-10]
[88356,"Levertsweiler",-14]
[35423,"Lich",-14]
[9244,"Lichtenau",-14]
[33165,"Lichtenau",-14]
[77839,"Lichtenau ",-12]
[9638,"Lichtenberg",-16]
[96215,"Lichtenfels",-16]
[9350,"Lichtenstein",-14]
[72805,"Lichtenstein",-18]
[8115,"Lichtentanne",-16]
[73669,"Lichtenwald",-16]
[9577,"Lichtenwalde",-14]
[16230,"Lichterfelde",-14]
[31618,"Liebenau",-12]
[38704,"Liebenburg",-14]
[16559,"Liebenwalde",-14]
[4445,"Liebertwolkwitz",-14]
[63584,"Lieblos",-14]
[65835,"Liederbach am Taunus",-14]
[76706,"Liedolsheim",-12]
[1465,"Liegau-Augustusbad",-14]
[49536,"Lienen",-12]
[79801,"Lienheim",-12]
[75417,"Lienzingen",-14]
[3238,"Lieskau",-16]
[1920,"Lieske",-16]
[28865,"Lilienthal",-12]
[1723,"Limbach",-14]
[74838,"Limbach",-14]
[9212,"Limbach-Oberfrohna",-14]
["655...","Limburg a.d.Lahn",-12]
[67117,"Limburgerhof",-12]
[63694,"Limeshain",-12]
[88677,"Limpach",-14]
[73527,"Lindach",-16]
[88131,"Lindau / Bodensee",-12]
[94227,"Lindberg",-18]
[90592,"Lindelburg",-16]
[91459,"Linden",-16]
[66851,"Linden / Pfalz",-12]
[17111,"Lindenberg",-14]
[65551,"Lindenholzhausen",-12]
[4158,"Lindenthal",-14]
[4466,"Lindenthal",-14]
[31698,"Lindhorst",-14]
[39326,"Lindhorst",-14]
[51789,"Lindlar",-12]
[29690,"Lindwedel",-12]
["498..","Lingen / Ems",-10]
[56291,"Lingerhahn",-14]
[56317,"Linkenbach",-14]
[76347,"Linkenheim",-12]
[76351,"Linkenheim",-12]
[37627,"Linnenkamp",-14]
[52441,"Linnich",-12]
[31636,"Linsburg",-12]
[63589,"Linsengericht",-14]
[72636,"Linsenhofen",-16]
[92272,"Lintach",-16]
[1561,"Linz",-16]
[73463,"Lippach",-16]
[9509,"Lippersdorf",-16]
[88662,"Lippertsreute",-14]
[59510,"Lippetal",-12]
[33129,"Lippling",-12]
[59555,"Lippstadt",-12]
[78576,"Liptingen",-16]
[54587,"Lissendorf",-14]
[25992,"List auf Sylt",-10]
[2999,"Litschen",-16]
[35719,"Lixfeld",-14]
[37639,"Lobach",-14]
[2708,"Löbau",-16]
[74931,"Lobbach",-12]
[6780,"Löberitz",-14]
[4509,"Löbnitz",-14]
[4685,"Lobschütz",-14]
[39279,"Loburg",-14]
[31547,"Loccum",-12]
[6184,"Lochau",-14]
[74369,"Löchgau",-12]
[81249,"Lochhausen",-16]
[17321,"Löcknitz",-14]
[14806,"Locktow",-14]
[23923,"Lockwisch",-10]
[39240,"Lödderitz",-14]
[39446,"Löderburg",-14]
[37139,"Lödingsen",-14]
[76597,"Loffenau",-14]
[79843,"Löffingen",-16]
[93470,"Lohberg",-18]
[34253,"Lohfelden",-14]
[85716,"Lohhof",-16]
[16845,"Lohm",-14]
[7907,"Löhma ü. Schleiz",-16]
[53797,"Lohmar",-12]
[1847,"Lohmen",-14]
[35792,"Löhnberg",-14]
[49393,"Lohne",-12]
[32584,"Löhne",-12]
[67727,"Lohnsfeld",-12]
[97816,"Lohr",-14]
[35102,"Lohra",-14]
[65558,"Lohrheim",-14]
[2999,"Lohsa",-16]
[4895,"Löhsten",-16]
[17509,"Loissin",-12]
[39326,"Loitsche",-14]
[17121,"Loitz",-12]
[1623,"Lommatzsch",-14]
[53945,"Lommersdorf ",-14]
[53919,"Lommersum",-14]
[1454,"Lomnitz",-14]
[2699,"Lomske",-16]
[54338,"Longen",-10]
[54340,"Longuich",-10]
[49624,"Löningen",-12]
[91475,"Lonnerstadt",-16]
[56295,"Lonnig",-14]
[89173,"Lonsee",-16]
[82813,"Lonsingen",-18]
[86720,"Löpsingen",-16]
[73547,"Lorch",-16]
[65391,"Lorch/Rheingau",-12]
["795..","Lörrach",-12]
[64653,"Lorsch",-12]
[55296,"Lörzweiler",-12]
[1326,"Loschwitz",-14]
[66679,"Losheim am See",-12]
[72290,"Loßburg",-16]
[58644,"Lössel",-12]
[8294,"Lößnitz",-16]
[4889,"Loßwig",-16]
[1665,"Löthain",-14]
[32816,"Lothe",-14]
[49504,"Lotte",-12]
[79807,"Lottstetten",-12]
[50859,"Lövenich ",-12]
[14959,"Löwendorf",-14]
[37696,"Löwendorf",-14]
[74245,"Löwenstein",-14]
[27612,"Loxstedt",-10]
[32312,"Lübbecke",-12]
[15907,"Lübben",-16]
[3222,"Lübbenau / Spreewald",-16]
[23992,"Lübberstorf",-12]
["235..","Lübeck",-10]
[17509,"Lubmin",-12]
[23972,"Lübow",-10]
[19386,"Lübz",-14]
[29439,"Lüchow",-14]
[37671,"Lüchtringen",-12]
[4613,"Lucka",-14]
[3229,"Luckaitz",-16]
[15926,"Luckau",-16]
[57629,"Luckenbach",-14]
[2797,"Lückendorf",-16]
[14943,"Luckenwalde",-14]
[1920,"Lückersdorf-Gelenau",-16]
[44229,"Lücklemberg",-12]
[17375,"Luckow",-12]
[19243,"Luckwitz",-12]
["585..","Lüdenscheid",-12]
[39517,"Lüderitz",-14]
[23992,"Lüdersdorf",-12]
[23992,"Lüderstorf",-12]
[59348,"Lüdinghausen",-12]
[36251,"Ludwigsau",-14]
["716..","Ludwigsburg/Württ.",-12]
[2829,"Ludwigsdorf",-14]
[14974,"Ludwigsfelde",-14]
["670..","Ludwigshafen am Rhein",-12]
[19288,"Ludwigslust",-14]
[96337,"Ludwigsstadt",-18]
[66996,"Ludwigswinkel",-12]
[37635,"Lüerdissen",-14]
[3253,"Lugau",-16]
[9385,"Lugau",-14]
[32676,"Lügde",-14]
[31711,"Luhden",-14]
[92706,"Luhe",-16]
[17495,"Lühmannsdorf",-12]
[24816,"Luhnstedt",-12]
[85235,"Lukka",-16]
[6869,"Luko",-14]
["2133.","Lüneburg",-12]
["4453.","Lünen",-12]
[44532,"Lünen - Horstmar",-12]
[59427,"Lünern",-12]
[48480,"Lünne",-12]
[9328,"Lunzenau",-14]
[41065,"Lürrip",-10]
[24850,"Lürschau",-12]
[14806,"Lüsse",-14]
[17506,"Lüssow",-12]
[24321,"Lütjenburg",-10]
[22952,"Lütjensee",-12]
[37671,"Lütmarsen",-14]
[17258,"Lüttenhagen",-14]
[37318,"Lutter",-16]
[38729,"Lutter am Barenberg",-14]
[34355,"Lutterberg",-12]
[4721,"Lüttewitz",-14]
[79725,"Luttingen",-12]
[46509,"Lüttingen",-10]
[4769,"Lüttnitz",-14]
[2627,"Luttowizt",-16]
[42899,"Lüttringhausen",-12]
[86456,"Lützelburg",-16]
[35398,"Lützellinden",-14]
[6686,"Lützen",-14]
[72178,"Lützenhardt",-16]
[56826,"Lutzerath",-14]
[89440,"Lutzingen",-16]
[4159,"Lützschena",-14]
[4469,"Lützschena",-16]
[56729,"Luxem",-14]
[17279,"Lychen",-14]
[24404,"Maasholm-Bad",-10]
[4827,"Machern",-14]
[89150,"Machtolsheim ",-18]
[31177,"Machtsum",-14]
[67686,"Mackenbach",-12]
[37318,"Mackenrode",-16]
[55758,"Mackenrodt",-14]
[37586,"Mackensen",-14]
["3912.","Magdeburg",-14]
[6493,"Mägdesprung",-16]
[72818,"Mägerkingen",-18]
[71106,"Magstadt",-16]
[94508,"Mahd",-18]
[4874,"Mahitschen",-16]
[77972,"Mahlberg",-12]
[15831,"Mahlow",-14]
[39517,"Mahlwinkel",-14]
[72127,"Mähringen",-16]
[89081,"Mähringen",-16]
[35510,"Maibach",-14]
[71069,"Maichingen",-16]
[86747,"Maihingen",-16]
[84048,"Mainburg",-18]
[74535,"Mainhardt",-16]
[63533,"Mainhausen",-12]
[95336,"Mainleus",-16]
[63477,"Maintal",-12]
["551..","Mainz",-12]
[55246,"Mainz-Kostheim",-12]
[82216,"Maisach",-16]
[75378,"Maisenbach",-16]
[73037,"Maitis",-16]
[57629,"Malberg",-14]
[82216,"Malching",-16]
[17213,"Malchow",-14]
[23714,"Malente",-12]
[84066,"Mallersdorf",-18]
[19294,"Malliß",-12]
[71272,"Malmsheim",-16]
[69254,"Malsch",-12]
[76316,"Malsch",-12]
[2694,"Malschwitz",-16]
[79364,"Malterdingen",-12]
[2627,"Maltitz",-16]
[57636,"Mammelzen",-14]
[82291,"Mammendorf",-16]
[94437,"Mamming",-18]
[66399,"Mandelbachtal",-12]
[35716,"Mandeln",-14]
[31535,"Mandelsloh",-12]
[54531,"Manderscheid",-14]
["68...","Mannheim",-12]
[96257,"Mannsgereuth",-16]
[6343,"Mansfeld",-14]
[79588,"Mappach",-12]
[9661,"Marbach",-14]
[72532,"Marbach",-18]
[78056,"Marbach",-18]
[94536,"Marbach",-18]
[71672,"Marbach am Neckar",-12]
["3503.","Marburg/Lahn",-12]
[31535,"Mardorf",-14]
[85447,"Maria Thalheim",-16]
[94424,"Mariakirchen",-16]
[51491,"Marialinden",-12]
[31863,"Marienau",-14]
[9496,"Marienberg",-16]
[97828,"Marienbrunn",-14]
[31094,"Marienhagen",-14]
[34516,"Marienhagen",-14]
[51709,"Marienheide",-12]
[33104,"Marienloh",-12]
[37696,"Marienmünster",-14]
[54484,"Maring-Noviand",-12]
[88677,"Markdorf",-14]
[97980,"Markelsheim",-16]
[9236,"Markersdorf",-14]
[15528,"Markgrafpieske",-14]
[71706,"Markgröningen",-12]
[4416,"Markkleeberg",-14]
[31608,"Marklohe",-12]
[8258,"Markneukirchen",-18]
[4420,"Markranstädt",-14]
[79576,"Märkt",-12]
[91801,"Markt Berolzheim",-16]
[91459,"Markt Erlbach",-16]
[85229,"Markt Indersdorf",-16]
[85570,"Markt Schwaben",-16]
[91613,"Marktbergel",-16]
[91477,"Markt-Bibart",-16]
[96257,"Marktgraitz",-16]
[97828,"Marktheidenfeld",-14]
[95352,"Marktleugast",-16]
[95168,"Marktleuthen",-18]
[87616,"Marktoberdorf",-16]
[95615,"Marktredwitz",-18]
[96364,"Marktrodach",-16]
[83487,"Marktschellenberg",-18]
[95509,"Marktschorgast",-16]
["457..","Marl",-10]
[77694,"Marlen",-12]
[18337,"Marlow",-12]
[53947,"Marmagen",-14]
[21077,"Marmstorf/Hamburg",-12]
[82362,"Marnbach",-16]
[66646,"Marpingen",-12]
[83250,"Marquartstein",-18]
[34431,"Marsberg",-14]
[97340,"Martinsheim",-16]
[75387,"Martinsmoos",-16]
[16727,"Marwitz",-14]
[86688,"Marxheim",-16]
[76359,"Marxzell",-14]
[88437,"Maselheim",-16]
[97711,"Maßbach",-16]
[92242,"Massenricht",-16]
[84323,"Massing",-16]
[23972,"Maßlow",-10]
[56869,"Mastershausen",-14]
[66909,"Matzenbach",-12]
[67067,"Maudach",-12]
[69256,"Mauer",-12]
[75181,"Mauerach",-14]
[75181,"Mauerach",-14]
[85419,"Mauern",-16]
[75433,"Maulbronn",-14]
[79689,"Maulburg",-12]
[57635,"Maulsbach",-14]
[67133,"Maxdorf",-12]
[1809,"Maxen",-14]
[93142,"Maxhütte",-16]
[56727,"Mayen",-14]
[53508,"Mayschoß",-14]
[29416,"Mechau",-14]
[8541,"Mechelgrün",-16]
[53894,"Mechernich",-14]
[16866,"Mechow",-14]
[67354,"Mechtersheim",-12]
[36251,"Meckbach",-14]
[88074,"Meckenbeuren",-14]
[53340,"Meckenheim",-14]
[67149,"Meckenheim",-12]
[74909,"Meckesheim",-12]
[67744,"Medard",-12]
[59964,"Medebach",-16]
[35767,"Medenbach",-14]
[1458,"Medingen",-14]
[17391,"Medow",-12]
[8393,"Meerane",-14]
[31715,"Meerbeck",-14]
[40667,"Meerbusch",-10]
[88709,"Meersburg/Bodensee",-12]
[24799,"Meggerdorf",-12]
[4889,"Mehderitzsch",-16]
[67735,"Mehlbach",-12]
[67678,"Mehlingen",-12]
[8539,"Mehlteuer",-16]
[46499,"Mehrhoog",-10]
[54346,"Mehring",-10]
[16356,"Mehrow",-14]
[31249,"Mehrum",-14]
[46562,"Mehrum",-10]
[72531,"Meidelstetten",-18]
[38527,"Meine",-14]
[34497,"Meineringhausen",-14]
[9390,"Meinersdorf",-14]
[58540,"Meinerzhagen",-12]
[37276,"Meinhard",-16]
[91802,"Meinheim",-16]
[98617,"Meiningen",-16]
[6862,"Meinsdorf",-14]
[55590,"Meisenheim",-12]
[1662,"Meißen",-14]
[77974,"Meißenheim",-12]
[37290,"Meißner",-14]
[59602,"Meiste",-14]
[75323,"Meistern",-16]
[86405,"Meitingen",-16]
[21406,"Melbeck",-12]
[99097,"Melchendorf",-14]
[72393,"Melchingen",-18]
[88145,"Mellatz",-16]
[49324,"Melle",-12]
[27249,"Mellinghausen",-12]
[97638,"Mellrichstadt",-16]
[4860,"Melpitz",-16]
[24109,"Melsdorf",-10]
[34212,"Melsungen",-12]
[96117,"Memmelsdorf",-16]
[87700,"Memmingen",-16]
[87766,"Memmingerberg",-16]
[77866,"Memprechtshofen",-12]
[58708,"Menden/Sauerland",-12]
[56743,"Mendig",-14]
[2894,"Mengelsdorf",-16]
[88512,"Mengen",-14]
[88512,"Mengen-Ennetach",-14]
[84152,"Mengkofen",-18]
[49637,"Menslage",-12]
[16775,"Menz",-14]
[49716,"Meppen",-10]
[86504,"Merching",-16]
[74747,"Merchingen",-14]
[35799,"Merenberg",-12]
[89522,"Mergelstetten",-16]
[86415,"Mering",-16]
[96117,"Merkendorf",-16]
[71263,"Merklingen",-16]
[89188,"Merklingen",-18]
[52134,"Merkstein",-12]
[4639,"Merlach",-14]
[6217,"Merseburg/Saale",-14]
[54318,"Mertesdorf",-12]
[67271,"Mertesheim",-12]
[55627,"Merxheim",-12]
[49586,"Merzen",-12]
[52399,"Merzenich",-12]
[79249,"Merzhausen",-14]
[66663,"Merzig",-12]
[59872,"Meschede",-14]
[17498,"Mesekenhagen",-12]
[8527,"Meßbach",-16]
[64409,"Messel",-12]
[88605,"Meßkirch",-14]
[72469,"Meßstetten",-18]
[48629,"Metelen",-10]
[23972,"Metelsdorf",-10]
[94526,"Metten/Niederbay.",-18]
[88400,"Mettenberg",-16]
[49497,"Mettingen",-12]
[66693,"Mettlach",-12]
[40822,"Mettmann",-12]
[55777,"Mettweiler",-14]
[72555,"Metzingen",-16]
[40822,"Metzkausen",-12]
[6686,"Meuchen",-14]
[56414,"Meudt",-14]
[1994,"Meuro",-16]
[6217,"Meuschau",-14]
[16306,"Meyenburg",-16]
[2979,"Michacken",-16]
[96247,"Michelau",-16]
[97782,"Michelau",-14]
[74858,"Michelbach",-12]
[74613,"Michelbach am Wald",-14]
[74544,"Michelbach an der Bilz",-16]
[74545,"Michelfeld",-16]
[74918,"Michelfeld",-12]
[64720,"Michelstadt",-14]
[88339,"Michelwinnaden",-16]
[12051,"Michendorf",-14]
[86866,"Mickhausen",-14]
[83714,"Miesbach",-18]
[77933,"Mietersheim",-12]
[88487,"Mietingen",-16]
[52538,"Millen",-10]
[93468,"Miltach",-18]
[17091,"Miltitzwalde",-14]
[88682,"Mimmenhausen",-14]
[89350,"Mindelaltheim",-16]
[87719,"Mindelheim",-16]
[86513,"Mindelzell",-16]
["3242.","Minden/Westf.",-12]
[76872,"Minfeld",-12]
[19079,"Mirow",-12]
[30629,"Misburg",-14]
[91785,"Mischelbach",-16]
[4720,"Mischütz",-14]
[27632,"Misselwarden",-10]
[95490,"Mistelgau",-16]
[56729,"Mittelbaar",-14]
[87466,"Mittelberg b. Oy",-18]
[88441,"Mittelbiberach",-16]
[66851,"Mittelbrunn",-12]
[88416,"Mittelbuch",-16]
[91734,"Mitteleschenbach",-16]
[99195,"Mittelhausen",-14]
[2763,"Mittelherwigsdorf",-16]
[86868,"Mittelneufnach",-16]
[88682,"Mittelstenweiler",-14]
[82293,"Mittelstetten",-16]
[72270,"Mitteltal",-16]
[35756,"Mittenaar",-12]
[82481,"Mittenwald",-16]
[15749,"Mittenwalde",-14]
[94360,"Mitterfels",-18]
[95666,"Mitterteich",-18]
[9648,"Mittweida",-14]
[96268,"Mitwitz",-16]
[9661,"Mobendorf",-14]
[4720,"Möbertitz",-14]
[4720,"Mochau",-14]
[6888,"Mochau",-14]
[74219,"Möckmühl",-14]
[4838,"Mockrehna",-14]
[4720,"Mockritz",-14]
[4860,"Mockritz",-16]
[64397,"Modautal - Brandau",-14]
[6193,"Möderau",-14]
[19374,"Möderitz",-14]
[89426,"Mödingen",-16]
["4744.","Moers",-10]
[73563,"Mögglingen",-16]
[59519,"Möhnesee",-12]
[86498,"Mohrenhausen",-16]
[70567,"Möhringen",-14]
[23560,"Moisling",-12]
[49696,"Molbergen",-12]
[4579,"Mölbis",-14]
[4838,"Mölbitz",-14]
[24113,"Molfsee",-10]
[4457,"Mölkau",-14]
[17237,"Möllenbeck",-14]
[17091,"Mölln",-14]
[23879,"Mölln",-12]
[57482,"Möllnicke",-14]
[88364,"Molpertshaus",-16]
[99869,"Molschleben",-14]
[18246,"Moltenow",-12]
[55278,"Mommenheim",-12]
[75378,"Monakam",-14]
[71083,"Mönchberg",-16]
[41169,"Mönchengladbach",-10]
["4106.","Mönchengladbach",-10]
[41238,"Mönchengladbach - Mülfort",-10]
[78087,"Mönchweiler",-18]
[53859,"Mondorf",-12]
[86653,"Monheim",-16]
[40789,"Monheim/Rheinl.",-10]
[17375,"Mönkebude",-12]
[52156,"Monschau",-14]
[67590,"Monsheim",-12]
[71297,"Mönsheim",-14]
[56410,"Montabaur",-14]
[82271,"Moorenweis",-16]
[82272,"Moorenweis",-16]
[25436,"Moorrege",-10]
[77815,"Moos",-12]
[87493,"Moos",-16]
[94554,"Moos",-18]
[78345,"Moos / Bodensee",-12]
[89613,"Moosbeuren",-16]
[76571,"Moosbronn",-14]
[85368,"Moosburg/Isar",-16]
[84164,"Moosthenning",-18]
[54497,"Morbach",-14]
[67700,"Morbach",-12]
[71577,"Morbach",-16]
[99735,"Mörbach",-14]
[53913,"Morenhoven",-14]
[64546,"Mörfelden-Walldorf",-12]
[8262,"Morgenröthe",-18]
[37186,"Moringen",-16]
[1468,"Moritzburg",-14]
[6193,"Morl",-14]
[61161,"Mörlach",-16]
[57583,"Mörlen",-14]
[69509,"Mörlenbach",-12]
[35232,"Mornshausen",-12]
[91804,"Mörnsheim",-16]
[51597,"Morsbach",-12]
[76287,"Mörsch",-12]
[55758,"Mörschied",-14]
[89435,"Mörslingen",-16]
[4838,"Mörtitz",-14]
[2999,"Mortka",-16]
[14806,"Mörz",-14]
[76829,"Mörzheim",-12]
[74821,"Mosbach",-12]
[7973,"Moschwitz",-16]
[56073,"Moselweiß",-14]
[39291,"Möser/Magdeburg",-14]
[72116,"Mössingen",-18]
[14715,"Möthlow",-14]
[86753,"Möttingen",-16]
[75378,"Möttlingen",-16]
[71159,"Mötzingen",-16]
[7381,"Moxa",-14]
[53804,"Much",-12]
[35325,"Mücke",-14]
[69427,"Mudau",-16]
[19063,"Mueß",-12]
[4769,"Mügeln",-14]
[79674,"Muggenbrunn",-18]
[91346,"Muggendorf",-16]
[76461,"Muggensturm",-12]
[75417,"Mühlacker",-14]
[9241,"Mühlau",-14]
[9557,"Mühlbach",-14]
[75031,"Mühlbach",-14]
[6774,"Mühlbeck",-14]
[4931,"Mühlberg",-16]
[99869,"Mühlberg",-14]
[84453,"Mühldorf",-16]
[77796,"Mühlenbach",-16]
[16567,"Mühlenbeck",-14]
[8626,"Mühlhausen",-18]
[69242,"Mühlhausen",-12]
[78056,"Mühlhausen",-18]
[86444,"Mühlhausen",-16]
[92360,"Mühlhausen",-16]
[99974,"Mühlhausen",-14]
[73347,"Mühlhausen im Täle",-16]
[72172,"Mühlheim",-16]
[78570,"Mühlheim / Donau",-16]
[63165,"Mühlheim/Main",-12]
[90453,"Mühlhof",-16]
[7919,"Mühltroff",-16]
[91735,"Muhr am See",-16]
[9619,"Mulda",-16]
[8269,"Muldenberg",-18]
[53945,"Mülheim",-14]
["4547.","Mülheim/Ruhr",-10]
[56218,"Mülheim-Kärlich",-14]
[79379,"Müllheim",-12]
[15299,"Müllrose",-16]
[8132,"Mülsen bei St. Jacob",-14]
[95213,"Münchberg",-18]
[15748,"Münchehofe",-14]
["8....","München",-16]
[35759,"Münchhausen",-14]
[70825,"Münchingen",-14]
[84034,"Münchnerau",-16]
[41516,"Münchrath",-10]
[94439,"Münchsdorf",-16]
[77955,"Münchweier",-12]
[66981,"Münchweiler",-12]
[78183,"Mundelfingen",-16]
[74395,"Mundelsheim",-12]
[89597,"Munderkingen",-14]
[79312,"Mundingen",-12]
[50933,"Müngersdorf",-12]
[82541,"Münsing",-16]
[72525,"Münsingen/Württ.",-16]
[29633,"Munster",-14]
[65618,"Münster",-14]
["481..","Münster",-12]
[86692,"Münster/Lech",-16]
[56294,"Münstermaifeld",-12]
[79244,"Münstertal",-18]
[35516,"Münzenberg",-14]
[76703,"Münzesheim",-12]
[86757,"Munzingen",-16]
[79730,"Murg",-12]
[82418,"Murnau",-16]
[71711,"Murr",-12]
[71540,"Murrhardt",-16]
[9228,"Murschnitz",-14]
[88371,"Musbach",-14]
[70771,"Musberg",-14]
[6679,"Muschwitz",-14]
[21516,"Müssen",-12]
[46395,"Mussum",-10]
[73557,"Mutlangen",-16]
[76307,"Mutschelbach",-14]
[88456,"Muttensweiler",-16]
[67112,"Mutterstadt",-12]
[14823,"Mützdorf",-14]
[39307,"Mützel",-14]
[54608,"Mützenich",-14]
[4688,"Mutzschen",-14]
[41849,"Myhl",-10]
[8499,"Mylau",-16]
[92507,"Nabburg",-16]
[73230,"Nabern",-16]
[55299,"Nackenheim",-12]
[6785,"Naderkau",-14]
[72202,"Nagold",-16]
[86720,"Nähermemmingen",-16]
[7973,"Naitschau",-16]
[66809,"Nalbach",-12]
[85405,"Nandlstadt",-16]
[2979,"Nardt",-16]
[4657,"Narsdorf",-14]
[27404,"Nartum",-12]
[23936,"Naschendorf",-10]
[4758,"Nasenberg",-14]
[89584,"Nasgenstadt",-14]
[29857,"Natendorf",-14]
[89564,"Nattheim",-16]
[34434,"Natzungen",-14]
[14641,"Nauen",-14]
[64569,"Nauheim",-12]
[6618,"Naumburg",-14]
[34311,"Naumburg",-14]
[1796,"Naundorf",-14]
[4683,"Naunhof",-14]
[4703,"Naunhof",-14]
[56237,"Nauort",-14]
[65207,"Naurod",-14]
[6571,"Nausitz",-14]
[1920,"Naußlitz",-16]
[1609,"Nauwalde",-16]
[71126,"Nebringen",-16]
[74924,"Neckarbischofsheim",-12]
[69151,"Neckargemünd",-12]
[69437,"Neckargerach",-12]
[72622,"Neckarhausen",-16]
[71686,"Neckarrems",-12]
[74172,"Neckarsulm",-12]
[72666,"Neckartailfingen",-14]
[72654,"Neckartenzlingen",-16]
[71642,"Neckarweihingen",-12]
[74382,"Neckarwestheim",-12]
[74865,"Neckarzimmern",-12]
[17039,"Neddemin",-14]
[89189,"Neenstetten",-16]
[26802,"Neermoor",-10]
[21398,"Neetze",-12]
[37643,"Negenborn",-14]
["597..","Neheim-Hüsten",-12]
[6193,"Nehlitz",-14]
[72147,"Nehren",-16]
[73272,"Neidlingen",-16]
[74336,"Neipperg",-12]
[57638,"Neitersen",-14]
[73760,"Nellingen",-14]
[89191,"Nellingen",-18]
[72149,"Nellingsheim",-16]
[71397,"Nellmersbach",-14]
[6268,"Nemsdorf",-14]
[78532,"Nendingen",-16]
[36214,"Nentershausen",-14]
[56412,"Nentershausen",-14]
[4828,"Nepperwitz",-16]
[4685,"Nerchau",-14]
[54570,"Neroth",-14]
[14806,"Neschholz",-14]
[2699,"Neschwitz",-16]
[27612,"Nesse",-10]
[77767,"Nesselried",-12]
[87484,"Nesselwang",-18]
[57250,"Netphen",-14]
[53947,"Nettersheim",-14]
[41334,"Nettetal",-10]
[31185,"Nettlingen",-14]
[31099,"Netze",-16]
[17440,"Netzelkow",-12]
[8491,"Netzschkau",-16]
[61267,"Neu Anspach",-14]
[55546,"Neu Bamberg",-12]
[29490,"Neu Darchau",-12]
[2699,"Neu Jeßnitz",-16]
[17348,"Neu Käbelich",-14]
[6449,"Neu Königsaue",-14]
[2829,"Neu Krauscha",-16]
[18586,"Neu Reddevitz",-10]
[21629,"Neu Wulmsdorf",-12]
[24879,"Neuberend",-10]
[83115,"Neubeuern",-18]
[85579,"Neubiberg",-16]
["1703.","Neubrandenburg",-14]
[73453,"Neubronn",-16]
[75387,"Neubulach",-16]
[76776,"Neuburg",-12]
[94127,"Neuburg am Inn",-16]
[85467,"Neuching",-16]
[74861,"Neudenau",-12]
[78166,"Neudingen",-16]
[76676,"Neudorf",-12]
[1920,"Neudörfel",-16]
[8543,"Neudörfel",-16]
[2739,"Neueibau",-16]
[33100,"Neuenbeken",-14]
[79395,"Neuenburg",-12]
[75305,"Neuenbürg",-14]
["7939.","Neuenburg am Rhein",-12]
[18516,"Neuendorf",-12]
[15518,"Neuendorf im Sande",-14]
[15366,"Neuenhagen",-14]
[72631,"Neuenhaus",-14]
[39345,"Neuenhofe",-14]
[17498,"Neuenkirchen",-12]
[28790,"Neuenkirchen",-10]
[29643,"Neuenkirchen",-12]
[48485,"Neuenkirchen",-12]
[49434,"Neuenkirchen",-12]
[18445,"Neuenpleen",-10]
[58809,"Neuenrade",-12]
[8451,"Neuensalz",-16]
[74196,"Neuenstadt",-14]
[36286,"Neuenstein",-16]
[84088,"Neufahrn",-18]
[85375,"Neufahrn",-16]
[72639,"Neuffen",-16]
[85464,"Neufinsing",-16]
[72419,"Neufra",-16]
[88499,"Neufra",-14]
[88682,"Neufrach",-14]
[84181,"Neufraunhofen",-16]
[2727,"Neugersdorf",-16]
[85659,"Neuharting",-16]
[19273,"Neuhaus",-12]
[37603,"Neuhaus",-14]
[83727,"Neuhaus",-18]
[91284,"Neuhaus",-16]
[67547,"Neuhausen",-12]
[72555,"Neuhausen",-16]
[73765,"Neuhausen",-14]
[75242,"Neuhausen",-14]
[89291,"Neuhausen",-16]
[97513,"Neuhausen i. Steigerwald",-16]
[67680,"Neuhemsbach",-12]
[75382,"Neuhengstett",-14]
[1920,"Neuhof",-16]
[36119,"Neuhof",-14]
[90616,"Neuhof a. d. Zenn",-16]
[67141,"Neuhofen",-12]
[16515,"Neuholland",-14]
[63263,"Neu-Isenburg",-12]
[2699,"Neu-Jessnitz",-16]
[85630,"Neukeferloh",-16]
[96342,"Neukenroth",-16]
[1904,"Neukirch",-16]
[1936,"Neukirch",-16]
[88099,"Neukirch",-14]
[8459,"Neukirchen",-14]
[23779,"Neukirchen",-10]
[83364,"Neukirchen",-16]
[92259,"Neukirchen",-16]
[93453,"Neukirchen",-18]
[94362,"Neukirchen",-18]
[94127,"Neukirchen am Inn",-16]
[94154,"Neukirchen v. W.",-16]
[47506,"Neukirchen-Vluyn",-10]
[23992,"Neukloster",-12]
[21710,"Neuland, Kr. Stade",-10]
[98744,"Neu-Leibis",-16]
[73491,"Neuler",-16]
[75245,"Neulingen",-14]
[68809,"Neulußheim",-12]
[54347,"Neumagen",-10]
[15306,"Neu-Mahlisch",-16]
[92318,"Neumarkt",-16]
["2453.","Neumünster",-12]
[8527,"Neundorf",-16]
[39418,"Neundorf",-14]
[73479,"Neunheim",-16]
[57520,"Neunkhausen",-14]
[53819,"Neunkirchen",-12]
[54426,"Neunkirchen",-14]
[57290,"Neunkirchen",-14]
[74867,"Neunkirchen",-12]
[91233,"Neunkirchen",-16]
[91077,"Neunkirchen a.B.",-16]
["665..","Neunkirchen/Saar",-12]
[91567,"Neunstetten",-16]
[84524,"Neuötting",-16]
[6333,"Neuplatendorf",-14]
[2699,"Neupuschwitz",-16]
[41517,"Neurath",-12]
[76149,"Neureut",-12]
[77743,"Neuried",-12]
[16816,"Neuruppin",-14]
[2742,"Neusalza-Spremberg",-16]
[86356,"Neusäß",-16]
[91330,"Neuses",-16]
[91616,"Neusitz",-16]
[95700,"Neusorg",-18]
[41363,"Neu-Spenrath",-12]
["4146.","Neuss",-10]
[41470,"Neuss - Allerheiligen",-10]
[41472,"Neuss - Grefrath",-10]
[41470,"Neuss - Rosellen",-10]
[1844,"Neustadt",-14]
[53577,"Neustadt",-14]
[71336,"Neustadt",-14]
[92660,"Neustadt",-16]
[19306,"Neustadt - Glewe",-14]
[35279,"Neustadt (Hessen)",-14]
[95514,"Neustadt a. Kulm",-16]
[31535,"Neustadt am Rübenberge",-14]
[91413,"Neustadt an der Aisch",-16]
[96465,"Neustadt bei Coburg",-16]
[93333,"Neustadt/Donau",-18]
[7806,"Neustadt/Orla",-14]
[67433,"Neustadt/Weinstraße",-10]
[72149,"Neustetten",-16]
[17235,"Neustrelitz",-14]
[17268,"Neu-Temmen",-14]
[76689,"Neuthard",-12]
[93073,"Neutraubling",-16]
[15320,"Neutrebbin",-14]
[89233,"Neu-Ulm",-14]
["8923.","Neu-Ulm",-14]
[30916,"Neuwarmbüchen",-14]
[39393,"Neuwegersleben",-14]
[76534,"Neuweier",-14]
[71093,"Neuweiler",-16]
[75389,"Neuweiler",-16]
[4828,"Neuweißenborn",-14]
[41066,"Neuwerk",-10]
["5656.","Neuwied",-12]
[23816,"Neversdorf",-12]
["4254.","Neviges",-12]
[54309,"Newel",-14]
[3253,"Nexdorf",-16]
[56645,"Nickenich",-14]
[4703,"Nicollschwitz",-14]
[63667,"Nidda",-12]
[61194,"Niddatal",-12]
[61130,"Nidderau-Windecken",-12]
[52385,"Nideggen",-14]
[75210,"Niebelsbach",-14]
[7580,"Niebra",-14]
[25899,"Niebüll",-10]
[65934,"Nied",-12]
[34305,"Niedenstein",-14]
[2906,"Nieder Seifersdorf",-16]
[36272,"Niederaula-Kerspenhausen",-14]
[56729,"Niederbaar",-14]
[53343,"Niederbachem",-14]
[9627,"Niederbobritzsch",-16]
[65611,"Niederbrechen",-12]
[2708,"Niedercunnersdorf",-16]
[33739,"Niederdornberg",-12]
[56651,"Niederdürenbach",-14]
[56412,"Niederelbert",-14]
[56412,"Niedererbach",-14]
[60437,"Nieder-Erlenbach",-14]
[78078,"Niedereschach",-16]
[67592,"Nieder-Flörsheim",-12]
[9243,"Niederfrohna",-14]
[4618,"Niederhain",-14]
[65760,"Niederhöchstadt",-12]
[79730,"Niederhof",-12]
[89604,"Niederhofen",-14]
[37269,"Niederhone",-14]
[53501,"Niederich",-14]
[63486,"Niederissigheim",-12]
[65817,"Niederjosbach",-10]
[53859,"Niederkassel",-12]
[41372,"Niederkrüchten",-10]
[15751,"Niederlehme",-14]
[39264,"Niederlepte",-14]
[56556,"Niederlützingen",-12]
[8138,"Niedermülsen",-14]
[92545,"Niedermurach",-18]
[63843,"Niedernberg",-12]
[39167,"Niederndodeleben",-14]
[85467,"Niederneuching",-16]
[74676,"Niedernhall",-14]
[65527,"Niedernhausen",-14]
[37133,"Niedernjesa",-16]
[27432,"Nieder-Ochtenhausen",-12]
[2791,"Niederoderwitz",-16]
[35325,"Nieder-Ohmen",-14]
[35325,"Nieder-Ohmen",-14]
[55268,"Nieder-Olm",-12]
[86381,"Niederraunau",-16]
[87767,"Niederrieden",-16]
[8393,"Niederschindmaas",-14]
[34497,"Niederschleidern",-16]
[86694,"Niederschönenfeld",-16]
[77749,"Niederschopfheim",-12]
[65618,"Niederselters",-14]
[54570,"Niederstadtfeld",-14]
[89168,"Niederstotzingen",-16]
[84494,"Niedertaufkirchen",-16]
[35274,"Niederwald",-12]
[56357,"Niederwallmenach",-12]
[79379,"Niederweiler",-14]
[8396,"Niederwiera",-14]
[79733,"Niederwihl",-14]
[79297,"Niederwinden",-16]
[55758,"Niederworresbach",-14]
[66440,"Niederwürzbach",-12]
[52382,"Niederzier",-12]
[56651,"Niederzissen",-14]
[75223,"Niefern",-14]
[67308,"Niefernheim",-12]
[1561,"Niegeroda",-16]
[33039,"Nieheim",-14]
[19258,"Nieklitz",-12]
[1968,"Niemtsch",-16]
[31582,"Nienburg/Weser",-12]
[29690,"Nienhagen",-12]
[29364,"Nienhof",-14]
[19017,"Nienmark",-12]
[31688,"Nienstädt",-14]
[31035,"Nienstedt",-14]
[31848,"Nienstedt",-14]
[55283,"Nierstein",-12]
[1609,"Nieska",-16]
[2906,"Niesky",-16]
[34266,"Niestetal",-12]
[79331,"Nimburg",-12]
[4626,"Nischwitz",-14]
[4808,"Nischwitz",-14]
[54453,"Nittel",-12]
[93152,"Nittendorf",-16]
[56729,"Nitz",-14]
[39539,"Nitzow",-14]
[4639,"Nitzschka",-14]
[66625,"Nohfelden",-14]
[54579,"Nollenbach",-14]
[56412,"Nomborn",-14]
[53639,"Nonnenberg",-12]
[77963,"Nonnenweier",-12]
[66620,"Nonnweiler",-14]
[24811,"Norby",-12]
[86695,"Nordendorf",-16]
[26954,"Nordenham",-10]
[26548,"Norderney",-10]
[22851,"Norderstedt",-12]
[96365,"Nordhalden",-18]
[25785,"Nordhastedt",-10]
[74226,"Nordhausen",-12]
[99734,"Nordhausen",-14]
[74226,"Nordheim",-12]
[27637,"Nordholz",-10]
["4852.","Nordhorn",-10]
[59394,"Nordkirchen",-12]
[86720,"Nördlingen",-16]
[77787,"Nordrach",-14]
[34132,"Nordshausen/Kassel",-14]
[31171,"Nordstemmen",-14]
[72160,"Nordstetten",-16]
[25845,"Nordstrand",-10]
[79341,"Nordweil",-12]
[27211,"Nordwohlde",-12]
[89312,"Nornheim",-16]
[37176,"Nörten-Hardenberg",-16]
[37154,"Northeim",-16]
[24589,"Nortorf",-12]
[52388,"Nörvenich",-12]
[4749,"Noschkowitz",-14]
[2627,"Nostitz",-16]
[53902,"Nöthen",-14]
[79254,"Notschrei",-18]
[21640,"Nottensdorf",-12]
[75196,"Nöttingen",-14]
[48301,"Nottuln",-12]
[73274,"Notzingen",-16]
[23714,"Nüchel",-12]
[97720,"Nüdlingen",-14]
[71154,"Nufringen",-16]
[51588,"Nümbrecht",-12]
[66687,"Nunkirchen",-12]
[53520,"Nürburg",-14]
["904..","Nürnberg",-16]
[72622,"Nürtingen",-14]
[54675,"Nusbaum",-14]
[77704,"Nußbach",-12]
[71735,"Nussdorf",-14]
[83131,"Nußdorf",-18]
[69226,"Nußloch",-12]
[36088,"Nüst",-14]
[36167,"Nüsttal",-14]
[76703,"Oberacker",-12]
[70771,"Oberaichen",-14]
[79761,"Oberalpfen",-14]
[82487,"Oberammergau",-18]
[4618,"Oberarnsdorf",-14]
[82496,"Oberau",-18]
[83080,"Oberaudorf",-18]
[56729,"Oberbaar",-14]
[97772,"Oberbach",-16]
[78073,"Oberbaldingen",-16]
[79235,"Oberbergen",-12]
[54331,"Oberbillig",-12]
[72644,"Oberboihingen",-14]
[65611,"Oberbrechen",-12]
[36284,"Oberbreitzbach",-14]
[52525,"Oberbruch",-10]
[1762,"Obercarsdorf",-14]
[8147,"Obercrinitz",-16]
[2708,"Obercunnersdorf",-16]
[75038,"Oberderdingen",-14]
[69429,"Oberdielbach",-14]
[73441,"Oberdorf",-16]
[88085,"Oberdorf",-12]
[88348,"Obereggatsweiler",-16]
[79418,"Obereggenen",-14]
[97247,"Obereisenheim",-14]
[56412,"Oberelbert",-14]
[99819,"Oberellen",-16]
[61352,"Ober-Erlenbach",-14]
[88436,"Oberessendorf",-16]
[90559,"Oberferrieden (Burgthann)",-16]
[1762,"Oberfrauendorf",-14]
[53894,"Obergartzem",-14]
[94486,"Obergessenbach",-18]
[34621,"Obergrenzebach",-14]
[86573,"Obergriesbach",-16]
[74831,"Obergriesheim",-12]
[76646,"Obergrombach",-12]
[73569,"Obergröningen",-16]
[82041,"Oberhaching",-16]
[18239,"Oberhagen",-12]
[96173,"Oberhaid",-16]
[77784,"Oberharmersbach",-14]
[75387,"Oberhaugstett",-16]
[46147,"Oberhausen",-10]
[68794,"Oberhausen",-12]
[76887,"Oberhausen",-12]
[82386,"Oberhausen",-16]
[86154,"Oberhausen",-16]
[68794,"Oberhausen-Rheinhausen",-12]
[8468,"Oberheinsdorf",-16]
[23948,"Oberhof",-10]
[98559,"Oberhof",-16]
[88447,"Oberhöfen",-16]
[84503,"Oberholzhausen",-16]
[88480,"Oberholzheim",-16]
[97258,"Oberickelsheim",-16]
[72296,"Oberiflingen",-16]
[71083,"Oberjesingen",-16]
[71131,"Oberjettingen",-16]
[77704,"Oberkirch",-14]
[31683,"Oberkirchen",-14]
[57392,"Oberkirchen",-14]
[73447,"Oberkochen",-16]
[75394,"Oberkollbach",-16]
[7922,"Oberkoskau",-16]
[16727,"Oberkrämer OT Schwante",-14]
[97488,"Oberlauringen",-16]
[7356,"Oberlemnitz",-18]
[75328,"Oberlengenhardt",-16]
[8527,"Oberlosa",-16]
[32479,"Oberlübbe",-12]
[89611,"Obermarchtal",-14]
[86836,"Obermeitingen",-16]
[90587,"Obermichelbach",-16]
[61239,"Ober-Mörlen",-14]
[67823,"Obermoschel",-12]
[63785,"Obernburg",-12]
[35606,"Oberndorf",-12]
[72108,"Oberndorf",-16]
[84107,"Oberndorf",-16]
[86698,"Oberndorf",-16]
[99310,"Oberndorf",-14]
[78727,"Oberndorf/Neckar",-16]
[75217,"Obernhausen",-14]
[72364,"Obernheim",-18]
[37124,"Obernjesa",-16]
[94130,"Obernzell",-16]
[2744,"Oberoderwitz",-16]
[86869,"Oberostendorf",-16]
[76889,"Oberotterbach",-12]
[86507,"Oberottmarshausen",-16]
[76703,"Oberöwisheim",-12]
[53639,"Oberpleis",-12]
[94562,"Oberpöring",-18]
[79215,"Oberprechtal",-16]
[35641,"Oberquembach",-14]
[64372,"Ober-Ramstadt",-14]
[4720,"Oberranschütz",-14]
[75394,"Oberreichenbach",-16]
[91097,"Oberreichenbach",-16]
[61389,"Oberreifenberg",-16]
[79254,"Oberried",-18]
[71739,"Oberriexingen",-12]
[79206,"Oberrimsingen",-12]
[6528,"Oberröblingen",-14]
[96364,"Oberrodach",-16]
[36041,"Oberrode",-14]
[74420,"Oberrot",-16]
[79233,"Oberrotweil",-12]
[91483,"Oberscheinfeld",-16]
[76889,"Oberschlettenbach",-12]
[73485,"Oberschneidheim",-16]
[94363,"Oberschneiding",-18]
[9600,"Oberschöna",-16]
[77948,"Oberschopfheim",-12]
[72221,"Oberschwandorf",-16]
[97478,"Oberschwappach",-16]
[88410,"Oberschwarzach",-16]
[2763,"Oberseifersdorf",-16]
[65520,"Oberselters",-14]
[57078,"Obersetzen",-14]
[38173,"Obersickte",-14]
[66957,"Obersimten",-12]
[97791,"Obersinn",-14]
[74423,"Obersontheim",-16]
[97509,"Oberspiesheim",-14]
[89613,"Oberstadion",-14]
[54570,"Oberstadtfeld",-14]
["8752.","Oberstaufen",-18]
["8755.","Oberstdorf",-20]
[71720,"Oberstenfeld",-14]
[72531,"Oberstetten",-18]
[88416,"Oberstetten ",-16]
[97640,"Oberstreu",-14]
[74182,"Obersulm",-14]
[88471,"Obersulmetingen",-16]
[67271,"Obersülzen",-12]
[84101,"Obersüßbach",-16]
[99444,"Obersynderstedt",-14]
[88094,"Oberteuringen",-14]
[97723,"Oberthulba",-14]
[93083,"Obertraubling",-16]
[63179,"Obertshausen",-12]
[73656,"Oberurbach",-16]
[61440,"Oberursel/Taunus",-12]
[92526,"Oberviechtach",-16]
[34281,"Obervorschütz",-14]
[89349,"Oberwaldbach",-16]
[79780,"Oberwangen",-14]
[77948,"Oberweier",-12]
[72226,"Oberweiler",-16]
[71554,"Oberweissach",-14]
[79862,"Oberweschnegg",-16]
[55430,"Oberwesel",-14]
[34399,"Oberweser",-12]
[65589,"Oberweyer",-14]
[8396,"Oberwiera",-14]
[92355,"Oberwiesenacker",-16]
[86519,"Oberwiesenbach",-16]
[79733,"Oberwihl",-14]
[74747,"Oberwittstadt",-14]
[77709,"Oberwolfach",-14]
[88213,"Oberzell",-14]
[56651,"Oberzissen",-14]
[83119,"Obing",-16]
[53506,"Obliers",-14]
[46485,"Obrighoven",-10]
[97199,"Ochsenfurt",-14]
[88416,"Ochsenhausen",-16]
[88418,"Ochsenhausen",-16]
[31139,"Ochtersum",-14]
[48607,"Ochtrup",-10]
[61169,"Ockstadt",-14]
[85235,"Odelzhausen",-16]
[53913,"Odendorf",-14]
[76684,"Odenheim",-12]
[41199,"Odenkirchen",-10]
[51519,"Odenthal",-12]
[72531,"Ödenwaldstetten",-18]
[55571,"Odernheim",-12]
[2791,"Oderwitz",-16]
[21775,"Odisheim",-12]
[36404,"Oechsen",-16]
[91249,"Oed",-16]
[34399,"Oedelsheim",-12]
[9569,"Oederan",-14]
[74229,"Oedheim",-12]
[2625,"Oehna",-16]
[98704,"Oehrenstock",-16]
[38271,"Oelber a. weißen Wege",-14]
[59302,"Oelde",-12]
[8606,"Oelsnitz",-16]
[9376,"Oelsnitz",-14]
[45739,"Oer-Erkenschwick",-10]
[65375,"Oestrich-Winkel",-12]
[86732,"Oettingen",-16]
[59823,"Oeventrop",-12]
["5975.","Oeventrop",-14]
[53501,"Oeverich",-14]
[52477,"Ofden",-12]
[74254,"Offenau",-12]
[76877,"Offenbach",-12]
["6307.","Offenbach/Main",-12]
[67749,"Offenbach-Hundheim",-14]
["7765.","Offenburg",-12]
[91238,"Offenhausen",-16]
[65555,"Offheim",-12]
[89362,"Offingen",-16]
[79664,"Öflingen",-12]
[72131,"Ofterdingen",-16]
[68723,"Oftersheim",-12]
[88448,"Oggelsbeuren",-16]
[88422,"Oggelshausen",-16]
[89522,"Oggenhausen",-16]
[21220,"Ohlendorf",-12]
[77797,"Ohlsbach",-12]
[82441,"Ohlstadt",-18]
[73275,"Ohmden",-16]
[72770,"Ohmenhausen",-16]
[36326,"Ohmes",-14]
[72813,"Ohnastetten",-18]
[1896,"Ohorn",-14]
[74613,"Öhringen",-14]
[74613,"Ohrnberg",-14]
[49626,"Ohrtermersch",-12]
[27337,"Oiste",-12]
[65795,"Okriftel",-12]
[1458,"Okrilla",-14]
[9526,"Olbernhau",-16]
[2785,"Olbersdorf",-16]
[9432,"Olbersdorf",-16]
[75248,"Ölbronn-Dürrn",-14]
[82140,"Olching",-16]
[29313,"Oldau",-12]
["2613.","Oldenburg/Oldb.",-10]
[21726,"Oldendorf",-12]
[29320,"Oldendorf",-14]
[33719,"Oldentrup",-12]
[26802,"Oldersum",-10]
[53937,"Olef",-14]
[59399,"Olfen",-12]
[37635,"Ölkassen",-14]
[74249,"Olnhausen",-14]
[57462,"Olpe",-14]
[88427,"Olzreute",-16]
[77855,"Önsbach",-12]
[72458,"Onstmettingen",-18]
[88145,"Opfenbach",-16]
[97241,"Opferbaum",-14]
[79112,"Opfingen",-12]
["79...","Opfingen",-12]
[89614,"Öpfingen",-14]
["513..","Opladen",-10]
[2736,"Oppach",-16]
[77728,"Oppenau",-16]
[71570,"Oppenweiler",-14]
[35519,"Oppershofen",-14]
[6785,"Oranienbaum",-14]
[16515,"Oranienburg",-14]
[54298,"Orenhofen",-14]
[34474,"Orpethal",-14]
[77972,"Orschweier",-12]
[88477,"Orsenhausen",-16]
[78359,"Orsingen-Nenzingen",-14]
[95233,"Ort",-18]
[63683,"Ortenberg",-12]
[77799,"Ortenberg",-12]
[94496,"Ortenburg",-16]
[86647,"Ortlfingen",-16]
[86678,"Ortlfingen",-16]
[1990,"Ortrand",-16]
[31167,"Ortshausen",-14]
[4758,"Oschatz",-14]
[71126,"Öschelbronn",-16]
[75223,"Öschelbronn",-14]
[72116,"Öschingen",-18]
[6184,"Osmünde",-14]
["4908.","Osnabrück",-12]
[99510,"Oßmannstedt",-14]
[48346,"Ostbevern",-12]
[72336,"Ostdorf",-16]
[75395,"Ostelsheim",-16]
[21756,"Osten",-12]
[39606,"Osterburg",-14]
[74706,"Osterburken",-14]
[24367,"Osterby",-10]
[49179,"Ostercappeln",-12]
[88339,"Osterhofen",-16]
[94486,"Osterhofen",-18]
[27711,"Osterholz-Scharmbeck",-12]
[83104,"Ostermünchen",-16]
[37520,"Osterode/Harz",-16]
[31020,"Osterwald",-14]
[39171,"Osterweddingen",-14]
[87662,"Osterzell",-16]
[73760,"Ostfildern",-14]
[67574,"Osthofen",-12]
[39343,"Ostingersleben",-14]
[59510,"Östinghausen",-12]
[88356,"Ostrach",-14]
[4749,"Ostrau",-14]
[76684,"Östringen",-12]
[2899,"Ostritz",-16]
[18375,"Ostseebad Prerow",-10]
[76470,"Ötigheim",-12]
[75443,"Ötisheim",-14]
[37671,"Ottbergen",-14]
[73113,"Ottenbach",-16]
[75382,"Ottenbronn",-16]
[25591,"Ottenbüttel",-12]
[9648,"Ottendorf",-14]
[2708,"Ottenhain",-16]
[75334,"Ottenhausen",-14]
[77963,"Ottenheim",-12]
[77883,"Ottenhöfen",-14]
[31868,"Ottenstein",-14]
[48683,"Ottenstein",-10]
[67697,"Otterberg",-12]
[83624,"Otterfing",-16]
[21762,"Otterndorf",-10]
[31535,"Otternhagen",-14]
[28870,"Ottersberg",-12]
[85652,"Ottersberg",-16]
[68723,"Ottersheim",-12]
[28870,"Otterstedt",-12]
[88427,"Otterswang",-16]
[77833,"Ottersweier",-14]
[4668,"Otterwisch",-14]
[4720,"Ottewig",-14]
[86316,"Ottmaring",-16]
[94533,"Ottmaring",-18]
[48308,"Ottmarsbocholt",-12]
[86536,"Ottmarshausen",-16]
[87724,"Ottobeuren",-16]
[85521,"Ottobrunn",-16]
[66564,"Ottweiler",-12]
[64853,"Otzberg",-14]
[41363,"Otzenrath",-10]
[94563,"Otzing",-18]
[29313,"Ovelgönne",-12]
[37671,"Ovenhausen",-14]
[51491,"Overath",-12]
[73277,"Owen",-16]
[72401,"Owingen",-16]
[88696,"Owingen",-12]
[24811,"Owschlag",-12]
[89335,"Oxenbronn",-16]
[28876,"Oyten",-12]
[28876,"Oyten - Bassen",-12]
[38836,"Pabstorf",-14]
[4886,"Packisch",-16]
["33...","Paderborn",-12]
[82396,"Pähl",-16]
[4603,"Pähnitz",-14]
[7580,"Paitzdorf",-14]
[76133,"Palmbach",-14]
[54439,"Palzem",-12]
[19075,"Pampow",-12]
[4451,"Panitzsch",-14]
[16341,"Panketal",-14]
[1920,"Panschwitz",-16]
[54531,"Pantenburg",-14]
[37696,"Papenhöfen",-14]
[89136,"Pappelau",-14]
[9661,"Pappendorf",-14]
[39291,"Parchau",-14]
[19370,"Parchim",-14]
[14669,"Paretz",-14]
[39317,"Parey",-14]
[92331,"Parsberg/Oberfr.",-16]
[85599,"Parsdorf",-16]
[55288,"Partenheim",-12]
[19073,"Parum",-12]
[19243,"Parum",-12]
[4769,"Paschkowitz",-14]
[17309,"Pasewalk",-14]
["9403.","Passau",-14]
[18184,"Pastow",-10]
[30982,"Pattensen",-14]
[85307,"Paunzhausen",-16]
[7952,"Pausa",-16]
[1616,"Paußnitz",-16]
[91352,"Pautzfeld",-16]
[95701,"Pechbrunn",-18]
[8485,"Pechtelsgrün",-16]
[34439,"Peckelsheim",-14]
[4523,"Pegau",-14]
[91257,"Pegnitz",-16]
[1945,"Peickwitz",-16]
["3122.","Peine",-14]
[4460,"Peißen",-14]
[82380,"Peißenberg",-16]
[86971,"Peiting",-16]
[3185,"Peitz",-16]
[54331,"Pellingen",-12]
[25849,"Pellworm",-10]
[93482,"Pemfling",-18]
[17328,"Penkun",-14]
[82377,"Penzberg",-18]
[91126,"Penzendorf",-16]
[83547,"Penzing",-16]
[86929,"Penzing",-16]
[94366,"Perasdorf",-18]
[82319,"Perchting",-16]
[66706,"Perl",-12]
[94157,"Perlesreut",-18]
[71277,"Perouse",-16]
[91580,"Petersaurach",-16]
[36100,"Petersberg - Kaltenhof",-14]
[17268,"Petersdorf",-14]
[15236,"Petershagen",-16]
[15370,"Petershagen",-14]
[32469,"Petershagen",-12]
[85238,"Petershausen",-16]
[89423,"Peterswörth",-16]
[78112,"Peterzell",-16]
[96175,"Pettstadt",-16]
[31079,"Petze",-14]
[84066,"Pfaffenberg",-18]
[87772,"Pfaffenhausen",-16]
[74397,"Pfaffenhofen",-14]
[85235,"Pfaffenhofen",-16]
[85276,"Pfaffenhofen",-16]
[89284,"Pfaffenhofen",-16]
[76359,"Pfaffenrot",-14]
[79292,"Pfaffenweier",-14]
[79292,"Pfaffenweiler",-14]
[72119,"Pfäffingen",-16]
[9526,"Pfaffroda",-16]
[73479,"Pfahlheim",-16]
[56291,"Pfalzfeld",-14]
[72285,"Pfalzgrafenweiler",-16]
[84347,"Pfarrkirchen",-16]
[93102,"Pfatter",-18]
[67547,"Pfeddersheim",-12]
[74629,"Pfedelbach",-14]
[99869,"Pferdingsleben",-14]
[76327,"Pfinztal",-12]
[75334,"Pfinzweiler",-14]
[86926,"Pflaumdorf",-16]
[63762,"Pflaumheim",-14]
[86946,"Pflugdorf",-16]
[71636,"Pflugfelden",-12]
[78166,"Pfohren",-18]
["7517.","Pforzheim",-12]
[75181,"Pforzheim - Hohenwart",-14]
[75181,"Pforzheim - Huchenfeld",-14]
[83064,"Pfraundorf",-18]
[92536,"Pfreimd",-16]
[72074,"Pfrondorf",-16]
[72539,"Pfronstetten",-16]
[87459,"Pfronten",-18]
[88271,"Pfrungen",-14]
[89233,"Pfuhl",-14]
[88630,"Pfullendorf",-14]
[72793,"Pfullingen",-16]
[64319,"Pfungstadt",-12]
[76661,"Philippsburg",-12]
[94158,"Philippsreut",-18]
[36269,"Philippsthal",-14]
[83451,"Piding",-16]
[66809,"Piesbach",-12]
[83666,"Piesenkam",-18]
[54498,"Piesport",-10]
[75446,"Pinache",-14]
[25421,"Pinneberg",-12]
[91361,"Pinzberg",-16]
["6695.","Pirmasens",-12]
[1796,"Pirna",-14]
[1920,"Piskowitz",-16]
[83132,"Pittenhart",-16]
[56637,"Plaidt",-14]
[55545,"Planig",-12]
[68723,"Plankstadt",-12]
[8606,"Planschwitz",-16]
[19086,"Plate",-12]
[70794,"Plattenhardt",-14]
[94447,"Plattling",-18]
[19395,"Plau am See",-14]
[99338,"Plaue",-14]
[8527,"Plauen",-16]
[91287,"Plech",-16]
[74385,"Pleidelsheim",-12]
[91785,"Pleinfeld",-16]
[9246,"Pleißa",-14]
[4928,"Plessa",-16]
[58840,"Plettenberg",-12]
[85652,"Pliening",-16]
[72124,"Pliezhausen",-16]
[73207,"Plochingen",-16]
[8228,"Plohn",-16]
[24306,"Plön",-12]
[6667,"Plotha",-14]
[7907,"Plothen",-16]
[39245,"Plötzky",-14]
[73655,"Plüderhausen",-16]
[54316,"Pluwig",-12]
[9496,"Pobershau",-16]
[9509,"Pockau",-16]
[18516,"Poggendorf",-12]
[23896,"Poggensee",-12]
[19243,"Pogreß",-12]
[8543,"Pöhl",-16]
[1906,"Pohla",-16]
[8352,"Pöhla",-16]
[31867,"Pohle",-12]
[35415,"Pohlheim",-14]
[85586,"Poing",-16]
[18059,"Pölchow",-12]
[1844,"Polenz",-14]
[6408,"Poley",-14]
[54340,"Pölich",-10]
[92334,"Pollanten",-16]
[37647,"Polle",-12]
[6295,"Polleben",-14]
[82398,"Polling",-16]
[84570,"Polling",-16]
[92318,"Pölling",-16]
[91805,"Polsingen",-16]
[72119,"Poltringen",-16]
[19303,"Polz",-12]
[91224,"Pommelsbrunn",-14]
[39249,"Pömmelte",-14]
[96178,"Pommersfelden",-16]
[4668,"Pomßen",-14]
[4639,"Ponitz",-14]
[18184,"Poppendorf",-12]
[97490,"Poppenhausen",-16]
[92284,"Poppenricht",-16]
[71642,"Poppenweiler",-12]
[4769,"Poppitz",-14]
[94501,"Pörndorf",-16]
[1833,"Porschendorf",-14]
[52525,"Porselen",-10]
[32457,"Porta Westfalica",-12]
["506..","Porz",-10]
[8606,"Posseck",-18]
[97346,"Possenheim",-16]
[7381,"Pößneck",-14]
["1448.","Potsdam",-14]
[91278,"Pottenstein",-16]
[86554,"Pöttmes",-16]
[24253,"Prasdorf",-10]
[1594,"Prausitz",-16]
[24211,"Preetz",-10]
[3185,"Preilack",-16]
[17291,"Prenzlau",-14]
[18375,"Prerow",-10]
[4849,"Pressel",-14]
[96332,"Pressig",-16]
[91362,"Pretzfeld",-16]
[39245,"Pretzien",-14]
[6909,"Pretzsch",-14]
[1774,"Pretzschendorf",-16]
[97357,"Prichsenstadt",-16]
[83209,"Prien",-16]
[6909,"Priesitz",-14]
[4651,"Prießnitz",-14]
[4509,"Priester",-14]
[66620,"Primstal",-12]
[19300,"Prislich",-14]
[6667,"Prittitz",-14]
[86931,"Prittriching",-16]
[17440,"Pritzier",-12]
[24253,"Probsteierhagen",-10]
[7330,"Probstzella",-18]
[39264,"Prödel",-14]
[18455,"Prohn",-10]
[23968,"Proseken",-10]
[97279,"Prosselsheim",-14]
[15345,"Prötzel",-14]
[18356,"Pruchten",-10]
[54595,"Prüm",-14]
[83134,"Prutting",-16]
[82256,"Puch (Post FFB)",-16]
[92715,"Püchersreuth",-18]
[82178,"Puchheim",-16]
[52499,"Puffendorf",-12]
[50259,"Pulheim",-12]
[82049,"Pullach im Isartal",-16]
[1896,"Pulsnitz",-14]
[56862,"Pünderich",-12]
[86932,"Pürgen",-16]
[6925,"Purzien",-14]
[3159,"Pusack",-16]
[90617,"Puschendorf",-16]
[2699,"Puschwitz",-16]
[49479,"Püsselbüren",-12]
[1877,"Putzkau",-16]
[6484,"Quedlinburg",-14]
[66851,"Queidersbach",-12]
[6386,"Quellendorf",-14]
[6333,"Quenstedt",-14]
[37235,"Quentel",-14]
[77694,"Querbach",-12]
[4769,"Querbitzsch",-14]
[25451,"Quickborn Kr. Pinneberg",-12]
[25712,"Quickborn Post Burg",-10]
[66287,"Quierschied",-12]
[66909,"Quirnbach",-12]
[19065,"Raben Steinfeld",-12]
[1734,"Rabenau OT Spechttritz",-14]
[1920,"Rächelwitz",-16]
[2997,"Rachlau",-16]
[21449,"Radbruch",-12]
[3226,"Raddusch",-16]
[1454,"Radeberg",-14]
[1445,"Radebeul",-14]
[4509,"Radefeld",-14]
[89173,"Radelstetten",-16]
[42477,"Radevormwald",-12]
[2627,"Radibor",-16]
[36399,"Radmühl",-14]
[78315,"Radolfzell",-12]
[46348,"Raesfeld",-10]
[4668,"Ragewitz",-14]
[14806,"Ragösen",-14]
[6779,"Raguhn",-14]
[22147,"Rahlstedt",-12]
[12589,"Rahnsdorf",-14]
[72622,"Raidwangen",-16]
[86641,"Rain",-16]
[73492,"Rainau",-16]
[63679,"Rainrod",-12]
[9074,"Raitersaich",-16]
[18516,"Rakow",-12]
[1920,"Ralbitz",-16]
[54310,"Ralingen",-12]
[65207,"Rambach",-12]
[76857,"Ramberg",-12]
[23966,"Rambow",-12]
[83561,"Ramerberg",-16]
[53359,"Ramershoven",-14]
[31303,"Ramlingen",-14]
[77654,"Rammersweiler",-12]
[86871,"Rammingen",-16]
[89192,"Rammingen",-16]
[19067,"Rampe",-12]
[83486,"Ramsau",-18]
[91785,"Ramsberg",-16]
[46342,"Ramsdorf",-10]
[97236,"Randersacker",-14]
[72414,"Rangendingen",-16]
[15834,"Rangsdorf",-14]
[7389,"Ranis",-14]
[84428,"Ranoldsberg",-16]
[56235,"Ransbach-Baumbach",-14]
[76829,"Ranschbach",-12]
[63691,"Ranstadt",-12]
[25980,"Rantum/Sylt",-10]
[4420,"Räpitz",-14]
[17509,"Rappenhagen",-12]
[54497,"Rapperath",-14]
[8352,"Raschau",-16]
[76437,"Rastatt",-12]
[26180,"Rastede",-12]
[19077,"Rastow",-12]
[52385,"Rath",-14]
[41836,"Ratheim",-10]
[4657,"Rathendorf",-14]
[14712,"Rathenow",-14]
[91080,"Rathsberg",-16]
[16259,"Rathsdorf",-14]
["4088.","Ratingen",-10]
[72365,"Ratshausen",-18]
[83064,"Raubling",-18]
[69231,"Rauenberg",-12]
[35085,"Rauischholzhausen",-14]
[9366,"Raum",-16]
[65479,"Raunheim",-12]
[1920,"Rauschwitz",-16]
[31177,"Rautenberg",-14]
[38126,"Rautheim",-14]
["8821.","Ravensburg",-14]
[74747,"Ravenstein",-14]
[8209,"Rebesgrün",-16]
[53506,"Rech / Ahr",-14]
[73529,"Rechberg",-16]
[73098,"Rechberghausen",-16]
[76889,"Rechtenbach",-12]
[14778,"Reckahn",-14]
[49509,"Recke",-12]
[45665,"Recklinghausen",-10]
[4720,"Redemitz",-14]
[86316,"Rederzhausen",-16]
[23946,"Redewisch",-10]
[91126,"Rednitzhembach",-16]
[33014,"Reelsen",-14]
[46459,"Rees",-10]
[53427,"Refrath",-12]
[73495,"Regelsweiler",-16]
[94209,"Regen",-18]
[93197,"Regendorf",-16]
[93059,"Regensburg",-16]
[93128,"Regenstauf",-16]
[89165,"Regglisweiler",-16]
[4565,"Regis - Breitingen",-14]
[4565,"Regis-Breitingen",-14]
[95194,"Regnitzlosau",-18]
[95111,"Rehau",-18]
[55592,"Rehborn",-12]
[31547,"Rehburg",-14]
[1773,"Rehefeld",-16]
[25593,"Reher",-12]
[86508,"Rehling",-16]
[66780,"Rehlingen",-12]
[19217,"Rehna",-12]
[57462,"Rehringhausen",-14]
[6786,"Rehsen",-14]
[66907,"Rehweiler",-12]
[4509,"Reibitz",-14]
[74934,"Reichartshausen",-12]
[64385,"Reichelsheim",-14]
[61203,"Reichelsheim i. d. Wetterau",-12]
[1762,"Reichenau",-16]
[1936,"Reichenau",-16]
[2894,"Reichenbach",-16]
[73463,"Reichenbach",-16]
[77933,"Reichenbach",-14]
[78564,"Reichenbach",-18]
[97702,"Reichenbach",-14]
[99947,"Reichenbach",-14]
[73072,"Reichenbach (Donzdorf)",-16]
[73262,"Reichenbach an der Fils",-16]
[8468,"Reichenbach/Vogtland",-16]
[97234,"Reichenberg",-14]
[76593,"Reichental",-14]
[83677,"Reichersbeuern",-18]
[85293,"Reichertshausen",-16]
[86934,"Reichling",-16]
[51580,"Reichshof",-12]
[94428,"Reichstorf",-16]
[6116,"Reideburg",-14]
[66507,"Reifenberg",-12]
[9514,"Reifland",-16]
[74889,"Reihen",-14]
[56861,"Reil",-12]
[68799,"Reilingen",-12]
[86756,"Reimlingen",-16]
[21465,"Reinbek",-12]
[32609,"Reineberg",-12]
[23858,"Reinfeld",-12]
[1814,"Reinhardtsdorf",-16]
[1768,"Reinhardtsgrimma",-14]
[64354,"Reinheim",-14]
[9629,"Reinsberg",-14]
[6896,"Reinsdorf",-14]
[54421,"Reinsfeld",-14]
[88416,"Reinstetten",-16]
[94419,"Reisbach",-16]
[66793,"Reisbach-Labach",-12]
[86899,"Reisch",-16]
[85462,"Reisen",-16]
[89321,"Reisensburg",-16]
[35625,"Reiskirchen (Hüttenberg)",-14]
[83242,"Reit im Winkl",-18]
[94419,"Reith",-16]
[9249,"Reitzenhain",-14]
[48734,"Reken",-10]
[25462,"Rellingen",-12]
[53424,"Remagen",-12]
[75196,"Remchingen",-14]
[97280,"Remlingen",-14]
[72149,"Remmingsheim",-16]
["4285.","Remscheid",-12]
[8373,"Remse",-14]
[71686,"Remseck",-12]
[73630,"Remshalden",-14]
[77871,"Renchen",-12]
[61184,"Rendel",-12]
[24768,"Rendsburg",-10]
[72172,"Renfrizhausen",-16]
[37318,"Rengelrode",-16]
[36129,"Rengersfeld",-16]
[97980,"Rengershausen",-14]
[90602,"Rengersricht",-16]
[56579,"Rengsdorf",-12]
[56477,"Rennerod",-14]
[71272,"Renningen",-16]
[78603,"Renquishausen",-16]
[96184,"Rentweinsdorf",-14]
[45892,"Resse",-10]
[27336,"Rethem",-12]
[31319,"Rethmar",-14]
[18211,"Rethwisch",-10]
[24211,"Rethwisch",-12]
[89364,"Rettenbach",-16]
[87549,"Rettenberg",-18]
[69242,"Rettigheim",-12]
[69242,"Rettigheim",-12]
[17279,"Retzow",-14]
[97282,"Retzstadt",-14]
[77871,"Reuchen",-12]
[72622,"Reudern",-14]
[96158,"Reundorf",-16]
[96215,"Reundorf",-16]
[72119,"Reusten",-16]
[79276,"Reute",-12]
[88339,"Reute",-16]
[88441,"Reute",-16]
[17153,"Reuterstadt",-14]
[8496,"Reuth",-16]
[8538,"Reuth",-18]
[72275,"Reutin",-16]
[72760,"Reutlingen",-16]
[72766,"Reutlingen",-16]
[89233,"Reutti",-16]
[72160,"Rexingen",-16]
[33378,"Rheda-Wiedenbrück",-12]
[46414,"Rhede",-10]
[53859,"Rheidt",-12]
[68219,"Rheinau",-12]
[77866,"Rheinau",-12]
[77866,"Rheinau-Linx",-12]
[53359,"Rheinbach",-14]
[56154,"Rheinbay",-14]
[47495,"Rheinberg",-10]
[77866,"Rheinbischoffsheim",-12]
[55494,"Rheinböllen",-14]
[53619,"Rheinbreitbach",-12]
[56598,"Rheinbrohl",-12]
[41179,"Rheindahlen",-10]
[48429,"Rheine",-12]
[79618,"Rheinfelden",-12]
[67067,"Rheingönheim",-12]
[68794,"Rheinhausen",-12]
[79365,"Rheinhausen /Breisgau",-12]
[47169,"Rheinhausen/Niederrh.",-10]
[79790,"Rheinheim",-12]
["4744.","Rheinkamp",-10]
[77836,"Rheinmünster",-12]
[16831,"Rheinsberg",-14]
[76661,"Rheinsheim",-12]
[76287,"Rheinstetten",-12]
[79415,"Rheinweiler",-12]
[76764,"Rheinzabern",-12]
[56321,"Rhens",-12]
[47509,"Rheurdt",-10]
["4106.","Rheydt",-10]
[37434,"Rhumspringe",-16]
[18311,"Ribnitz-Damgarten",-10]
[79736,"Rickenbach",-14]
[99334,"Riechheim",-14]
[36157,"Ried",-16]
[68642,"Ried",-12]
[86510,"Ried ",-16]
[78176,"Riedböhringen",-16]
[70619,"Riedenberg",-14]
[93339,"Riedenburg",-16]
[72585,"Riederich",-16]
[83083,"Riedering",-18]
[79777,"Riedern",-14]
[78247,"Riedheim",-12]
[89340,"Riedheim",-16]
[94566,"Riedlhütte",-18]
[88499,"Riedlingen",-14]
[86637,"Riedsend",-16]
[64560,"Riedstadt",-12]
[79359,"Riegel",-12]
[78239,"Rielasingen-Worblingen",-12]
[71672,"Rielingshausen",-14]
[85521,"Riemerling",-14]
[97794,"Rieneck",-14]
["0159.","Riesa",-16]
[73469,"Riesbürg",-16]
[66509,"Rieschweiler-Mühlbach",-12]
[24354,"Rieseby",-10]
[48477,"Riesenbeck",-12]
[6786,"Riesigk",-14]
[49597,"Rieste",-12]
[55499,"Riesweiler",-14]
[33397,"Rietberg",-12]
[78604,"Rietheim-Weilheim",-18]
[99195,"Riethnordhausen",-14]
[2956,"Rietschen",-16]
[14778,"Riewend",-14]
[87567,"Riezlern",-20]
[84326,"Rimbach",-16]
[93485,"Rimbach",-18]
[64668,"Rimbach / Odw",-14]
[83253,"Rimsting",-16]
[94269,"Rinchnach",-18]
[73479,"Rindelbach",-16]
[53501,"Ringen",-14]
[46499,"Ringenberg",-10]
[1904,"Ringenhain",-16]
[9648,"Ringethal",-14]
[88605,"Ringgenbach",-14]
[72393,"Ringingen",-18]
[89155,"Ringingen",-14]
[88400,"Ringschnait",-16]
[77975,"Ringsheim",-12]
[48317,"Rinkerode",-12]
[31737,"Rinteln",-12]
[32676,"Rischenau",-14]
[88400,"Rißegg",-16]
[89584,"Rißtissen",-14]
[27721,"Ritterhude",-12]
[8355,"Rittersgrün",-18]
[35716,"Rittershausen",-14]
[67294,"Rittersheim",-12]
[37130,"Rittmarshausen",-16]
[4749,"Rittmitz",-14]
[23896,"Ritzerau",-12]
[89290,"Ritzisried",-16]
[9322,"Rochsburg",-14]
[6686,"Röcken",-14]
[35519,"Rockenberg",-14]
[92361,"Röckersbühl",-16]
[4808,"Röcknitz",-14]
[96476,"Rodach",-16]
[66976,"Rodalben",-12]
[64401,"Rodau",-14]
[17268,"Röddelin",-12]
[35066,"Röddenau",-14]
[56567,"Rodenbach",-12]
[63517,"Rodenbach",-12]
[67688,"Rodenbach",-12]
[31552,"Rodenberg",-14]
["5067.","Rodenkirchen",-10]
[1619,"Röderau",-16]
[63322,"Rödermark",-12]
[1561,"Rödern",-16]
[8538,"Rodersdorf",-16]
[31637,"Rodewald",-12]
[8228,"Rodewisch",-16]
[63110,"Rodgau",-12]
[4838,"Rödgen",-14]
[93142,"Roding",-16]
[93426,"Roding",-16]
[52445,"Rödingen",-12]
[32289,"Rödinghausen",-12]
[51709,"Rodt",-12]
[54313,"Rodt",-14]
[52159,"Roetgen/Eifel",-12]
[39326,"Rogätz",-14]
[89297,"Roggenburg",-16]
[17039,"Roggenhagen",-14]
[17252,"Roggentin",-14]
[18230,"Roggow",-10]
[73479,"Röhlingen",-16]
[70565,"Rohr",-14]
[91189,"Rohr",-16]
[71116,"Rohrau",-16]
[74889,"Rohrbach",-12]
[76865,"Rohrbach, Pfalz",-12]
[72184,"Rohrdorf",-16]
[72229,"Rohrdorf",-16]
[83101,"Rohrdorf",-18]
[88605,"Rohrdorf",-14]
[99310,"Röhrensee",-14]
[85244,"Röhrmoos",-16]
[1665,"Röhrsdorf",-14]
[9247,"Röhrsdorf",-14]
[31627,"Rohrsen",-12]
[38836,"Rohrsheim",-14]
[53332,"Roisdorf",-12]
[52152,"Rollesbroich",-14]
[23948,"Rolofshagen",-10]
[67354,"Römerberg",-12]
[72587,"Römerstein",-18]
[98631,"Römhild",-16]
[72768,"Rommelsbach",-16]
[71394,"Rommelshausen",-14]
[86500,"Rommelsried",-16]
[41569,"Rommerskirchen",-12]
[36119,"Rommerz",-14]
[63549,"Ronneburg",-12]
[30952,"Ronnenberg",-14]
[36217,"Ronshausen",-14]
[36124,"Rönshausen",-14]
[61191,"Rosbach v. d. Höhe",-14]
[37124,"Rosdorf",-16]
[21514,"Roseburg",-12]
[73494,"Rosenberg",-16]
[74749,"Rosenberg",-16]
[91622,"Rosenberg",-16]
[31840,"Rosenbusch",-14]
[48720,"Rosendahl-Osterwick",-10]
[72348,"Rosenfeld",-16]
[21224,"Rosengarten",-12]
["8302.","Rosenheim/Oberbay.",-16]
[17091,"Rosenow",-14]
[19205,"Rosenow",-12]
[1920,"Rosenthal",-16]
[35119,"Rosenthal-Roda",-14]
[4617,"Rositz",-14]
[51503,"Rösrath",-12]
[67752,"Roßbach",-12]
[94439,"Roßbach",-16]
[64380,"Roßdorf",-12]
[31171,"Rössing",-14]
[6862,"Roßlau",-14]
[6571,"Roßleben",-14]
[8527,"Rößnitz",-16]
[17322,"Rossow",-14]
[90574,"Roßtal",-16]
[71665,"Roßwag",-14]
[73061,"Roßwälden",-16]
[72336,"Roßwangen",-18]
[4741,"Roßwein",-14]
["1805.","Rostock",-10]
[88430,"Rot a.d. Rot",-16]
[74585,"Rot am See",-16]
[75394,"Rötenbach",-16]
[78733,"Rötenberg",-16]
[91154,"Roth",-16]
[4571,"Rötha",-14]
[37688,"Rothe",-14]
[7922,"Rothenacker",-18]
[56459,"Rothenbach",-14]
[1744,"Röthenbach",-16]
[90552,"Röthenbach",-16]
[64757,"Rothenberg",-14]
[63584,"Rothenbergen",-14]
[91284,"Rothenbruck",-16]
[91541,"Rothenburg ob der Tauber",-14]
[8237,"Rothenkirchen",-16]
[4924,"Rothstein",-16]
[95336,"Rothwind",-16]
[8468,"Rotschau",-16]
[52159,"Rott",-14]
[82216,"Rottbach",-16]
[99444,"Rottdorf",-14]
[6295,"Rottelsdorf",-14]
[89616,"Rottenacker",-14]
[91341,"Röttenbach",-16]
[97084,"Rottenbauer",-14]
[72108,"Rottenburg",-16]
[36275,"Rotterterode",-14]
[94094,"Rotthalmünster",-16]
[45884,"Rotthausen",-10]
[14793,"Rottstock",-14]
[78628,"Rottweil",-16]
[92444,"Rötz",-18]
[17094,"Rowa",-14]
[55595,"Roxheim",-12]
[56070,"Rübenach",-14]
[3238,"Rückersdorf",-16]
[24960,"Rüde",-10]
[73635,"Rudersberg",-14]
[15562,"Rüdersdorf",-14]
[94161,"Ruderting",-16]
[65385,"Rüdesheim",-12]
[91438,"Rüdisbronn",-16]
[7407,"Rudolstadt",-14]
[19069,"Rugensee",-12]
[23970,"Rüggow",-10]
[91622,"Rügland",-16]
[99842,"Ruhla",-16]
[1945,"Ruhland",-16]
[6917,"Ruhlsdorf",-14]
[79639,"Rührberg",-12]
[94099,"Ruhstorf",-16]
[26969,"Ruhwarden",-10]
[75015,"Ruit",-14]
[88512,"Rulfingen",-14]
[79595,"Rümmingen",-12]
[93486,"Runding",-18]
[65594,"Runkel/Lahn",-12]
[88448,"Rupertshofen",-16]
[56412,"Ruppach - Goldhausen",-14]
[56558,"Ruppenrod",-14]
[35325,"Ruppertenrod",-14]
[67152,"Ruppertsberg",-12]
[8435,"Ruppertsgrün",-16]
[8543,"Ruppertsgrün",-16]
[65779,"Ruppertshain",-14]
[73577,"Ruppertshofen",-16]
[66957,"Ruppertsweiler",-12]
[53809,"Ruppichteroth",-12]
[88410,"Rupprechts",-16]
[52152,"Rurberg",-14]
[55776,"Ruschberg",-14]
[65428,"Rüsselsheim",-12]
[91320,"Rüssenbach",-16]
[18230,"Russow",-10]
[79733,"Rüßwihl",-14]
[77977,"Rust",-12]
[71277,"Rutesheim",-14]
[67752,"Rutsweiler",-12]
[94339,"Rutzenbach",-18]
[18317,"Saal",-10]
[97633,"Saal a.d. Saale",-16]
[7318,"Saalfeld/Saale",-14]
[15806,"Saalow",-14]
[66115,"Saarbrücken",-12]
[54439,"Saarburg",-12]
[66701,"Saarfels",-12]
[66740,"Saarlouis",-12]
[14558,"Saarmund",-14]
[66793,"Saarwellingen",-12]
[32816,"Sabbenhausen",-14]
[98678,"Sachsenbrunn",-16]
[34513,"Sachsenhausen",-14]
[89537,"Sachsenhausen",-16]
[74343,"Sachsenheim",-12]
[83679,"Sachsenkam",-18]
[1561,"Sacka",-16]
[17099,"Sadelkow",-14]
[21493,"Sahms",-12]
[21272,"Sahrendorf",-14]
[74638,"Sailach",-16]
[73084,"Salach",-16]
[57290,"Salchendorf",-14]
[94330,"Salching",-18]
[94163,"Saldenburg",-16]
[88682,"Salem",-14]
[3238,"Sallgast",-16]
[72393,"Salmendingen",-18]
[54528,"Salmtal",-14]
[63628,"Salmünster",-14]
[97616,"Salz",-14]
[2627,"Salzenforst",-16]
[38226,"Salzgitter",-14]
[31020,"Salzhemmendorf",-14]
[33154,"Salzkotten",-12]
[72178,"Salzstetten",-16]
[29410,"Salzwedel",-14]
[94121,"Salzweg",-16]
[39326,"Samswegen",-14]
[34308,"Sand",-14]
[77731,"Sand",-12]
[39524,"Sandau",-14]
[16559,"Sandberge",-14]
[33106,"Sande",-12]
[6792,"Sandersdorf",-14]
[34266,"Sandershausen",-12]
[6456,"Sandersleben",-14]
[23898,"Sandesneben",-12]
[76532,"Sandweier ( Baden-Baden)",-12]
[6526,"Sangerhausen",-14]
[18190,"Sanitz",-12]
[37444,"Sankt Andreasberg",-16]
[53757,"Sankt Augustin",-12]
[79837,"Sankt Blasien",-16]
[21357,"Sankt Dionys",-12]
[78112,"Sankt Georgen",-16]
[56346,"Sankt Goarshausen",-12]
[66383,"Sankt Ingbert",-12]
[56727,"Sankt Johann",-14]
[72813,"Sankt Johann",-16]
[68789,"Sankt Leon-Rot",-12]
[79274,"Sankt Märgen",-18]
[9618,"Sankt Michaelis",-16]
[25826,"Sankt Peter-Ording",-10]
[66606,"Sankt Wendel",-12]
[23719,"Sarau",-12]
[2627,"Särka",-16]
[31157,"Sarstedt",-14]
[77880,"Sasbach",-12]
[79361,"Sasbach",-12]
[77887,"Sasbachwalden",-14]
[22395,"Sasel / Hamburg",-12]
[48336,"Sassenberg",-12]
[18546,"Saßnitz",-10]
[18239,"Satow",-12]
[74589,"Satteldorf",-16]
[82054,"Sauerlach",-16]
[88524,"Sauggart",-14]
[94344,"Saulburg",-18]
[88605,"Sauldorf",-14]
[88348,"Saulgau",-14]
[82442,"Saulgrub",-18]
[55291,"Saulheim",-12]
[64850,"Schaafheim",-14]
[78078,"Schabenhausen",-16]
[37318,"Schachtebich",-16]
[23795,"Schackendorf",-10]
[39343,"Schackensleben",-14]
[6449,"Schadeleben",-14]
[36358,"Schadges",-14]
[24980,"Schafflund",-10]
[71263,"Schafhausen",-16]
[76744,"Schaidt",-12]
[58579,"Schalckmühle",-12]
[96528,"Schalkau",-16]
[53426,"Schalkenbach",-14]
[58579,"Schalksmühle",-12]
[79227,"Schallstadt",-14]
[83547,"Schambach",-16]
[38162,"Schandelah",-14]
[77776,"Schapbach",-16]
["2368.","Scharbeutz",-10]
[1665,"Scharfenberg",-14]
[59929,"Scharfenberg",-14]
[33154,"Scharmede",-12]
[69168,"Schatthausen",-12]
[34270,"Schauenburg",-14]
[66919,"Schauerberg",-12]
[31737,"Schaumburg",-14]
[24960,"Schausende",-10]
[88239,"Schauwies",-16]
[83135,"Schechen",-16]
[73579,"Schechingen",-16]
[37127,"Scheden",-14]
[8056,"Schedewitz",-14]
[72516,"Scheer",-14]
[27383,"Scheeßel",-12]
[74850,"Schefflenz",-14]
[9481,"Scheibenberg",-16]
[4460,"Scheidens",-14]
[56379,"Scheidt",-12]
[91443,"Scheinfeld",-16]
[79235,"Schelingen",-12]
[89601,"Schelklingen",-16]
[75242,"Schellbronn",-14]
[1776,"Schellerhau",-16]
[31174,"Schellerten",-14]
[8301,"Schelma",-16]
[88433,"Schemmerberg",-16]
[88433,"Schemmerhofen",-16]
[22869,"Schenefeld",-10]
[4509,"Schenkenberg",-14]
[3172,"Schenkendöbern",-16]
[77773,"Schenkenzell",-14]
[36277,"Schenklengsfeld",-14]
[46514,"Schermbeck",-10]
[86872,"Scherstetten",-16]
[79238,"Scherzingen",-14]
[96110,"Scheßlitz",-16]
[53572,"Scheuren",-12]
[85298,"Scheyern",-16]
[32816,"Schieder-Schwalenberg",-14]
["652..","Schierstein",-12]
[27619,"Schiffdorf",-12]
[67105,"Schifferstadt",-12]
[3253,"Schilda",-16]
[4889,"Schildau",-16]
[16552,"Schildow",-14]
[91583,"Schillingsfürst",-16]
[74744,"Schillingstadt",-16]
[77761,"Schiltach",-16]
[2681,"Schirgiswalde",-16]
[4435,"Schkeuditz",-14]
[4420,"Schkölen",-14]
[6258,"Schkopau",-14]
[52372,"Schlagstein",-14]
[4749,"Schlagwitz",-14]
[72667,"Schlaitdorf",-16]
[33189,"Schlangen",-14]
[65388,"Schlangenbad",-14]
[29459,"Schlannau",-14]
[83259,"Schleching",-18]
[6785,"Schleesen",-14]
[54340,"Schleich",-10]
[52457,"Schleiden",-14]
[53937,"Schleiden",-14]
[53937,"Schleiden/Efel",-14]
[7907,"Schleiz",-16]
[24837,"Schleswig",-10]
[41470,"Schlicherum",-10]
[73614,"Schlichten",-16]
[4936,"Schlieben",-16]
[79418,"Schliengen",-12]
[88281,"Schlier",-14]
[63636,"Schlierbach",-14]
[74706,"Schlierstadt",-16]
[36110,"Schlitz",-14]
[7646,"Schlöben",-14]
[33758,"Schloß Holte",-12]
[33104,"Schloß Neuhaus",-12]
[30826,"Schloss Ricklingen",-14]
[73441,"Schloßberg",-16]
[9439,"Schlößchen",-14]
[99195,"Schloßvippach",-14]
[79859,"Schluchsee",-18]
[36381,"Schlüchtern",-14]
[32469,"Schlüsselburg",-12]
[96132,"Schlüsselfeld",-16]
[27804,"Schlüte",-10]
[76275,"Schluttenbach",-14]
[23992,"Schmakentin",-10]
[57392,"Schmallenberg",-14]
[6295,"Schmalzerode",-14]
[98530,"Schmeheim",-16]
[95336,"Schmeilsdorf",-16]
[66839,"Schmelz",-12]
[4895,"Schmerkendorf",-16]
[14776,"Schmerzke",-14]
[92546,"Schmidgaden",-16]
[52385,"Schmidt",-14]
[55758,"Schmidthachenbach",-14]
[53949,"Schmidtheim",-14]
[86511,"Schmiechen",-16]
[89601,"Schmiechen",-16]
[98711,"Schmiedefeld",-16]
[99518,"Schmiedehausen",-14]
[77971,"Schmieheim",-12]
[99094,"Schmira",-14]
[61389,"Schmitten",-16]
[17506,"Schmoldow",-12]
[4828,"Schmölen",-14]
[4626,"Schmölln",-14]
[17291,"Schmölln",-14]
[71384,"Schnait",-14]
[91220,"Schnaittach",-16]
[92253,"Schnaittenbach",-16]
[32609,"Schnathorst",-12]
[67699,"Schneckenhausen",-12]
[8289,"Schneeberg",-16]
[63936,"Schneeberg",-14]
[29465,"Schnega",-14]
[34286,"Schnellrode",-14]
[29640,"Schneverdingen",-14]
[96215,"Schney",-16]
[89194,"Schnürpflingen",-16]
[6179,"Schochwitz",-14]
[35641,"Schöffengrund",-14]
[27305,"Scholen",-12]
[76275,"Schöllbronn",-14]
[63825,"Schöllkrippen",-14]
[94508,"Schöllnach",-18]
[72290,"Schömberg",-14]
[72355,"Schömberg",-18]
[75328,"Schömberg",-16]
[4838,"Schöna",-14]
[71101,"Schönaich",-16]
[8121,"Schönau",-14]
[69250,"Schönau",-12]
[79677,"Schönau",-16]
[83471,"Schönau",-18]
[84337,"Schönau",-16]
[2708,"Schönbach",-16]
[8496,"Schönbach",-16]
[17349,"Schönbeck",-14]
[23923,"Schönberg",-10]
[94513,"Schönberg",-18]
[1465,"Schönborn",-14]
[56370,"Schönborn",-14]
[71557,"Schönbronn",-16]
[72218,"Schönbronn",-16]
[8485,"Schönbrunn",-16]
[8606,"Schönbrunn",-18]
[86938,"Schondorf",-16]
[7924,"Schöndorf",-16]
[39218,"Schönebeck/Elbe",-14]
[88477,"Schönebürg",-16]
[8261,"Schöneck",-18]
[61137,"Schöneck",-12]
[12529,"Schönefeld",-14]
[17291,"Schönermark",-14]
[9569,"Schönerstadt",-14]
[4703,"Schönerstädt",-14]
[86676,"Schönesberg",-16]
[19205,"Schönfeld",-12]
[8115,"Schönfels",-16]
[15326,"Schönfließ",-14]
[16567,"Schönfließ",-14]
[86956,"Schongau",-16]
[37170,"Schönhagen",-14]
[73574,"Schönhardt",-16]
[39524,"Schönhausen",-14]
[3130,"Schönheide",-16]
[8304,"Schönheide",-16]
[37170,"Schoningen",-14]
[38364,"Schöningen",-14]
[24232,"Schönkirchen",-10]
[16321,"Schönow",-14]
[92539,"Schönsee",-18]
[83137,"Schonstett",-16]
[74214,"Schöntal",-14]
[1471,"Schönteichen",-16]
[1920,"Schönteichen",-16]
[78141,"Schönwald",-18]
[14621,"Schönwalde",-14]
[23744,"Schönwalde a. B.",-12]
[79650,"Schopfheim",-12]
[72296,"Schopfloch",-16]
[67707,"Schopp",-12]
[38170,"Schöppenstedt",-14]
[37627,"Schorborn",-14]
[73614,"Schornbach",-16]
[93489,"Schorndorf",-18]
[73614,"Schorndorf - Buhlbronn",-16]
[73614,"Schorndorf - Haubersbronn",-16]
[73614,"Schorndorf- Schlichten",-16]
[73614,"Schorndorf/Württ.",-16]
[55288,"Schornsheim",-12]
[6369,"Schortewitz",-14]
[72355,"Schörzingen",-18]
[19073,"Schossin",-12]
[63679,"Schotten/Hessen",-12]
[4928,"Schraden",-16]
[78713,"Schramberg",-16]
[4720,"Schrebitz",-14]
[8233,"Schreiersgrün",-16]
[73479,"Schrezheim",-16]
[69198,"Schriesheim",-12]
[86529,"Schrobenhausen",-18]
[24850,"Schuby",-12]
[24790,"Schülldorf",-12]
[54586,"Schüller",-14]
[15732,"Schulzendorf",-14]
[77948,"Schuttern",-12]
[77978,"Schuttertal",-14]
[77746,"Schutterwald",-12]
[77746,"Schutterwald-Höfen",-12]
[53894,"Schützendorf",-14]
[18258,"Schwaan",-12]
[91126,"Schwabach",-16]
[74626,"Schwabbach",-14]
[55270,"Schwabenheim",-12]
[85247,"Schwabhausen",-16]
["7352.","Schwäbisch Gmünd",-16]
[74523,"Schwäbisch Hall",-16]
[86830,"Schwabmünchen",-16]
[86987,"Schwabsoien",-16]
[90571,"Schwaig",-16]
[74193,"Schwaigern",-14]
[87752,"Schwaighausen",-16]
[71409,"Schwaikheim",-14]
[65824,"Schwalbach",-14]
[66773,"Schwalbach",-12]
[72108,"Schwalldorf",-16]
[34613,"Schwalmstadt",-14]
[36318,"Schwalmtal",-14]
[41366,"Schwalmtal",-10]
[77963,"Schwanau",-12]
[8538,"Schwand",-16]
[8538,"Schwand",-16]
[90596,"Schwand",-16]
[92421,"Schwandorf",-16]
[14806,"Schwanebeck",-14]
[16341,"Schwanebeck",-14]
[41812,"Schwanenberg",-10]
[28790,"Schwanewede",-10]
[97523,"Schwanfeld",-14]
[87645,"Schwangau",-18]
[75334,"Schwann",-14]
[99195,"Schwansee",-14]
[90596,"Schwanstetten",-16]
[29690,"Schwarmstedt",-12]
[74869,"Schwarzach",-12]
[92548,"Schwarzach",-16]
[94491,"Schwarzach",-18]
[97359,"Schwarzach a. M.",-14]
[95126,"Schwarzenbach/Saale",-18]
[21493,"Schwarzenbek",-12]
[75328,"Schwarzenberg",-16]
[93458,"Schwarzenberg",-18]
[8340,"Schwarzenberg/Erzgeb.",-16]
[90592,"Schwarzenbruck",-16]
[92521,"Schwarzenfeld",-16]
[1987,"Schwarzenheide",-16]
[1987,"Schwarzheide",-16]
[2977,"Schwarzkollm",-16]
[24229,"Schwedeneck",-10]
[16303,"Schwedt/Oder",-16]
[67365,"Schwegenheim",-12]
[54338,"Schweich",-10]
[76889,"Schweigen",-12]
[77978,"Schweighausen",-14]
[76889,"Schweighofen",-12]
[9326,"Schweikertshain",-14]
[97421,"Schweinfurt",-14]
[88454,"Schweinhausen",-16]
[6928,"Schweinitz",-14]
[58332,"Schwelm",-12]
[88477,"Schwendi",-16]
[72477,"Schwenningen",-16]
[89443,"Schwenningen",-16]
["780..","Schwenningen/Neckar",-16]
[1936,"Schwepnitz",-16]
[53909,"Schwerfen",-14]
[15755,"Schwerin",-14]
["1906.","Schwerin",-12]
[99634,"Schwerstedt",-14]
[58239,"Schwerte/Ruhr",-12]
[6188,"Schwerz",-14]
[4769,"Schweta",-14]
[68723,"Schwetzingen",-12]
[71701,"Schwieberdingen",-14]
[71706,"Schwieberdingen",-14]
[86940,"Schwifting",-16]
[84419,"Schwindegg",-16]
[6295,"Schwittersdorf",-14]
[86754,"Schwörsheim",-16]
[79739,"Schwörstadt",-12]
[31311,"Schwüblingsen",-14]
[38179,"Schwülper",-14]
[96247,"Schwürbitz",-16]
[1855,"Sebnitz",-16]
[71566,"Sechselberg",-14]
[53332,"Sechtem",-12]
[74743,"Seckach",-14]
[14554,"Seddiner See",-14]
[77889,"Seebach",-16]
[17420,"Seebad Heringsdorf",-12]
[72108,"Seebronn",-16]
[83358,"Seebruck",-16]
[37136,"Seeburg",-16]
[39307,"Seedorf",-14]
[39319,"Seedorf",-14]
[78655,"Seedorf",-16]
[82229,"Seefeld",-16]
[6888,"Seegrehna",-14]
[39615,"Seehausen",-14]
[82418,"Seehausen",-16]
[64342,"Seeheim-Jugenheim",-12]
[77960,"Seelbach",-14]
[1909,"Seeligstadt",-14]
[4687,"Seeligstädt",-14]
[4769,"Seelitz",-14]
[9306,"Seelitz",-14]
[53819,"Seelscheid",-12]
[30926,"Seelze",-14]
[38723,"Seesen",-14]
[82402,"Seeshaupt",-16]
[86925,"Seestall",-16]
["212..","Seevetal",-12]
[21217,"Seevetal - Over",-12]
[72297,"Seewald",-16]
[79733,"Segeten",-16]
[31196,"Sehlem",-16]
[54518,"Sehlem",-14]
[9465,"Sehma",-16]
[31319,"Sehnde",-14]
[88410,"Seibranz",-16]
[9548,"Seiffen",-16]
[7389,"Seisla",-14]
[89143,"Seißen",-16]
[78606,"Seitingen - Oberflacht",-18]
[95100,"Selb",-18]
[52538,"Selfkant",-10]
[63500,"Seligenstadt",-12]
[98593,"Seligenthal",-16]
[24884,"Selk",-12]
[4626,"Selka",-14]
[18586,"Sellin",-10]
[27619,"Sellstedt",-12]
[59379,"Selm",-12]
[23923,"Selmsdorf",-10]
[27446,"Selsingen",-12]
[65618,"Selters",-14]
[55278,"Selzen",-12]
[48308,"Senden",-12]
[89259,"Senden",-16]
[48324,"Sendenhorst",-12]
[1968,"Senftenberg",-16]
[92369,"Sengenthal",-16]
[56820,"Senheim",-12]
[33659,"Senne I",-12]
[33102,"Sennelager",-12]
[6193,"Sennewitz",-14]
[97526,"Sennfeld",-14]
[15754,"Senzig",-14]
[4668,"Sermuth",-14]
[18292,"Serrahn",-12]
[75446,"Serres",-14]
[54455,"Serrig",-12]
[74372,"Sersheim",-12]
[16230,"Serwest",-14]
[56244,"Sessenhausen",-14]
[37124,"Settmarshausen",-16]
[92358,"Seubersdorf",-16]
[90556,"Seukendorf",-16]
[37136,"Seulingen",-16]
[79350,"Sexau",-14]
[31079,"Sibbesse",-14]
[72379,"Sickingen",-16]
[38173,"Sickte",-14]
[76833,"Siebeldingen",-12]
[9634,"Siebenlehn",-14]
[6308,"Siebigerode",-14]
[1920,"Siebitz",-16]
[17089,"Siedenbollentin",-14]
[35768,"Siegbach",-14]
[53721,"Siegburg",-12]
[74936,"Siegelsbach",-12]
["5707.","Siegen",-12]
[93354,"Siegenburg",-18]
["5384.","Sieglar",-12]
[6420,"Sieglitz",-14]
[83313,"Siegsdorf",-16]
[70794,"Sielmingen",-14]
[3055,"Sielow",-16]
[66780,"Siersburg",-12]
[52457,"Siersdorf",-12]
[29664,"Sieverdingen",-12]
[27607,"Sievern",-10]
[23936,"Sievershagen",-10]
[31275,"Sievershausen",-14]
[24885,"Sieverstedt",-10]
[19376,"Siggelkow",-14]
[72488,"Sigmaringen",-14]
[72517,"Sigmaringendorf",-14]
[72172,"Sigmarswangen",-16]
[37603,"Silberborn",-14]
[6493,"Silberhütte",-16]
[24887,"Silberstedt",-12]
[8121,"Silberstraße",-14]
[37345,"Silkerode",-16]
[94436,"Simbach",-16]
[91245,"Simmelsdorf",-16]
[52152,"Simmerath",-14]
[55469,"Simmern",-12]
[35713,"Simmersbach",-14]
[3149,"Simmersdorf",-16]
[72226,"Simmersfeld",-16]
[36115,"Simmershausen",-14]
[97215,"Simmershofen",-16]
[55618,"Simmertal",-14]
[75397,"Simmozheim",-16]
[79263,"Simonswald",-18]
[4720,"Simselwitz",-14]
[71063,"Sindelfingen",-14]
[82404,"Sindelsdorf",-18]
[75196,"Singen",-14]
[78224,"Singen",-14]
[99326,"Singen",-16]
["7820.","Singen-Hohentwiel",-14]
[50259,"Sinnersdorf",-12]
[74889,"Sinsheim",-12]
[21079,"Sinstorf (Hamburg)",-12]
[76545,"Sinzheim",-12]
[76547,"Sinzheim",-12]
[53489,"Sinzig",-12]
[67729,"Sippersfeld",-12]
[78354,"Sipplingen",-12]
[7557,"Sirbis",-14]
[72574,"Sirchingen",-16]
[23898,"Sirksfelde",-12]
[4703,"Sitten",-14]
[27419,"Sittensen",-12]
[4889,"Sitzenroda",-16]
[1561,"Skäßchen",-16]
[83139,"Söchtenau",-16]
[82319,"Söcking",-16]
[63834,"Soden",-14]
[59494,"Soest/Westf.",-12]
[89077,"Söflingen",-14]
[49751,"Sögel",-12]
[8626,"Sohl",-18]
[2689,"Sohland",-16]
[31185,"Söhlde",-14]
[31199,"Söhre",-14]
[44289,"Sölde",-12]
[79294,"Sölden",-16]
["426..","Solingen",-12]
[18445,"Solkendorf",-10]
[6774,"Söllichau",-14]
[76327,"Söllingen",-12]
[77836,"Söllingen",-12]
[2633,"Sollschwitz",-16]
[99759,"Sollstedt",-14]
[35606,"Solms",-12]
[29614,"Soltau",-12]
[99610,"Sömmerda",-14]
[72766,"Sondelfingen",-16]
[97255,"Sonderhofen",-16]
[99706,"Sondershausen",-14]
[94146,"Sonndorf",-18]
[96515,"Sonneberg",-16]
[32683,"Sonneborn",-14]
[31634,"Sonnenborstel",-12]
[72820,"Sonnenbühl",-18]
[3249,"Sonnenwalde",-16]
[47665,"Sonsbeck",-10]
[87776,"Sontheim",-16]
[89555,"Sontheim",-16]
[89567,"Sontheim",-16]
[4769,"Sornitz-Ablaß",-14]
[4769,"Sornzig",-14]
[4769,"Sornzig",-14]
[31134,"Sorsum",-14]
[24966,"Sörup",-10]
[8326,"Sosa",-16]
[27367,"Sottrum",-12]
[67620,"Soufflenheim (Frankreich)",-12]
[27619,"Spaden",-12]
[78549,"Spaichingen",-18]
[54529,"Spangdahlem",-14]
[34286,"Spangenberg",-14]
[95234,"Sparneck",-18]
[73066,"Sparwiesen",-16]
[82447,"Spatzenhausen",-16]
[56322,"Spay",-12]
[74937,"Spechbach",-12]
[16250,"Spechthausen",-14]
[34355,"Speele",-12]
[54662,"Speicher",-14]
[15848,"Speichrow",-16]
[48480,"Spelle",-12]
[32139,"Spenge",-12]
[41363,"Spenrath",-12]
[16348,"Sperlingsaue",-14]
[76275,"Spessart",-14]
[75365,"Speßhardt",-16]
[67346,"Speyer",-12]
[94518,"Spiegelau",-18]
[71579,"Spiegelberg",-14]
[52445,"Spiel",-12]
[74343,"Spielberg",-14]
[76307,"Spielberg",-14]
[55288,"Spiesheim",-12]
[2794,"Spitzkunnersdorf",-16]
[17039,"Sponholz",-14]
[46399,"Spork",-10]
[19372,"Spornitz",-14]
[73565,"Spraitbach",-16]
[29365,"Sprakensehl",-14]
[15528,"Spreenhagen",-14]
[3130,"Spremberg",-16]
[31832,"Springe",-14]
[45549,"Sprockhövel",-12]
[4838,"Sprotta",-14]
[96155,"Stackendorf",-16]
["2165.","Stade",-10]
[55271,"Stadecken - Elsheim",-12]
[61197,"Staden",-12]
[86946,"Stadl",-16]
[35260,"Stadtallendorf",-14]
[86391,"Stadtbergen",-16]
[99326,"Stadtilm",-14]
[54589,"Stadtkyll",-14]
[26953,"Stadtland",-10]
[97488,"Stadtlauringen",-16]
[48703,"Stadtlohn",-10]
[37627,"Stadtoldendorf",-14]
[97909,"Stadtprozelten",-14]
[7646,"Stadtroda",-14]
[96231,"Staffelstein",-16]
[96231,"Staffelstein",-16]
[88441,"Stafflangen",-16]
[76297,"Staffort",-12]
[37671,"Stahle",-12]
[56412,"Stahlhofen",-14]
[14532,"Stahnsdorf",-14]
[89195,"Staig",-16]
[75365,"Stammheim",-14]
[22145,"Stapelfeld",-12]
[82319,"Starnberg",-16]
[17252,"Starsow",-14]
[72181,"Starzach",-16]
[39418,"Staßfurt",-14]
[86316,"Stätzling",-16]
[86641,"Staudheim",-16]
[79219,"Staufen",-14]
[89428,"Staufen",-16]
[34355,"Staufenberg",-12]
[35460,"Staufenberg",-12]
[17039,"Staven",-14]
[56276,"Stebach",-14]
[75050,"Stebbach",-14]
[4936,"Stechau",-16]
[96135,"Stegaurach",-16]
[39517,"Stegelitz",-14]
[79252,"Stegen",-16]
[12163,"Steglitz",-14]
[88633,"Steigen",-14]
[31634,"Steimbke",-12]
[57614,"Steimel",-14]
[74196,"Stein am Kocher",-12]
[90547,"Stein b. Nbg.",-16]
[1920,"Steina",-16]
[4703,"Steina",-14]
[77790,"Steinach",-14]
[94377,"Steinach",-18]
[97708,"Steinach ",-14]
[36396,"Steinau a.d. Straße",-14]
[4567,"Steinbach",-14]
[9477,"Steinbach",-16]
[37308,"Steinbach",-16]
[66564,"Steinbach",-12]
[97900,"Steinbach",-14]
[61449,"Steinbach /Taunus",-14]
[36151,"Steinbach = Burghaun",-14]
[97500,"Steinbach bei Eltmann",-14]
[98587,"Steinbach-Hallenberg",-16]
[16259,"Steinbeck",-14]
[29646,"Steinbeck",-14]
[92449,"Steinberg",-16]
[82297,"Steindorf",-16]
[75242,"Steinegg",-14]
[79585,"Steinen",-12]
[71144,"Steinenbronn",-16]
[79395,"Steinenstadt",-12]
[49439,"Steinfeld",-12]
[97854,"Steinfeld",-14]
[65529,"Steinfischbach",-14]
[48565,"Steinfurt",-12]
[33803,"Steinhagen",-12]
[33142,"Steinhausen",-14]
[88416,"Steinhausen",-16]
[88427,"Steinhausen",-16]
[32839,"Steinheim",-14]
[87700,"Steinheim",-16]
[89555,"Steinheim",-16]
[71711,"Steinheim an der Murr",-12]
[72406,"Steinhofen",-18]
[29367,"Steinhorst",-14]
[31515,"Steinhude",-14]
[1904,"Steinigtwolmsdorf",-16]
[29416,"Steinitz",-14]
[39319,"Steinitz",-14]
[38275,"Steinlah",-14]
[76479,"Steinmauern",-12]
[17391,"Steinmocker",-12]
[8432,"Steinpleis (Werdau)",-16]
[8538,"Steins",-16]
[56379,"Steinsberg",-12]
[93128,"Steinsberg",-16]
[8547,"Steinsdorf",-16]
[97539,"Steinsfeld",-14]
[74889,"Steinsfurt",-12]
[76872,"Steinweiler, Pfalz",-12]
[21435,"Stelle",-12]
[7922,"Stelzen",-18]
[32351,"Stemwede",-12]
[39576,"Stendal",-14]
[16306,"Stendell",-14]
[8144,"Stenn",-14]
[4769,"Stennschütz",-14]
[46145,"Sterkrade",-10]
[46147,"Sterkrade",-10]
[19406,"Sternberg",-12]
[75447,"Sternenfels",-14]
[35094,"Sterzhausen",-12]
[70771,"Stetten",-14]
[72379,"Stetten",-16]
[78570,"Stetten",-16]
[78658,"Stetten",-16]
[87778,"Stetten",-16]
[88480,"Stetten",-16]
[72393,"Stetten ( Burladingen )",-18]
[72510,"Stetten am kalten Markt",-16]
[70771,"Stetten auf den Fildern",-14]
[86462,"Stettenhofen",-16]
[31593,"Steyerberg",-12]
[27476,"Stickenbüttel",-10]
[88167,"Stiefenhofen",-18]
[74597,"Stimpfach",-16]
[23795,"Stipsdorf",-10]
[72810,"Stockach",-16]
[85235,"Stockach",-16]
[82131,"Stockdorf",-16]
[23617,"Stockelsdorf",-12]
[52372,"Stockheim",-12]
[96342,"Stockheim",-16]
[37154,"Stöckheim",-16]
[79697,"Stockmatt",-16]
[71543,"Stocksberg",-14]
[31638,"Stöckse",-12]
[63811,"Stockstadt",-12]
[64589,"Stockstadt",-12]
[73495,"Stödtlen",-16]
[24321,"Stöfs",-10]
[6547,"Stolberg",-16]
[52222,"Stolberg",-12]
["5220.","Stolberg/Rheinl.",-12]
[9366,"Stollberg",-14]
[52224,"Stollberg - Werth",-12]
[77836,"Stollhofen",-12]
[1833,"Stolpen",-14]
[17309,"Stolzenburg",-14]
[16348,"Stolzenhagen",-14]
[4916,"Stolzenhain",-14]
[50259,"Stommeln",-12]
[31167,"Störy",-14]
[91793,"Störzelbach",-16]
[87675,"Stötten",-16]
[87677,"Stöttwang",-16]
[53881,"Stotzheim",-14]
[6896,"Straach",-14]
[41542,"Straberg",-10]
[47638,"Straelen",-10]
[2747,"Strahwalde",-16]
[19073,"Stralendorf",-12]
["1840.","Stralsund",-10]
[8527,"Straßberg",-16]
[72479,"Straßberg",-16]
[73529,"Straßdorf",-16]
[56587,"Straßenhaus",-14]
[1936,"Strassgräbchen",-16]
[94342,"Straßkirchen",-18]
[75334,"Straubenhardt",-14]
["9430.","Straubing",-18]
[15913,"Straupitz",-16]
[15344,"Strausberg",-14]
[1616,"Strehla",-16]
[72336,"Streichen",-18]
[54597,"Strickscheid",-14]
[9661,"Striegistal",-14]
[3046,"Ströbitz",-16]
[4703,"Strocken",-14]
[77723,"Strohbach",-14]
[4720,"Strölla",-14]
[83489,"Strub",-16]
[96129,"Strullendorf",-16]
[71384,"Strümpfelbach",-14]
[69429,"Strümpfelbrunn",-14]
[1796,"Struppen",-14]
[17459,"Stubbenfelde",-12]
[96231,"Stublang",-16]
[79778,"Stühlingen",-14]
[28816,"Stuhr",-12]
[27211,"Stühren",-12]
[33758,"Stukenbrock",-12]
[76228,"Stupferich",-12]
[76297,"Stutensee",-12]
["7....","Stuttgart",-12]
[8328,"Stützengrün",-16]
[41749,"Süchteln",-10]
[18273,"Suckow",-12]
[26203,"Süd Moslesfehn",-12]
[26624,"Südbrookmerland",-10]
[24392,"Süderbrarup",-10]
[29556,"Suderburg",-12]
[18516,"Süderholz",-12]
[24885,"Süderschmedeby",-10]
[59394,"Südkirchen",-12]
[46354,"Südlohn",-10]
[98527,"Suhl",-16]
[98529,"Suhl",-16]
["9850.","Suhl",-16]
[23845,"Sülfeld",-12]
[38442,"Sülfeld",-14]
[78713,"Sulgen",-16]
[27232,"Sulingen",-12]
[88437,"Sulmingen",-16]
[72218,"Sulz",-16]
[77933,"Sulz",-12]
[72172,"Sulz am Neckar",-16]
[63834,"Sulzbach",-12]
[76316,"Sulzbach",-12]
[86551,"Sulzbach",-16]
[74429,"Sulzbach - Laufen",-16]
[92237,"Sulzbach - Rosenberg",-16]
[66280,"Sulzbach/Saar",-12]
[65843,"Sulzbach/Taunus",-14]
[71560,"Sulzbach-Murr",-14]
[79295,"Sulzburg",-14]
[97528,"Sulzdorf an der Lederhecke",-16]
[85254,"Sulzemoos",-16]
[97262,"Sulzwiesen",-14]
[93104,"Sünching",-18]
[59846,"Sundern",-14]
[39343,"Süplingen",-14]
[89150,"Suppingen",-16]
[4860,"Süptitz",-16]
[24229,"Surendorf",-10]
[3226,"Suschow",-16]
[73079,"Süßen",-16]
[83250,"Süssen",-18]
[21398,"Süttorf",-12]
[53913,"Swisttal",-14]
[16230,"Sydower Fließ",-14]
[28857,"Syke",-12]
[6333,"Sylda",-14]
[89428,"Syrgenstein",-16]
[72348,"Täbingen",-16]
[73527,"Täferrot",-16]
[86356,"Täfertingen",-16]
[71126,"Tailfingen",-16]
[72461,"Tailfingen",-18]
[69242,"Tairnbach",-12]
[88696,"Taisersdorf",-14]
[74541,"Talberg",-16]
[72116,"Talheim",-18]
[74388,"Talheim",-12]
[78607,"Talheim",-18]
[71732,"Tamm",-12]
[39590,"Tangermünde",-14]
[36251,"Tann",-14]
[36142,"Tann/Rhön",-16]
[38875,"Tanne",-16]
[79400,"Tannenkirch",-12]
[92723,"Tännesberg",-18]
[88459,"Tannheim",-16]
[54296,"Tarforst",-12]
[27412,"Tarmstedt",-12]
[1906,"Taschendorf",-16]
[25881,"Tating",-10]
[2991,"Tätschwitz",-16]
[97941,"Tauberbischofsheim",-14]
[85114,"Tauberfeld",-16]
[97285,"Tauberrettersheim",-16]
[4425,"Taucha",-14]
[82024,"Taufkirchen",-16]
[84574,"Taufkirchen",-16]
[84416,"Taufkirchen / Vils",-16]
[65232,"Taunusstein",-14]
[1561,"Tauscha",-16]
[54456,"Tawern",-12]
[85235,"Taxa",-16]
[19288,"Techentin",-14]
[2625,"Technitz",-16]
[49545,"Tecklenburg",-12]
[93105,"Tegernheim",-16]
[4617,"Tegkwitz",-14]
[7407,"Teichröda",-14]
[83317,"Teisendorf",-16]
[84579,"Teising",-16]
[94241,"Teisnach-Arnetsried",-18]
[37339,"Teistungen",-16]
[48291,"Telgte",-12]
[56858,"Tellig",-14]
[14513,"Teltow",-14]
[89160,"Temmenhausen",-16]
[16230,"Tempelfelde",-14]
[17268,"Templin",-14]
[32609,"Tengern",-12]
[79331,"Teningen",-12]
[78144,"Tennenbronn",-16]
[3139,"Terpe",-16]
[67806,"Teschenmoschel",-12]
[19243,"Tessin",-12]
[17166,"Teterow",-12]
[88069,"Tettnang",-14]
[92552,"Teunz",-18]
[15755,"Teupitz",-14]
[96358,"Teuschnitz",-18]
[32689,"Tevenhausen",-14]
[86943,"Thaining",-16]
[36157,"Thalau",-16]
[7616,"Thalbürgel",-14]
[6502,"Thale",-14]
[54424,"Thalfang",-14]
[83629,"Thalham",-18]
[94405,"Thalham",-18]
[9380,"Thalheim",-14]
[86657,"Thalheim",-16]
[66871,"Thallichtenberg",-14]
[4808,"Thallwitz",-14]
[91177,"Thalmässing",-16]
[99947,"Thamsbrück",-14]
[72406,"Thanheim",-18]
[86470,"Thannhausen",-16]
[83101,"Thansau",-16]
[33739,"Theesen",-12]
[39291,"Theeßen",-14]
[97711,"Theinfeld",-16]
[66871,"Theisbergstegen",-12]
[97531,"Theres",-14]
[57368,"Theten",-14]
[92245,"Theuern",-16]
[1561,"Thiendorf",-16]
[4567,"Thierbach",-14]
[86672,"Thierhaupten",-16]
[6888,"Thießen",-14]
[66636,"Tholey",-12]
[96369,"Thonberg",-16]
[29308,"Thören",-12]
[54340,"Thörnich",-12]
[8538,"Thossen",-18]
[4552,"Thräna",-14]
[4683,"Threna",-14]
[97723,"Thulba",-14]
[33154,"Thüle",-12]
[9419,"Thum",-14]
[4668,"Thümmlitzwalde",-14]
[92703,"Thumsenreuth",-16]
[97711,"Thundorf",-16]
[56743,"Thür",-14]
[94169,"Thurmannsbang",-18]
[76684,"Tiefenbach",-12]
[88422,"Tiefenbach",-16]
[89257,"Tiefenbach",-16]
[94113,"Tiefenbach",-16]
[55471,"Tiefenbach, Hunsrück",-14]
[75233,"Tiefenbronn",-14]
[8626,"Tiefenbrunn ü. Adorf/Vogtland",-18]
[79862,"Tiefenhäusern",-16]
[16259,"Tiefensee",-14]
[77704,"Tiergarten",-14]
[72469,"Tieringen",-18]
[37688,"Tietelsen",-14]
[37115,"Tiftlingerode",-16]
[24644,"Timmaspe",-12]
[26629,"Timmel",-10]
[23669,"Timmendorfer Strand",-10]
[25917,"Tinningstedt",-10]
[7546,"Tinz",-14]
[8606,"Tirpersdorf",-16]
[95643,"Tirschenreuth",-18]
[72636,"Tischardt",-16]
[79822,"Titisee-Neustadt",-18]
[94104,"Tittling",-16]
[84529,"Tittmoning",-16]
[52445,"Titz",-12]
[8538,"Tobertitz",-16]
[19230,"Toddin",-12]
[79682,"Todtmoos",-16]
[79674,"Todtnau",-16]
[84513,"Töging",-16]
[4720,"Töllschütz",-14]
[6231,"Tollwitz",-14]
[47918,"Tönisvorst",-10]
[99958,"Tonna",-14]
[15755,"Töpchin",-14]
[9306,"Topfseifersdorf",-14]
[4860,"Torgau",-16]
[17192,"Torgelow",-12]
[88212,"Torkenweiler",-14]
[6774,"Tornau",-14]
[25436,"Tornesch",-10]
[39249,"Tornitz",-14]
[2991,"Torno",-16]
[16230,"Tornow",-14]
[21255,"Tostedt",-12]
[56841,"Traben - Trarbach",-12]
[96257,"Trainau",-16]
[17449,"Trassenheide",-12]
[92283,"Traunfeld",-16]
[83278,"Traunstein",-16]
[4749,"Trebanitz",-14]
[14959,"Trebbin",-14]
[4617,"Treben",-14]
[2959,"Trebendorf",-16]
[14822,"Trebitz",-14]
[19249,"Trebs",-12]
[92699,"Trebsau",-16]
[89558,"Treffelhausen",-16]
[34388,"Trendelburg",-14]
[15236,"Treplin",-14]
[74906,"Treschklingen",-14]
[8233,"Treuen",-16]
[1561,"Treugeböhla",-16]
[34613,"Treysa",-14]
[78098,"Triberg",-18]
[8606,"Triebel",-18]
[97855,"Triefenstein",-14]
[54294,"Trier",-10]
[54311,"Trierweiler",-12]
[84371,"Triftern",-16]
[72401,"Trillfingen",-16]
[67705,"Trippstadt",-12]
[7819,"Triptis",-14]
[54349,"Trittenheim",-10]
[3253,"Tröbitz",-16]
[72818,"Trochtelfingen",-18]
[95183,"Trogen",-18]
[6729,"Tröglitz",-14]
[53840,"Troisdorf",-12]
[91793,"Trommertsheim",-16]
[4880,"Trossin",-16]
[78647,"Trossingen",-18]
[98646,"Trostadt",-16]
[81825,"Trudering",-16]
[66957,"Trulben",-12]
[87779,"Trunkelsberg",-16]
[8428,"Trunzig",-14]
[98596,"Trusetal",-16]
[34613,"Trutzhain",-14]
[3130,"Tschernitz",-16]
["7207.","Tübingen",-16]
[39407,"Tucheim",-14]
[90587,"Tuchenbach",-16]
[52538,"Tüddern",-10]
["795..","Tüllingen",-12]
[99947,"Tüngeda",-14]
[78609,"Tuningen",-18]
[79189,"Tunsel",-14]
[83104,"Tuntenhausen",-16]
[99610,"Tunzenhausen",-14]
[82299,"Türkenfeld",-16]
[73312,"Türkheim",-16]
[86842,"Türkheim",-16]
[66625,"Türkismühle",-14]
[3185,"Turnow",-16]
[29482,"Tüschau",-14]
[84577,"Tüßling",-16]
[84577,"Tüssling",-16]
[78532,"Tuttlingen",-16]
[17091,"Tützpatz",-14]
[49767,"Twist",-10]
[27239,"Twistringen",-12]
[52531,"Übach-Palenberg",-12]
[82216,"Überacker",-16]
[86641,"Überacker",-16]
[87463,"Überbach",-16]
[88662,"Überlingen",-12]
[83236,"Übersee",-16]
[76698,"Ubstadt",-12]
[31600,"Uchte",-12]
[97532,"Üchtelhausen",-16]
[39599,"Uchtspringe",-14]
[45886,"Ückendorf",-10]
[53773,"Uckerath",-12]
[37318,"Uder",-16]
[4938,"Uebigau",-16]
[17373,"Ueckermünde",-12]
[47589,"Uedem",-10]
[91486,"Uehlfeld",-16]
[49843,"Uelsen",-10]
[29525,"Uelzen",-14]
[59071,"Uentrop",-12]
[25436,"Uetersen",-10]
[31311,"Uetze",-14]
[97215,"Uffenheim",-16]
[82449,"Uffing",-16]
[73066,"Uhingen",-16]
[70329,"Uhlbach",-12]
[88690,"Uhldingen - Mühlhofen",-12]
[79777,"Ühlingen",-14]
[7407,"Uhlstätt Kirchhasel",-14]
[2999,"Uhyst",-16]
[88527,"Uingendorf",-14]
[32584,"Ulenburg",-12]
[2906,"Ullersdorf",-16]
[77871,"Ulm",-12]
["8907.","Ulm/Donau",-14]
[66887,"Ulmet",-14]
[6543,"Ulzigerode",-14]
["33...","Ummeln",-12]
[39365,"Ummendorf",-14]
[88444,"Ummendorf",-16]
[55278,"Undenheim",-12]
[53572,"Unkel",-12]
[88527,"Unlingen",-14]
["5942.","Unna",-12]
[69518,"Unterabtsteinach",-12]
[79774,"Unteralpfen",-14]
[82497,"Unterammergau",-18]
[78073,"Unterbaldingen",-16]
[89437,"Unterbechingen",-16]
[86657,"Unterbissingen",-16]
[86944,"Unterdiessen",-16]
[87782,"Unteregg",-16]
[97247,"Untereisenheim",-14]
[74257,"Untereisesheim",-12]
[72669,"Unterensingen",-14]
[77736,"Unterentersbach",-14]
[88454,"Unteressendorf",-16]
[82393,"Untereurach",-18]
[89278,"Unterfalheim",-14]
[74924,"Untergimpern",-12]
[94107,"Untergriesbach",-18]
[74177,"Untergriesheim",-12]
[76646,"Untergrombach",-12]
[73453,"Untergröningen",-16]
[74199,"Untergruppenbach",-12]
[96173,"Unterhaid",-16]
[91227,"Unterhaidelbach",-16]
[75378,"Unterhaugstett ( Bad Liebenzell )",-14]
[72805,"Unterhausen",-18]
[74199,"Unterheinriet",-14]
[79256,"Unteribental",-18]
[97340,"Unterickelsheim",-16]
[72070,"Unterjesingen",-16]
[71131,"Unterjettingen",-16]
[6721,"Unterkaka",-14]
[89171,"Unterkirchberg",-16]
[89331,"Unterknöringen",-16]
[75394,"Unterkollbach",-16]
[7922,"Unterkoskau",-16]
[75328,"Unterlengenhardt",-16]
[73252,"Unterlenningen",-16]
[85410,"Untermarchenbach",-16]
[91171,"Untermässing",-16]
[86836,"Untermeitingen",-16]
[86929,"Untermühlhausen",-16]
[74547,"Untermünkheim",-16]
[79244,"Untermünstertal",-18]
[76703,"Unteröwisheim",-12]
[82110,"Unterpfaffenhofen",-16]
[86871,"Unterrammingen",-16]
[75339,"Unterreichenbach",-14]
[83567,"Unterreit",-16]
[89299,"Unterroth",-16]
[85716,"Unterschleißheim",-16]
[73485,"Unterschneidheim",-16]
[74869,"Unterschwarzach",-12]
[88410,"Unterschwarzach",-16]
[96253,"Untersiemau",-14]
[82395,"Untersöchering",-16]
[74423,"Untersontheim",-16]
[89619,"Unterstadion",-14]
[96154,"Untersteinach",-16]
[74629,"Untersteinbach",-16]
[88471,"Untersulmetingen",-16]
[72160,"Untertalheim",-16]
[70327,"Untertürkheim",-12]
[97654,"Unterwaldbehrungen",-16]
[79780,"Unterwangen",-14]
[98634,"Unterweid",-16]
[71554,"Unterweissach",-14]
[86519,"Unterwiesenbach",-16]
[83246,"Unterwössen",-16]
[87496,"Untrasried",-16]
[23936,"Upahl",-10]
[72813,"Upfingen",-18]
[73660,"Urbach",-16]
[99765,"Urbach",-14]
["5....","Urbach",-12]
[56182,"Urbar",-12]
[50389,"Urfeld",-12]
[77767,"Urloffen",-12]
[88693,"Urnau",-14]
[86513,"Ursberg",-16]
[91710,"Ursberg",-16]
[61250,"Usingen",-14]
[37170,"Uslar",-14]
[88524,"Uttenweiler",-14]
[54619,"Üttfeld",-14]
[86919,"Utting/Ammersee",-16]
[97292,"Üttingen",-12]
[79694,"Utzenfeld",-16]
[73469,"Utzmemmingen",-16]
[73577,"Utzstetten",-16]
[54579,"Üxheim",-14]
[90768,"Vach",-16]
[98617,"Vachdorf",-16]
[83620,"Vagen",-18]
[70563,"Vaihingen",-14]
[71665,"Vaihingen an der Enz",-14]
[56179,"Vallendar",-14]
[33397,"Varensell",-12]
[76534,"Varnhalt",-14]
[34519,"Vasbeck",-14]
[38159,"Vechelde",-14]
[49377,"Vechta",-12]
[38871,"Veckenstedt",-14]
[16866,"Vehlow",-14]
[90587,"Veitsbronn",-16]
[42549,"Velbert",-12]
[42553,"Velbert (Neviges)",-12]
[92355,"Velburg",-16]
[91235,"Velden",-16]
[84149,"Velden/Vils",-16]
[46342,"Velen",-10]
[34246,"Vellmar",-14]
[16727,"Velten",-14]
[55578,"Vendersheim",-12]
[67482,"Venningen",-12]
[27283,"Verden",-12]
[72519,"Veringenstadt",-16]
[33415,"Verl",-12]
[33775,"Versmold",-12]
[3226,"Vetschau",-16]
[53560,"Vettelschoß",-12]
[52391,"Vettweiß",-12]
[84174,"Viecht",-16]
[94234,"Viechtach",-18]
[8149,"Vielau",-14]
[16835,"Vielitz",-14]
[38690,"Vienenburg",-14]
[2894,"Vierkirchen",-16]
[68519,"Viernheim",-12]
[17509,"Vierow",-12]
[16306,"Vierraden",-16]
["417..","Viersen",-10]
[19230,"Viez",-12]
[86946,"Vilgertshofen",-16]
[86637,"Villenbach",-16]
["7805.","Villingen/Schwarzw.",-16]
[78667,"Villingendorf",-16]
[84149,"Vils",-16]
[84137,"Vilsbiburg",-16]
[92249,"Vilseck",-16]
[84186,"Vilsheim",-16]
[94474,"Vilshofen",-16]
[72514,"Vilsingen",-16]
[66957,"Vinningen",-12]
[32839,"Vinsebeck",-14]
[39599,"Vinzelberg",-14]
[56729,"Virneburg",-14]
[53909,"Virnich",-14]
[18565,"Vitte/Hiddensee",-10]
[32602,"Vlotho",-12]
[47506,"Vluyn",-10]
[6786,"Vockerode",-14]
[46562,"Voerde/Niederrhein",-10]
[37574,"Vogelbeck",-16]
[4880,"Vogelgesang",-16]
[99610,"Vogelsberg",-14]
[8209,"Vogelsgrün zw.Auerbach/Schönheide",-16]
[79379,"Vögisheim",-12]
[88267,"Vogt",-16]
[83569,"Vogtareuth",-16]
[79235,"Vogtsburg",-12]
[85088,"Vohburg",-18]
[34516,"Vöhl",-14]
[72189,"Vöhringen",-16]
[89269,"Vöhringen",-16]
[72189,"Vöhringen-Wittershausen",-16]
[97332,"Volkach",-14]
[37124,"Volkerode",-14]
[37308,"Volkerode",-16]
[76316,"Völkersbach",-14]
[76857,"Völkersweiler",-12]
[78269,"Volkertshausen",-14]
[66333,"Völklingen",-12]
[6295,"Volkstedt",-14]
[25836,"Vollerwiek",-10]
[72202,"Vollmaringen",-16]
[34253,"Vollmarshausen",-14]
[74736,"Vollmersdorf",-14]
[35625,"Vollnkirchen",-14]
[58300,"Volmastein",-12]
[39393,"Völpke",-14]
[41179,"Voosen",-10]
[18258,"Vorbeck",-12]
[37696,"Vörden",-14]
[49434,"Vörden",-12]
[25554,"Vorder Neuendorf",-10]
[57271,"Vormwald",-14]
[91247,"Vorra",-16]
[38440,"Vorsfelde",-14]
[47918,"Vorst",-10]
[79279,"Vörstetten",-12]
[37632,"Vorwohle",-14]
[48691,"Vreden",-10]
[37136,"Waake",-16]
[83666,"Waakirchen",-18]
[86875,"Waal",-16]
[34590,"Wabern",-14]
[1454,"Wachau",-14]
[97980,"Wachbach",-16]
[53894,"Wachendorf",-14]
[72181,"Wachendorf",-16]
[67157,"Wachenheim",-12]
[53343,"Wachtberg",-14]
[47669,"Wachterdonk",-10]
[63607,"Wächtersbach",-14]
[1306,"Wachwitz",-14]
[25596,"Wacken",-12]
[55263,"Wackernheim",-12]
[92442,"Wackersdorf",-16]
[66687,"Wadern",-12]
[59329,"Wadersloh",-12]
[66787,"Wadgassen",-12]
[66687,"Wadrill",-14]
[49419,"Wagenfeld",-12]
[74838,"Wagenschwend",-14]
[79336,"Wagenstadt",-12]
[68753,"Waghäusel",-12]
[37194,"Wahlsburg",-12]
[4924,"Wahrenbrück",-16]
[23923,"Wahrsow",-10]
[18059,"Wahrstorf",-12]
["7133.","Waiblingen",-12]
[74915,"Waibstadt",-12]
[92726,"Waidhaus",-18]
[97797,"Waizenbach",-14]
[24558,"Wakendorf",-12]
[39356,"Walbeck",-14]
[53332,"Walberberg",-12]
[88639,"Walbertsweiler",-14]
[37235,"Walburg",-14]
[94501,"Walchsing",-16]
[53902,"Wald",-14]
[88639,"Wald",-14]
[93192,"Wald",-16]
[72178,"Waldachtal",-16]
[55425,"Waldalgesheim",-14]
[74889,"Waldangelloch",-12]
[74626,"Waldbach",-14]
[51545,"Waldbröl",-12]
[76337,"Waldbronn",-14]
[69429,"Waldbrunn",-14]
[97295,"Waldbrunn",-14]
[88287,"Waldburg",-14]
[88289,"Waldburg",-14]
[97297,"Waldbüttelbrunn",-14]
[72213,"Walddorf",-16]
[72141,"Walddorfhäslach",-16]
[34513,"Waldeck/Hessen",-14]
[65529,"Waldems",-14]
[71111,"Waldenbuch",-16]
[8396,"Waldenburg",-14]
[74638,"Waldenburg",-16]
[52525,"Waldenrath",-10]
[6844,"Waldersee",-14]
[52525,"Waldfeucht",-10]
[67714,"Waldfischbach",-12]
[35633,"Waldgirmes",-12]
[4736,"Waldheim",-14]
[69151,"Waldhilsbach",-12]
[37284,"Waldkappel",-14]
[79183,"Waldkirch",-14]
[8485,"Waldkirchen",-16]
[84478,"Waldkraiburg",-16]
[55444,"Waldlaubersheim",-12]
[69483,"Wald-Michelbach",-12]
[66914,"Waldmohr",-12]
[78713,"Waldmössingen",-16]
[74842,"Waldmühlbach",-14]
[53498,"Waldorf",-14]
[54320,"Waldrach",-12]
[71522,"Waldrems",-14]
[75305,"Waldrennach",-14]
[8393,"Waldsachsen",-14]
[67165,"Waldsee",-12]
[79761,"Waldshut - Tiengen",-12]
[35647,"Waldsolms",-14]
[4821,"Waldsteinberg",-14]
[73550,"Waldstetten",-16]
[74931,"Waldwimmersbach",-12]
[74399,"Walheim",-12]
[64546,"Walldorf",-12]
[69190,"Walldorf",-12]
[74731,"Walldürn",-16]
[49134,"Wallenhorst",-12]
[94522,"Wallersdorf",-18]
[86757,"Wallerstein",-16]
[55578,"Wallertheim",-12]
[82499,"Wallgau",-18]
[66917,"Wallhalben",-12]
[74599,"Wallhausen",-16]
[65510,"Wallrabenstein",-14]
[6193,"Wallwitz",-14]
[88487,"Walpertshofen",-16]
[85469,"Walpertskirchen",-16]
[29664,"Walsrode",-12]
["4716.","Walsum",-10]
[2799,"Waltersdorf",-16]
[99880,"Waltershausen",-16]
["79...","Waltershofen",-12]
[45731,"Waltrop",-12]
[75045,"Walzbachtal",-12]
[65388,"Wambach",-14]
[17498,"Wampen",-12]
[56729,"Wanderath",-14]
[24997,"Wanderup",-10]
[16348,"Wandlitz",-14]
[37281,"Wanfried",-16]
[85368,"Wang",-16]
[37627,"Wangelnstedt",-14]
[37627,"Wangelstedt",-14]
[70327,"Wangen",-14]
[73117,"Wangen",-16]
[88239,"Wangen",-16]
[26486,"Wangerooge",-10]
[72127,"Wankheim",-16]
["4465.","Wanne-Eickel",-10]
[39638,"Wannefeld",-14]
[37627,"Wanngelnstedt",-14]
[72827,"Wannweil",-16]
[14641,"Wansdorf",-14]
[39164,"Wanzleben",-14]
[37640,"Warbsen",-12]
[34417,"Warburg",-14]
[26203,"Wardenburg",-12]
[17192,"Waren",-12]
[48231,"Warendorf",-12]
[19417,"Warin",-12]
[19288,"Warlow",-14]
[95485,"Warmensteinach",-18]
[18119,"Warnemünde",-10]
[83627,"Warngau",-18]
[19057,"Warnitz",-12]
[23948,"Warnkenhausen",-10]
[18249,"Warnow",-12]
[14662,"Warsow",-14]
[59581,"Warstein",-14]
[59581,"Warstein - Sichtigvor",-14]
[72213,"Wart",-16]
[85456,"Wartenberg",-16]
[88447,"Warthausen",-16]
[97797,"Wartmannsroth",-14]
[31061,"Warzen",-14]
[73116,"Wäschenbeuren",-16]
[56370,"Wasenbach",-14]
[79241,"Wasenweiler",-12]
[56653,"Wassenach",-14]
[41849,"Wassenberg",-10]
[73433,"Wasseralfingen",-16]
[41849,"Wasserberg",-10]
[88142,"Wasserburg",-12]
[83512,"Wasserburg am Inn",-16]
[54332,"Wasserliesch",-12]
[91717,"Wassertrüdingen",-16]
[96196,"Wattendorf",-16]
["4478.","Wattenscheid",-10]
[35415,"Watzenborn-Steinberg",-14]
[66424,"Websweiler",-12]
[25795,"Weddingstedt",-10]
[22880,"Wedel/Holstein",-10]
[30900,"Wedemark",-14]
[38527,"Wedesbüttel",-14]
[23795,"Weede-Söhren",-10]
[47652,"Weeze",-10]
[41844,"Wegberg",-10]
[38828,"Wegeleben",-14]
[15345,"Wegendorf",-14]
[78564,"Wehingen",-18]
[37339,"Wehnde",-16]
[52538,"Wehr",-10]
[79664,"Wehr",-12]
[49152,"Wehrendorf",-12]
[61273,"Wehrheim",-14]
[91798,"Weiboldshausen",-16]
[9775,"Weicherdange/Luxembourg",-14]
[85258,"Weichs",-16]
[85258,"Weichs-Aufhausen",-16]
[7570,"Weida",-14]
[89134,"Weidach",-16]
[91550,"Weidelsbach",-16]
[92637,"Weiden",-16]
[54570,"Weidenbach",-14]
[91746,"Weidenbach",-16]
[4860,"Weidenhain",-16]
[89197,"Weidenstetten",-16]
[67475,"Weidenthal",-12]
[77654,"Weierbach",-12]
[91249,"Weigendorf",-16]
[78056,"Weigheim",-18]
[2733,"Weigsdorf-Köblitz",-16]
[21271,"Weihe",-12]
[91629,"Weihenzell",-16]
[90513,"Weiherhof",-16]
[88214,"Weiherstobel",-14]
[84107,"Weihmichl",-16]
[88477,"Weihungszell",-16]
[97990,"Weikersheim",-16]
[78250,"Weil",-16]
[79576,"Weil am Rhein",-12]
[71263,"Weil der Stadt",-16]
[71093,"Weil im Schönbuch",-16]
[35781,"Weilburg",-12]
[72367,"Weilen unter den Rinnen",-18]
[72108,"Weiler",-16]
[73492,"Weiler",-16]
[74889,"Weiler",-12]
[73529,"Weiler in den Bergen",-16]
[71397,"Weiler zum Stein",-14]
[91365,"Weilersbach",-16]
[53919,"Weilerswist",-12]
[72379,"Weilheim",-16]
[79809,"Weilheim",-12]
[82362,"Weilheim",-16]
[73235,"Weilheim a.d.Teck",-16]
[70499,"Weilimdorf",-12]
[35789,"Weilmünster",-14]
[61276,"Weilrod",-16]
[72336,"Weilstetten",-18]
[91744,"Weiltingen",-16]
[34292,"Weimar",-14]
[35096,"Weimar",-12]
["9942.","Weimar",-14]
[1689,"Weinböhla",-14]
[76356,"Weingarten",-12]
[88250,"Weingarten",-14]
[99869,"Weingarten",-14]
[91358,"Weingarts",-16]
[88214,"Weingartshof",-14]
[69469,"Weinheim/Bergstraße",-10]
[90518,"Weinhof",-16]
[74189,"Weinsberg",-14]
[71384,"Weinstadt",-14]
[8538,"Weischlitz",-16]
[75175,"Weisen",-12]
[76599,"Weisenbach",-14]
[91085,"Weisendorf",-16]
[67273,"Weisenheim",-12]
[66709,"Weiskirchen",-12]
[71287,"Weissach",-14]
[71554,"Weissach im Tal",-14]
[71554,"Weissach im Tal",-14]
[1920,"Weißbach",-16]
[1936,"Weißbach",-16]
[9439,"Weißbach",-14]
[95237,"Weißdorf",-18]
[2627,"Weissenberg",-16]
[9600,"Weißenborn",-16]
[91560,"Weissenbronn",-16]
[91227,"Weißenbrunn",-16]
[91781,"Weissenburg in Bayern",-16]
[6667,"Weißenfels",-14]
[89264,"Weissenhorn",-16]
[89264,"Weißenhorn",-16]
[93444,"Weißenregen",-18]
[88138,"Weißensberg",-14]
[1561,"Weißig am Raschütz",-16]
[2999,"Weißkollm",-16]
[2628,"Weissnaußlitz",-16]
[2943,"Weißwasser",-16]
[79367,"Weisweil",-12]
[57586,"Weitefeld",-14]
[23968,"Weitendorf",-10]
[23999,"Weitendorf  ( Insel Poel )",-10]
[78247,"Weiterdingen",-14]
[56191,"Weitersburg",-12]
[1909,"Weitersdorf",-16]
[64331,"Weiterstadt",-12]
[17033,"Weitin",-14]
[72184,"Weitingen",-16]
[87480,"Weitnau",-16]
[96479,"Weitramsdorf",-16]
[1108,"Weixdorf",-14]
[79780,"Weizen",-14]
[6333,"Welbsleben",-14]
[86465,"Welden",-16]
[21261,"Welle",-12]
[78669,"Wellendingen",-18]
[4758,"Wellerswalde",-14]
[66557,"Welschbach/Saar",-12]
[54298,"Welschbillig",-14]
[56729,"Welschenbach",-14]
[77790,"Welschensteinach",-14]
[56412,"Welschneudorf",-14]
[75365,"Weltenschwann",-16]
[59514,"Welver",-12]
[1561,"Welxande",-16]
[73642,"Welzheim",-16]
[38176,"Wendeburg",-14]
[99988,"Wendehausen",-16]
[55234,"Wendelsheim",-12]
[72108,"Wendelsheim",-16]
[90530,"Wendelstein/Mittelfr.",-16]
[57482,"Wenden",-14]
[1683,"Wendischbora",-14]
[4746,"Wendishain",-14]
[73240,"Wendlingen",-14]
[38448,"Wendschott",-14]
[84187,"Weng",-18]
[94086,"Weng",-16]
[54516,"Wengerohr",-14]
[88416,"Wennedach",-16]
[59872,"Wennemen",-14]
[30974,"Wennigsen",-14]
[21465,"Wentorf",-12]
[93173,"Wenzenbach",-18]
[21279,"Wenzendorf",-12]
[4460,"Werben",-14]
[39615,"Werben",-14]
[2956,"Werda",-16]
[8233,"Werda",-16]
[8412,"Werdau",-16]
[14542,"Werder/Havel",-14]
[58791,"Werdohl",-12]
[59457,"Werl",-12]
[49757,"Werlte",-12]
[42929,"Wermelskirchen",-12]
[4779,"Wermsdorf",-14]
[73249,"Wernau",-16]
[92533,"Wernberg-Köblitz",-16]
[59368,"Werne a.d. Lippe",-12]
[16356,"Werneuchen",-14]
[91174,"Wernfels",-16]
[38855,"Wernigerode",-16]
[9509,"Wernsdorf bei Marienberg",-14]
[56414,"Weroth",-14]
[57614,"Weroth",-14]
[64395,"Wersau",-14]
[53520,"Wershofen",-14]
[40591,"Werste",-10]
[97877,"Wertheim",-14]
[33824,"Werther",-12]
[86637,"Wertingen",-16]
[46325,"Weseke",-10]
[46483,"Wesel",-10]
[46485,"Wesel",-10]
[66919,"Weselberg",-12]
[19288,"Weselsdorf",-14]
[39249,"Wespen",-14]
[50389,"Wesseling/Rheinl.",-10]
[72406,"Wessingen",-18]
[82234,"Weßling",-16]
[4889,"Weßnig",-16]
[48291,"Westbevern",-12]
[6449,"Westdorf",-14]
[87679,"Westendorf",-16]
[39448,"Westenegeln",-14]
[59199,"Westerbönen",-12]
[56457,"Westerburg",-14]
[32130,"Westerenger",-12]
[21394,"Westergellersen",-12]
[83620,"Westerham",-18]
[49324,"Westerhausen",-12]
[72589,"Westerheim",-18]
[37589,"Westerhof",-16]
[73463,"Westerhofen",-16]
[24977,"Westerholz",-10]
[74639,"Westernbach",-14]
[89198,"Westerstetten",-16]
[73463,"Westhausen",-16]
[86356,"Westheim",-16]
[91747,"Westheim",-16]
[97478,"Westheim",-16]
[67593,"Westhofen",-12]
[26810,"Westoverledingen",-10]
[30457,"Wettbergen",-14]
[91757,"Wettelsheim",-16]
[35435,"Wettenberg-Launsbach",-14]
[58300,"Wetter",-12]
[6722,"Wetterzeube",-14]
[85139,"Wettstetten",-16]
[93444,"Wettzell",-18]
["3557.","Wetzlar",-12]
[35583,"Wetzlar - Garbenheim",-12]
[33106,"Wewer",-12]
[83629,"Weyarn",-18]
[56357,"Weyer",-12]
[28844,"Weyhe",-12]
[89079,"Wiblingen",-14]
[58769,"Wiblingwerde",-12]
[58739,"Wickede",-12]
[19055,"Wickendorf",-12]
[65439,"Wicker",-12]
[41189,"Wickrathberg",-10]
[52156,"Widdau",-14]
[74259,"Widdern",-14]
[56291,"Wiebelsheim",-14]
[79650,"Wiechs",-12]
[53577,"Wied",-14]
[87534,"Wiedemannsdorf",-18]
[33378,"Wiedenbrück",-12]
[85259,"Wiedenzhausen",-16]
[4938,"Wiederau",-16]
[4158,"Wiederitzsch",-14]
[2994,"Wiednitz",-16]
[26215,"Wiefelstede",-12]
[6571,"Wiehe",-14]
[51674,"Wiehl",-12]
[18556,"Wiek auf Rügen",-10]
[74523,"Wielandsweiler",-16]
[82407,"Wielenbach",-16]
[59939,"Wiemeringhausen",-14]
[56269,"Wienau",-14]
[29342,"Wienhausen",-14]
[75446,"Wiernsheim",-14]
[95676,"Wiesau",-18]
[65183,"Wiesbaden",-10]
[69257,"Wiesenbach",-12]
[74572,"Wiesenbach",-16]
[86519,"Wiesenbach",-16]
[97355,"Wiesenbronn",-16]
[65599,"Wiesenroth",-14]
[73349,"Wiesensteig",-18]
[93109,"Wiesent",-18]
[68753,"Wiesental",-12]
[97353,"Wiesentheid",-16]
[91346,"Wiesenttal",-16]
[69168,"Wiesloch",-12]
[49835,"Wietmarschen",-10]
[29323,"Wietze",-12]
[29649,"Wietzendorf",-14]
[73732,"Wiflingshausen",-14]
[91634,"Wilburgstetten",-16]
[15745,"Wildau",-14]
[8301,"Wildbach",-16]
[75323,"Wildbad im Schwarzwald",-14]
[17091,"Wildberg",-14]
[72218,"Wildberg",-16]
[36208,"Wildeck - Richelsdorf",-14]
[8237,"Wildenau",-16]
[8134,"Wildenfels",-14]
[4539,"Wildenhain",-14]
[41844,"Wildenrath",-10]
[27793,"Wildeshausen",-12]
[7980,"Wildetaube",-16]
[4924,"Wildgrube",-16]
[87499,"Wildpoldsreid",-16]
[65719,"Wildsachsen",-14]
[4838,"Wildschütz",-14]
[75196,"Wilferdingen",-14]
[88515,"Wilfingen",-14]
[78669,"Wilflingen",-18]
[57234,"Wilgersdorf",-14]
[88271,"Wilhelmsdorf",-14]
[69259,"Wilhelmsfeld",-12]
[26389,"Wilhelmshaven",-10]
[17291,"Wilhelmshayn",-14]
[14557,"Wilhelmshorst",-14]
[88263,"Wilhelmskirch",-14]
[91452,"Wilhermsdorf",-16]
[8112,"Wilkau-Haßlau",-14]
[34439,"Willebadessen",-14]
[47877,"Willich    ",-10]
[47877,"Willich - Wekeln",-10]
[34508,"Willingen/Upland",-16]
[34508,"Willingen-Neerdar",-16]
[22885,"Willinghusen",-12]
[72820,"Willmandingen",-18]
[97647,"Willmars",-16]
[93497,"Willmering",-18]
[3053,"Willmersdorf",-16]
[86574,"Willprechtszell",-16]
[74182,"Willsbach",-14]
[77731,"Willstätt",-12]
[3053,"Wilmersdorf",-16]
[57234,"Wilnsdorf",-14]
[1833,"Wilschdorf",-14]
[1723,"Wilsdruff",-14]
[72818,"Wilsingen",-16]
[6449,"Wilsleben",-14]
[27412,"Wilstedt",-12]
[54459,"Wiltingen",-12]
[75365,"Wimberg",-14]
[71299,"Wimsheim",-14]
[54457,"Wincheringen",-12]
[86949,"Windach",-16]
[51570,"Windeck",-12]
[61276,"Winden",-14]
[79297,"Winden i. E.",-16]
[55452,"Windesheim",-12]
[37539,"Windhausen",-16]
[92670,"Windischeschenbach",-16]
[99102,"Windischholzhausen",-14]
[4603,"Windischleuba",-14]
[91575,"Windsbach",-16]
[77652,"Windschläg",-12]
[65232,"Wingsbach",-14]
[21789,"Wingst",-10]
[57664,"Winkelbach",-14]
[71364,"Winnenden",-14]
[56333,"Winningen",-12]
[30890,"Winninghausen",-14]
[67722,"Winnweiler",-12]
[29308,"Winsen",-12]
[21423,"Winsen (Luhe)",-12]
[73650,"Winterbach",-16]
[89368,"Winterbach",-16]
[59955,"Winterberg",-16]
[72474,"Winterlingen",-16]
[88400,"Winterreute",-16]
[54310,"Wintersdorf",-12]
[88299,"Winterstetten",-16]
[88456,"Winterstettendorf",-16]
[88456,"Winterstettenstadt",-16]
[31088,"Winzenburg",-16]
[73072,"Winzingen",-16]
[97537,"Wipfeld",-14]
[85414,"Wippenhausen",-16]
[51688,"Wipperfürth",-12]
[89134,"Wippingen",-14]
[56422,"Wirges",-14]
[39596,"Wischer",-14]
[21737,"Wischhafen",-10]
[6647,"Wischroda",-14]
[23966,"Wismar",-10]
[31061,"Wispenstein",-16]
[52388,"Wissersheim",-12]
[73550,"Wißgoldingen",-16]
[53879,"Wißkirchen",-14]
[77960,"Wittelbach",-14]
[58454,"Witten",-12]
[6886,"Wittenberg",-14]
[16515,"Wittenberg",-14]
[19322,"Wittenberge",-14]
[19243,"Wittenburg",-12]
[19243,"Wittendörp",-12]
[19073,"Wittenförden",-12]
[88693,"Wittenhofen",-14]
[77963,"Wittenweier",-12]
[99189,"Witterda",-14]
[66399,"Wittersheim",-12]
[7768,"Wittersroda",-14]
[9228,"Wittgensdorf",-14]
[2997,"Wittichenau",-16]
[97957,"Wittighausen",-16]
[29378,"Wittingen",-14]
[89426,"Wittislingen",-16]
[40489,"Wittlaer",-10]
[72250,"Wittlensweiler",-16]
[54516,"Wittlich",-14]
[79599,"Wittlingen",-12]
[72574,"Wittlingen  ( Bad Urach )",-16]
[26409,"Wittmund",-10]
[16909,"Wittstock",-14]
["3721.","Witzenhausen",-14]
[37213,"Witzenhausen / Unterrieden ",-14]
[42799,"Witzhelden",-10]
[89250,"Witzighausen",-16]
[94104,"Witzmannsberg",-16]
[32816,"Wöbbel",-14]
[52152,"Woffelsbach",-14]
[4874,"Wohlau",-16]
[21521,"Wohltorf",-12]
[48167,"Wolbeck",-12]
[17091,"Wolde",-14]
[77709,"Wolfach",-14]
[76227,"Wolfartsweier",-12]
[88364,"Wolfegg",-16]
[6766,"Wolfen",-14]
["3830.","Wolfenbüttel",-14]
[35789,"Wolfenhausen",-14]
[72149,"Wolfenhausen",-16]
[63654,"Wolferborn",-14]
[78166,"Wolferdingen",-18]
[6295,"Wolferode",-14]
[35260,"Wolferode",-14]
[36266,"Wölfershausen",-14]
[61200,"Wölfersheim",-14]
[53940,"Wolfert     Unterw./Oberw.",-14]
[53937,"Wolfgarten",-14]
[34466,"Wolfhagen",-14]
[91639,"Wolframs - Eschenbach",-16]
[82515,"Wolfratshausen",-16]
[92269,"Wolfring",-16]
["3844.","Wolfsburg",-14]
[99819,"Wolfsburg-Unkeroda",-16]
[72649,"Wolfschlugen",-14]
[93195,"Wolfsegg",-16]
[3130,"Wolfshain",-16]
[64560,"Wolfskehlen",-12]
[67752,"Wolfstein",-12]
[37290,"Wolfterode",-14]
[17438,"Wolgast",-12]
[91126,"Wolkersdorf",-16]
[84166,"Wollkofen",-16]
[4720,"Wollsdorf",-14]
[61206,"Wöllstadt",-12]
[55597,"Wöllstein",-12]
[39326,"Wolmirstedt",-14]
[16259,"Wölsickendorf",-14]
[4519,"Wolteritz",-14]
[15569,"Woltersdorf",-14]
[31099,"Woltershausen",-16]
[97539,"Wonfurt",-14]
[55599,"Wonsheim",-12]
[37339,"Worbis",-16]
[4880,"Wörblitz",-16]
[87789,"Woringen",-16]
[6786,"Wörlitz",-14]
[57392,"Wormbach",-14]
[53359,"Wormersdorf",-14]
[1994,"Wormlage",-16]
[3205,"Wormlage",-16]
["6755.","Worms",-12]
[27726,"Worpswede",-12]
[55286,"Wörrstadt",-12]
[73499,"Wört",-16]
[76744,"Wörth",-12]
[85457,"Wörth",-16]
[93086,"Wörth a.d. Donau",-18]
[84109,"Wörth an der Isar",-16]
[82237,"Wörthsee",-16]
[76327,"Wöschbach",-12]
[31079,"Wrisbergholzen",-14]
[25799,"Wrohm",-12]
[46286,"Wulfen",-10]
[32545,"Wulferdingen",-12]
[31008,"Wülfingen",-14]
[31832,"Wülfinghausen",-14]
[42489,"Wülfrath",-10]
[99310,"Wüllersleben",-14]
[27628,"Wulsbüttel",-12]
[98704,"Wümbach",-16]
[9514,"Wünschendorf",-14]
[31515,"Wunstorf-Luthe",-14]
["4211.","Wuppertal",-12]
[42283,"Wuppertal - Barmen",-12]
[42349,"Wuppertal - Cronenfeld",-12]
[42111,"Wuppertal - Elberfeld",-12]
[42329,"Wuppertal - Vohwinkel",-12]
[52511,"Würm",-12]
[75181,"Würm",-14]
[75449,"Wurmberg",-14]
[76448,"Würmersheim",-12]
[72108,"Wurmlingen",-16]
[78573,"Wurmlingen",-16]
[1561,"Würschnitz",-16]
[52146,"Würselen",-12]
[82813,"Würtingen",-18]
[75394,"Würzbach",-16]
["9707.","Würzburg",-12]
[4808,"Wurzen",-14]
[39524,"Wust",-14]
[32108,"Wüsten",-12]
[9358,"Wüstenbrand",-14]
[73527,"Wustenriet",-16]
[71543,"Wüstenrot",-16]
[16868,"Wusterhausen",-14]
[17509,"Wusterhusen",-12]
[37318,"Wüstheuterode",-16]
[16818,"Wustrau",-14]
[29462,"Wustrow",-14]
[16818,"Wuthenow",-14]
[79793,"Wutöschingen",-12]
[4749,"Wutzschwitz",-14]
[79369,"Wyhl",-12]
[4552,"Wyhra",-14]
[47559,"Wyler",-10]
[46509,"Xanten",-10]
[39307,"Zabakuck",-14]
[1561,"Zabeltitz",-16]
[74374,"Zaberfeld",-14]
[94239,"Zachenberg",-18]
[86573,"Zahling",-16]
[6895,"Zahna",-14]
[75378,"Zainen",-16]
[72587,"Zainingen",-18]
[75059,"Zaisenhausen",-14]
[89551,"Zang",-16]
[96199,"Zapfenhausen",-16]
[18195,"Zarnewanz",-12]
[19246,"Zarrentin",-12]
[39606,"Zedau",-14]
[7557,"Zedlitz",-14]
[4552,"Zedtlitz",-14]
[16792,"Zehdenick",-14]
[97475,"Zeil am Main",-14]
[67378,"Zeiskam",-12]
[1619,"Zeithain",-16]
[6712,"Zeitz",-14]
[73104,"Zell",-16]
[77736,"Zell",-14]
[95239,"Zell",-18]
[56856,"Zell - Barl",-12]
[77736,"Zell a.H.",-14]
[97299,"Zell am Main",-14]
[79669,"Zell i.W.",-14]
[73119,"Zell u. Aichelberg",-16]
[67308,"Zellertal",-12]
[63533,"Zellhausen",-12]
[77654,"Zell-Weierbach",-12]
[17459,"Zempin",-12]
[16341,"Zepernick",-14]
[39317,"Zerben",-14]
[39261,"Zerbst",-14]
[1920,"Zerna",-16]
[29499,"Zernien",-14]
[16845,"Zernitz",-14]
[15758,"Zernsdorf",-14]
[16348,"Zerpenschleuse",-14]
[2699,"Zescha",-16]
[26340,"Zetel",-10]
[9306,"Zetteritz",-14]
[93485,"Zettisch",-18]
[4758,"Zeuckritz",-16]
[7937,"Zeulenroda",-16]
[76698,"Zeutern",-12]
[15738,"Zeuthen",-14]
[19069,"Zickhusen",-12]
[7980,"Zickra",-14]
[6842,"Ziebigk",-14]
[34613,"Ziegenhain",-14]
[4720,"Ziegra",-14]
[86473,"Ziemetshausen",-16]
[17440,"Ziemitz",-14]
[79395,"Zienken",-12]
[23968,"Zierow",-10]
[89446,"Ziertheim",-16]
[14793,"Ziesar",-14]
[18059,"Ziesendorf",-12]
[86510,"Zillenberg",-16]
[72336,"Zillhausen",-18]
[88484,"Zillishausen",-16]
[54578,"Zilsdorf",-14]
[15295,"Ziltendorf",-16]
[73568,"Zimmerbach",-16]
[72406,"Zimmern",-18]
[78658,"Zimmern",-16]
[97828,"Zimmern",-14]
[72369,"Zimmern u.d.B.",-16]
[2906,"Zimpel",-16]
[18374,"Zingst Ostseebad",-10]
[15345,"Zinndorf",-14]
[17454,"Zinnowitz",-12]
[1773,"Zinnwald",-16]
[19063,"Zippendorf",-12]
[17419,"Zirchow",-12]
[86609,"Zirgesheim",-16]
[36041,"Zirkenbach",-14]
[90513,"Zirndorf",-16]
[2763,"Zittau",-16]
[79379,"Zizingen",-12]
[4416,"Zöbigker",-16]
[73485,"Zöbingen",-16]
[9517,"Zöblitz",-16]
[2829,"Zodel",-16]
[78052,"Zollhaus",-18]
[85406,"Zolling",-16]
[15926,"Zöllmersdorf",-16]
[4703,"Zollschwitz",-14]
[6780,"Zörbig",-14]
[85604,"Zorneding",-16]
[89447,"Zöschingen",-16]
[89426,"Zöschlingsweiler",-16]
[15806,"Zossen",-14]
[4720,"Zschaitz",-14]
[4603,"Zschechwitz",-14]
[4720,"Zschepplitz",-14]
[4749,"Zschochau",-14]
[4703,"Zschockau",-14]
[9405,"Zschopau",-14]
[8321,"Zschorlau",-16]
[1920,"Zschornau",-16]
[4509,"Zschortau",-14]
[39240,"Zuchau",-14]
[85051,"Zuchering",-18]
[70435,"Zuffenhausen",-12]
[82467,"Zugspitze",-24]
[16515,"Zühlsdorf",-14]
[53909,"Zülpich ",-14]
[73635,"Zumhof",-14]
["7765.","Zunsweier (Offenburg)",-12]
[79379,"Zunzingen",-14]
[86450,"Zusamzell",-16]
[86441,"Zusmarshausen",-16]
[17495,"Züssow",-12]
[85465,"Zustorf",-16]
[74219,"Züttlingen",-12]
[16306,"Zützen",-16]
[74939,"Zuzenhausen",-12]
[19258,"Zweedorf",-12]
[4451,"Zweefurth",-14]
[66482,"Zweibrücken",-12]
[74639,"Zweiflingen",-14]
[4442,"Zwenkau",-14]
[75389,"Zwerenberg",-16]
["0805.","Zwickau",-14]
[88529,"Zwiefalten",-14]
[94227,"Zwiesel",-18]
[64673,"Zwingenberg",-12]
[69439,"Zwingenberg",-12]
[8297,"Zwönitz",-16]
[47559,"Zyfflich",-10]

{"sheet":"Ausdruck","index":3,"n_rows":704,"n_cols":24,"rows_kept":704,"cut":false,"hidden":true,"merged":[[53,12,53,26],[55,1,55,11],[56,1,56,11],[53,1,53,11],[115,1,115,11],[116,1,116,11],[159,1,159,11],[449,20,449,26],[399,20,399,26],[168,1,168,11],[169,1,169,11],[170,1,170,11],[117,12,117,26],[119,12,119,26],[117,1,117,11],[155,1,155,11],[154,1,154,11],[161,12,161,26],[167,12,167,26],[118,1,118,11],[119,1,119,11],[120,1,120,11],[308,1,308,11],[308,12,308,18],[0,21,0,26],[50,20,50,26],[100,20,100,26],[150,20,150,26],[200,20,200,26],[250,20,250,26],[300,20,300,26],[270,1,270,11],[272,12,272,26],[263,1,263,26],[51,1,51,25],[55,12,55,26],[54,12,54,26],[49,20,49,26],[56,12,56,26],[54,1,54,11],[11,1,11,11],[262,12,262,16],[262,22,262,26],[105,1,105,11],[69,1,69,11],[70,1,70,11],[114,1,114,11],[153,1,153,11],[703,1,703,25],[701,1,701,25],[255,12,255,16],[255,22,255,26],[253,22,253,26],[206,1,206,11],[214,1,214,11],[215,1,215,26],[208,1,208,11],[209,12,209,26],[309,1,309,11],[309,12,309,18],[309,19,309,26],[310,12,310,18],[303,12,303,18],[303,19,303,26],[304,12,304,18],[304,19,304,26],[305,12,305,18],[306,12,306,18],[305,19,305,26],[306,19,306,26],[304,1,304,11],[499,20,499,26],[349,20,349,26],[314,12,314,26],[404,1,404,25],[311,12,311,18],[63,1,63,11],[65,1,65,11],[66,1,66,11],[67,1,67,11],[68,1,68,11],[161,1,161,11],[166,1,166,11],[166,12,166,26],[160,1,160,11],[164,1,164,11],[315,1,315,11],[103,12,103,26],[104,1,104,11],[103,1,103,11],[66,12,66,26],[256,22,256,26],[257,12,257,16],[211,12,211,26],[171,12,171,26],[207,1,207,11],[57,12,57,15],[58,12,58,15],[59,12,59,15],[65,12,65,26],[264,22,264,26],[108,1,108,11],[156,1,156,11],[157,1,157,11],[108,12,108,26],[158,1,158,11],[111,1,111,11],[57,1,57,11],[111,12,111,26],[110,1,110,11],[107,1,107,11],[106,1,106,11],[107,12,107,26],[57,16,57,26],[58,16,58,26],[59,16,59,26],[60,12,60,26],[62,12,62,26],[63,12,63,26],[61,12,61,26],[2,20,2,26],[3,1,3,25],[10,12,10,26],[13,12,13,26],[9,12,9,26],[6,12,6,26],[7,12,7,26],[12,1,12,11],[13,1,13,11],[9,1,9,11],[5,1,5,11],[8,12,8,26],[11,12,11,26],[12,12,12,26],[8,1,8,11],[10,1,10,11],[5,12,5,26],[6,1,6,11],[7,1,7,11],[59,1,59,11],[60,1,60,11],[61,1,61,11],[62,1,62,11],[70,12,70,26],[68,12,68,26],[69,12,69,26],[67,12,67,26],[110,12,110,26],[105,12,105,26],[104,12,104,26],[101,1,101,25],[115,12,115,26],[208,12,208,26],[164,12,164,26],[170,12,170,26],[169,12,169,26],[175,1,175,26],[172,12,172,26],[203,1,203,11],[172,1,172,11],[173,1,173,11],[171,1,171,11],[207,12,207,26],[163,12,163,26],[118,12,118,26],[121,12,121,26],[160,12,160,26],[112,1,112,11],[106,12,106,26],[121,1,121,11],[154,12,154,26],[157,12,157,26],[156,12,156,26],[155,12,155,26],[315,12,315,26],[153,12,153,26],[203,12,203,26],[254,17,254,21],[210,12,210,26],[261,17,261,21],[269,12,269,26],[205,12,205,26],[271,12,271,26],[204,12,204,26],[201,1,201,25],[173,12,173,26],[174,1,174,26],[270,12,270,26],[162,1,162,11],[268,12,268,26],[162,12,162,26],[209,1,209,11],[210,1,210,11],[204,1,204,11],[205,1,205,11],[206,12,206,26],[251,1,251,25],[253,17,253,21],[266,17,266,21],[266,22,266,26],[265,12,265,16],[265,17,265,21],[265,22,265,26],[261,22,261,26],[262,1,262,11],[262,17,262,21],[264,1,264,11],[264,12,264,16],[264,17,264,21],[265,1,265,11],[260,12,260,16],[260,22,260,26],[213,1,213,11],[213,12,213,26],[214,12,214,26],[267,1,267,26],[268,1,268,11],[269,1,269,11],[271,1,271,11],[261,12,261,16],[261,1,261,11],[266,1,266,11],[257,17,257,21],[266,12,266,16],[255,17,255,21],[260,17,260,21],[253,1,253,11],[254,1,254,11],[254,22,254,26],[258,1,258,11],[258,12,258,16],[254,12,254,16],[257,1,257,11],[258,17,258,21],[258,22,258,26],[256,12,256,16],[256,1,256,11],[255,1,255,11],[260,1,260,11],[274,1,274,11],[274,12,274,26],[316,1,316,11],[316,12,316,26],[301,1,301,25],[310,19,310,26],[310,1,310,11],[311,1,311,11],[313,1,313,11],[303,1,303,11],[306,1,306,11],[308,19,308,26],[314,1,314,11],[305,1,305,11],[311,19,311,26],[211,1,211,11],[212,12,212,26],[216,1,216,26],[1,23,1,27],[273,1,273,11],[273,12,273,26],[58,1,58,11],[212,1,212,11],[168,12,168,26],[256,17,256,21],[112,12,112,26],[151,1,151,25],[113,12,113,26],[114,12,114,26],[167,1,167,11],[158,12,158,26],[163,1,163,11],[120,12,120,26],[113,1,113,11],[116,12,116,26],[159,12,159,26],[272,1,272,11],[253,12,253,16],[257,22,257,26]]}
["FÖRDERUNG NACH BAFA-MAP"]
[null,null,null,null,null,null,null,null,null,null,null,null,null,null,null,null,null,null,null,null,null,null,null,{"$f":"RIGHT(Eingabe!AB2,5)","v":"v8.39"}]
[]
[null,"Projektdaten","Straße",{"$f":"Berechnung!C10","v":0}]
[]
[null,"Gebäudedaten"]
[null,"Gebäudestandort",null,null,null,null,null,null,null,null,null,null,{"$f":"Berechnung!C14","v":"Leipzig"}]
[null,"Norm-Außentemperatur",null,null,null,null,null,null,null,null,null,null,{"$f":"Berechnung!C16&\" °C\"","v":"-14 °C"}]
[null,"Gebäudetyp",null,null,null,null,null,null,null,null,null,null,{"$f":"Berechnung!D6&\" | \"&Berechnung!G6","v":"Wohngebäude | Bestandsgebäude"}]
[null,{"$f":"Eingabe!C15","v":"Wohneinheiten"},null,null,null,null,null,null,null,null,null,null,{"$f":"IF(Berechnung!D6=Berechnung!D9,Berechnung!H6,Berechnung!I6)","v":"Einfamilienhaus"}]
[null,"Heizgrenztemperatur",null,null,null,null,null,null,null,null,null,null,{"$f":"Berechnung!N6","v":"15 °C"}]
[null,"Dämmstandard",null,null,null,null,null,null,null,null,null,null,{"$f":"Berechnung!E6","v":"Niedrigenergiehaus EnEV 2016"}]
[null,"Transmisionswärmeverlust HT'",null,null,null,null,null,null,null,null,null,null,{"$f":"Berechnung!K6","v":"EnEV 2009 Neubau - Niveau"}]
[null,"Heizungsanlage",null,null,null,null,null,null,null,null,null,null,{"$f":"IF(Berechnung!F27<>2,\"Wärmepumpe\",Berechnung!D61)","v":"Wärmepumpe"}]
[]
[]
[]
[]
[]
[]
[]
[]
[]
[]
[]
[]
[]
[]
[]
[]
[]
[]
[]
[]
[]
[]
[]
[]
[]
[]
[]
[]
[]
[]
[]
[]
[]
[]
[]
[]
[]
[null,"Systemtechnik"]
[]
[null,"Wärmepumpe"]
[null,"Typ",null,null,null,null,null,null,null,null,null,null,{"$f":"IF(Berechnung!R6>1,Berechnung!R6&\" x \",\"\")&IF(Berechnung!F27=2,\"-\",IF(Berechnung!C54=FALSE,Berechnung!C34,Berechnung!C34&\"  (\"&VLOOKUP(Berechnung!C34,Leistungsdaten!G:M,7,FALSE)&\")\"))","v":"WPL 25 A"}]
[null,"Wärmequelle",null,null,null,null,null,null,null,null,null,null,{"$f":"IF(Berechnung!F27=2,\"-\",VLOOKUP(Berechnung!B34,Berechnung!B37:C52,2,FALSE))","v":"Luft/Wasser-Wärmepumpe"}]
[null,{"$f":"Berechnung!G206","v":"Heizleistung A2/W35"},null,null,null,null,null,null,null,null,null,null,{"$f":"IF(Berechnung!F27=2,\"-\",Berechnung!H206)","v":"8,33 KW"}]
[null,{"$f":"Berechnung!G207","v":"Leistungszahl A-7/W35"},null,null,null,null,null,null,null,null,null,null,{"$f":"IF(Berechnung!F27=2,\"-\",Berechnung!H207)","v":"2,93"}]
[null,"Leistungszahl A2/W35",null,null,null,null,null,null,null,null,null,null,{"$f":"IF(Berechnung!F27=2,\"-\",Berechnung!H208)","v":"4,17"}]
[null,"Leistungszahl A10/W35",null,null,null,null,null,null,null,null,null,null,{"$f":"IF(Berechnung!F27=2,\"-\",Berechnung!H209)","v":"5,16"}]
[null,{"$f":"IF(Berechnung!B54=TRUE,\"Leistungsaufnahme B10/W35\",\"Leistungsaufnahme B0/W35\")","v":"Leistungsaufnahme B0/W35"},null,null,null,null,null,null,null,null,null,null,{"$f":"IF(Berechnung!F27=2,\"-\",FIXED(Berechnung!I132,2)&\" KW\")","v":"4,17 KW"}]
[null,"Pufferspeicher",null,null,null,null,null,null,null,null,null,null,{"$f":"Berechnung!B240","v":"SBP 200"}]
[null,"Prüfzertifikat Leistungszahl",null,null,null,null,null,null,null,null,null,null,{"$f":"IF(Berechnung!F27=2,\"-\",\"Vorhanden\")","v":"Vorhanden"}]
[null,"Wärmemengenzählung",null,null,null,null,null,null,null,null,null,null,{"$f":"IF(Berechnung!F27=2,\"-\",IF(Berechnung!W38=TRUE,\"Vorhanden\",\"Nicht vorhanden\"))","v":"Vorhanden"}]
[]
[null,"Solaranlage"]
[null,"Typ",null,null,null,null,null,null,null,null,null,null,{"$f":"IF(Berechnung!F27=1,\"-\",Berechnung!B61)","v":"-"}]
[null,"Kollektorzahl",null,null,null,null,null,null,null,null,null,null,{"$f":"IF(Berechnung!$F$27=1,\"-\",Berechnung!C61)","v":"-"}]
[null,"Kollektorfläche",null,null,null,null,null,null,null,null,null,null,{"$f":"IF(Berechnung!$F$27=1,\"-\",FIXED(Berechnung!I61,2)&\" m²\")","v":"-"}]
[null,"Nutzungsart",null,null,null,null,null,null,null,null,null,null,{"$f":"IF(Berechnung!$F$27=1,\"-\",Berechnung!H61)","v":"-"}]
[null,"Installationsart",null,null,null,null,null,null,null,null,null,null,{"$f":"IF(Berechnung!$F$27=1,\"-\",Berechnung!G61)","v":"-"}]
[]
[]
[]
[]
[]
[]
[]
[]
[]
[]
[]
[]
[]
[]
[]
[]
[]
[]
[]
[]
[]
[]
[]
[]
[]
[]
[]
[]
[]
[]
[null,"Jahresarbeitszahl"]
[]
[null,"Heizungsanlage"]
[null,"Wärmeverteilsystem",null,null,null,null,null,null,null,null,null,null,{"$f":"Berechnung!G34","v":"Radiatorenheizung"}]
[null,"Maximale Heizungsvorlauftemperatur",null,null,null,null,null,null,null,null,null,null,{"$f":"Berechnung!F34","v":"55 °C"}]
[null,"Temperaturdifferenz Verflüssiger Prüfstand",null,null,null,null,null,null,null,null,null,null,{"$f":"FIXED(VLOOKUP(Berechnung!C34,Leistungsdaten!G:H,2,FALSE),1)&\" K\"&IF(VLOOKUP(Berechnung!C34,Leistungsdaten!G:H,2,FALSE)=5,\"   (DIN EN 14511)\",\"   (EN 255)\")","v":"5,0 K   (DIN EN 14511)"}]
[null,"Temperaturdifferenz Verflüssiger Betrieb",null,null,null,null,null,null,null,null,null,null,{"$f":"IF(OR(Berechnung!G34=Berechnung!G39,Berechnung!G34=Berechnung!G40,Berechnung!G34=Berechnung!G41,Berechnung!G34=Berechnung!G42),\"7 K\",\"10 K\")","v":"10 K"}]
[null,"Korrekturfaktor Verflüssiger FDJ",null,null,null,null,null,null,null,null,null,null,{"$f":"IF(Berechnung!B34=Berechnung!B37,FIXED(Berechnung!D154,3),IF(Berechnung!B34=Berechnung!B38,FIXED(Berechnung!G150,3),FIXED(Berechnung!J150,3)))","v":"1,052"}]
[]
[null,"Wärmequelle"]
[null,"Typ",null,null,null,null,null,null,null,null,null,null,{"$f":"IF(Berechnung!B34=Berechnung!B37,\"Außenluft\",IF(Berechnung!B34=Berechnung!B39,IF(Berechnung!B54=FALSE,\"Grundwasser mit Zwischen-Wärmetauscher\",\"Grundwasser\"),Berechnung!H34))","v":"Außenluft"}]
[null,"Korrekturfaktor FJ1",null,null,null,null,null,null,null,null,null,null,{"$f":"Berechnung!D151","v":0.109}]
[null,"Korrekturfaktor FJ2",null,null,null,null,null,null,null,null,null,null,{"$f":"Berechnung!D152","v":0.626}]
[null,"Korrekturfaktor FJ3",null,null,null,null,null,null,null,null,null,null,{"$f":"Berechnung!D153","v":0.16}]
[null,{"$f":"IF(Berechnung!B34=Berechnung!B37,\"Normaußentemperatur\",IF(Berechnung!B34=Berechnung!B38,\"Minimale Soleeintrittstemperatur\",\"Mittlere Grundwassertemperatur\"))","v":"Normaußentemperatur"},null,null,null,null,null,null,null,null,null,null,{"$f":"IF(Berechnung!B34=Berechnung!B37,M8,IF(Berechnung!B34=Berechnung!B39,Berechnung!H34,IF(Berechnung!H34=Berechnung!H37,\"2 °C\",\"0 °C\")))","v":"-14 °C"}]
[null,{"$f":"IF(Berechnung!B34=Berechnung!B37,\"Heizgrenztemperatur\",IF(Berechnung!B34=Berechnung!B39,\"Temperaturdifferenz Zwischen-WT\",Berechnung!$G$276))","v":"Heizgrenztemperatur"},null,null,null,null,null,null,null,null,null,null,{"$f":"IF(Berechnung!B34=Berechnung!B37,Berechnung!N6,IF(Berechnung!B34=Berechnung!B39,IF(Berechnung!B54=FALSE,\"-3 K\",\"-\"),IF(OR(Berechnung!K34=Berechnung!K39,Berechnung!K34=Berechnung!K40),\"+ 2 K\",\"-\")))","v":"15 °C"}]
[null,"Berechnungswert Quellentemperatur",null,null,null,null,null,null,null,null,null,null,{"$f":"Berechnung!P34&\" °C\"","v":"2 °C"}]
[null,"Korrekturfaktor Verdampfer FJ",null,null,null,null,null,null,null,null,null,null,{"$f":"IF(Berechnung!B34=Berechnung!B38,FIXED(Berechnung!G149,3),FIXED(Berechnung!J149,3))","v":"0,917"}]
[null,"Solepumpe",null,null,null,null,null,null,null,null,null,null,{"$f":"IF(Berechnung!B34=Berechnung!B38,Berechnung!I136,IF(Berechnung!B54=FALSE,Berechnung!J136,\"-\"))","v":"Typ: -  |  Leistung: 5160 W"}]
[null,"Grundwasserpumpe",null,null,null,null,null,null,null,null,null,null,{"$f":"IF(Berechnung!B54=FALSE,Berechnung!J140,Berechnung!K140)","v":"Standard nach VDI 4650"}]
[null,"Korrekturfaktor Quellenpumpe Fp",null,null,null,null,null,null,null,null,null,null,{"$f":"IF(Berechnung!B34=Berechnung!B38,FIXED(Berechnung!G151,3),FIXED(Berechnung!J151,3))","v":"1,325"}]
[]
[]
[]
[]
[]
[]
[]
[]
[]
[]
[]
[]
[]
[]
[]
[]
[]
[]
[]
[]
[]
[]
[]
[]
[]
[]
[]
[]
[]
[null,"Jahresarbeitszahl"]
[]
[null,"Warmwasserbereitung"]
[null,"Art der Warmwaserbereitung",null,null,null,null,null,null,null,null,null,null,{"$f":"Berechnung!L34","v":"Mit Heizungs-Wärmepumpe"}]
[null,"Temperaturdifferenz Verflüssiger Prüfstand",null,null,null,null,null,null,null,null,null,null,{"$f":"M107","v":"5,0 K   (DIN EN 14511)"}]
[null,"Temperaturdifferenz Verflüssiger Betrieb",null,null,null,null,null,null,null,null,null,null,{"$f":"IF(Berechnung!B34=Berechnung!B37,\"7 K\",\"10 K\")","v":"7 K"}]
[null,"Korrekturfaktor Verflüssiger FDJ",null,null,null,null,null,null,null,null,null,null,{"$f":"IF(Berechnung!B34=Berechnung!B37,FIXED(Berechnung!C134,3),IF(Berechnung!B34=Berechnung!B38,FIXED(Berechnung!D134,3),FIXED(Berechnung!E134,3)))","v":"1,021"}]
[null,"Korrekturfaktor Verdampfer FJ",null,null,null,null,null,null,null,null,null,null,{"$f":"IF(Berechnung!B54=TRUE,FIXED(VLOOKUP(Berechnung!P34,'Tabellen VDI4650'!B150:I163,8,FALSE),3),FIXED(VLOOKUP(Berechnung!P34,'Tabellen VDI4650'!B112:J137,8,FALSE),3))","v":"0,917"}]
[null,"Typ",null,null,null,null,null,null,null,null,null,null,{"$f":"IF(Berechnung!M54=FALSE,\"-\",IF(Berechnung!W241=TRUE,Berechnung!W243,Berechnung!E240))","v":"Warmwasserspeicher 300 Liter"}]
[null,"Hersteller",null,null,null,null,null,null,null,null,null,null,{"$f":"IF(Berechnung!M54=FALSE,\"-\",IF(Berechnung!W241=TRUE,Berechnung!W242,Berechnung!$G$271))","v":"STIEBEL ELTRON GmbH & Co. KG"}]
[null,"Leistungszahl nach EN 255-3",null,null,null,null,null,null,null,null,null,null,{"$f":"IF(Berechnung!M54=FALSE,\"-\",FIXED(Berechnung!M148,2))","v":{"$error":"#N/A"}}]
[null,"Warmwassertemperatur Prüfstand",null,null,null,null,null,null,null,null,null,null,{"$f":"IF(Berechnung!M54=FALSE,\"-\",VLOOKUP(Berechnung!E240,Leistungsdaten!G:I,3,FALSE)&\" °C\")","v":{"$error":"#N/A"}}]
[null,"Korrekturfaktor Warmwassertemp. F1",null,null,null,null,null,null,null,null,null,null,{"$f":"IF(Berechnung!M54=FALSE,\"-\",FIXED(Berechnung!M149,2))","v":{"$error":"#N/A"}}]
[null,"Korrekturfaktor Wärmepumpen-Typ",null,null,null,null,null,null,null,null,null,null,{"$f":"IF(Berechnung!M54=FALSE,\"-\",FIXED(Berechnung!M150,2))","v":{"$error":"#N/A"}}]
[]
[null,"Berechnung"]
[null,"Jahresarbeitszahl Raumheizung bh",null,null,null,null,null,null,null,null,null,null,{"$f":"ROUND(Berechnung!E158,2)","v":3.95}]
[null,"Jahresarbeitszahl Warmwasserbereitung bw",null,null,null,null,null,null,null,null,null,null,{"$f":"IF(Berechnung!M54=FALSE,\"Keine Warmwasserbereitung\",ROUND(Berechnung!E160,2))","v":4.47}]
[null,"Anteil Warmwasser am Wärmebedarf",null,null,null,null,null,null,null,null,null,null,{"$f":"IF(Berechnung!M54=FALSE,\"Keine Warmwasserbereitung\",IF(Berechnung!R34=0.18,\"Nach VDI 4650 (18 %)\",Berechnung!R34*100&\" \"))","v":"Nach VDI 4650 (18 %)"}]
[null,"Betriebsweise Wärmepumpe",null,null,null,null,null,null,null,null,null,null,{"$f":"Berechnung!D34","v":"Monoenergetisch"}]
[null,"Bivalenzpunkt JBiv",null,null,null,null,null,null,null,null,null,null,{"$f":"IF(Berechnung!D34=Berechnung!D37,\"-\",Berechnung!E34)","v":"-5 °C"}]
[null,"Deckungsanteil a",null,null,null,null,null,null,null,null,null,null,{"$f":"IF(Berechnung!D34=Berechnung!D39,FIXED(VLOOKUP(Berechnung!E34,Berechnung!E36:Q52,13,FALSE),2),FIXED(Berechnung!Q34,2))","v":"0,98"}]
[null,"Gesamt-Jahresarbeitszahl bWP",null,null,null,null,null,null,null,null,null,null,{"$f":"FIXED(Berechnung!E161,1)","v":"3,8"}]
[null,"Berechnung nach VDI 4650 | Teil 1 (März 2009)"]
[]
[]
[]
[]
[]
[]
[]
[]
[]
[]
[]
[]
[]
[]
[]
[]
[]
[]
[]
[]
[]
[]
[]
[]
[]
[]
[null,"Übersicht Fördersummen"]
[]
[null,"Förderung"]
[null,"Basisförderung Wärmepumpe",null,null,null,null,null,null,null,null,null,null,{"$f":"IF(Berechnung!E224=FALSE,\"-\",Berechnung!F224&\" €\")","v":"1500 €"}]
[null,"Innovationsförderung Wärmepumpe",null,null,null,null,null,null,null,null,null,null,{"$f":"IF(Berechnung!E228=FALSE,\"-\",Berechnung!F228&\" €\")","v":"-"}]
[null,"Basisförderung Solar",null,null,null,null,null,null,null,null,null,null,{"$f":"IF(Berechnung!E225=FALSE,\"-\",Berechnung!F225&\" €\")","v":"-"}]
[null,"Innovationsförderung Solar",null,null,null,null,null,null,null,null,null,null,{"$f":"IF(Berechnung!E227=FALSE,\"-\",Berechnung!F227&\" €\")","v":"-"}]
[null,"Bonus Lastmanagementfähigkeit",null,null,null,null,null,null,null,null,null,null,{"$f":"IF(Berechnung!E230=FALSE,\"-\",Berechnung!F230&\" €\")","v":"500 €"}]
[null,"Kombinationsbonus Solar",null,null,null,null,null,null,null,null,null,null,{"$f":"IF(Berechnung!E226=FALSE,\"-\",Berechnung!F226&\" €\")","v":"-"}]
[null,"Bonus energieeffiziente Gebäudehülle",null,null,null,null,null,null,null,null,null,null,{"$f":"IF(Berechnung!E229=FALSE,\"-\",Berechnung!F229&\" €\")","v":"-"}]
[null,"Bonus Wärmepumpenoptimierung",null,null,null,null,null,null,null,null,null,null,{"$f":"IF(Berechnung!E223=FALSE,\"-\",Berechnung!F223&\" €\")","v":"250 €"}]
[null,"Bonus Optimierung Heizungsanlage",null,null,null,null,null,null,null,null,null,null,{"$f":"IF(Berechnung!E222=FALSE,\"-\",Berechnung!F222&\" € *\")","v":"-"}]
[null,"Bonus Heizkesseltausch",null,null,null,null,null,null,null,null,null,null,{"$f":"IF(Berechnung!E231=FALSE,\"-\",Berechnung!F231&\" €\")","v":"-"}]
[null,"Summe",null,null,null,null,null,null,null,null,null,null,{"$f":"Berechnung!F232&\" €\"","v":"2250 €"}]
[null,"Maßgeblich für die tatsächliche Förderhöhe ist der Bafa-Förderbescheid."]
[null,{"$f":"IF(Berechnung!E222=FALSE,\"\",\"* 10% der Investkosten für Heizungsoptimierung, max. 50 % Basisförderung Wärmepumpe\")","v":""}]
[]
[]
[]
[]
[]
[]
[]
[]
[]
[]
[]
[]
[]
[]
[]
[]
[]
[]
[]
[]
[]
[]
[]
[]
[]
[]
[]
[]
[]
[]
[]
[]
[]
[]
[null,"Förderbedingungen Wärmepumpe"]
[]
[null,"Mindest-Jahresarbeitszahlen",null,null,null,null,null,null,null,null,null,null,"Außenluft",null,null,null,null,"Erdwärmesonde",null,null,null,null,"Sonstige Quellen"]
[null,"Wohngebäude | Heizung+Warmwassser",null,null,null,null,null,null,null,null,null,null,"≥ 3,5",null,null,null,null,"≥ 3,8",null,null,null,null,"≥ 3,8"]
[null,"Wohngebäude | Nur Heizung",null,null,null,null,null,null,null,null,null,null,"Nicht förderfähig",null,null,null,null,"Nicht förderfähig",null,null,null,null,"Nicht förderfähig"]
[null,"Nichtwohngebäude | Heizung+Warmwassser",null,null,null,null,null,null,null,null,null,null,"≥ 3,5",null,null,null,null,"≥ 4,0",null,null,null,null,"≥ 4,0"]
[null,"Nichtwohngebäude | Nur Heizung",null,null,null,null,null,null,null,null,null,null,"≥ 3,5",null,null,null,null,"≥ 4,0",null,null,null,null,"≥ 4,0"]
[null,"Innovationsförderung Wärmepumpe",null,null,null,null,null,null,null,null,null,null,"≥ 4,5",null,null,null,null,"≥ 4,5",null,null,null,null,"≥ 4,5"]
[]
[null,"Basisförderung",null,null,null,null,null,null,null,null,null,null,"Außenluft",null,null,null,null,"Erdwärmesonde",null,null,null,null,"Sonstige Quellen"]
[null,"Fördersumme",null,null,null,null,null,null,null,null,null,null,"40 € je KW",null,null,null,null,"100 € je KW",null,null,null,null,"100 € je KW"]
[null,"Mindestförderbetrag",null,null,null,null,null,null,null,null,null,null,"1300 € je KW*",null,null,null,null,4500,null,null,null,null,4000]
[null,"* Mindestförderbetrag für leistungsgeregelte oder monovalente Wärmepumpen 1500€\nBasisförderung nur gültig für Gebäudebestand. Keine Neubauförderung."]
[null,"Innovationsförderung",null,null,null,null,null,null,null,null,null,null,"Außenluft",null,null,null,null,"Erdwärmesonde",null,null,null,null,"Sonstige Quellen"]
[null,"Bestandsgebäude",null,null,null,null,null,null,null,null,null,null,"50% Basisförderung",null,null,null,null,"50% Basisförderung",null,null,null,null,"50% Basisförderung"]
[null,"Neubau",null,null,null,null,null,null,null,null,null,null,"100% Basisförderung",null,null,null,null,"100% Basisförderung",null,null,null,null,"100% Basisförderung"]
[]
[null,"Bonusförderung"]
[null,"Bonus Lastmanagementfähigkeit",null,null,null,null,null,null,null,null,null,null,"500 € je Bauvorhaben | Mind. 30 Liter Puffervolumen je KW Heizleistung"]
[null,"Bonus Wärmepumpenoptimierung",null,null,null,null,null,null,null,null,null,null,"250 € je Bauvorhaben | Anlagenkontrolle und -optimierung nach 1 Jahr"]
[null,"Kombinationsbonus ",null,null,null,null,null,null,null,null,null,null,"500 € je Bauvorhaben | Einbindung einer Thermischen Solaranlage"]
[null,"Effizienzbonus",null,null,null,null,null,null,null,null,null,null,"50 % Basisförderung | Gebäudehülle mind. KfW-Effizienzhaus 55"]
[null,"Bonus Heizkesseltausch",null,null,null,null,null,null,null,null,null,null,"20% Gesamtförderung + 600€ Zuschuss für Heizungsoptimierung"]
[null,"Bonus Heizungsoptimierung",null,null,null,null,null,null,null,null,null,null,"10% Kosten für Heizungsoptimierung, max. 50% Basisförderung"]
[]
[]
[]
[]
[]
[]
[]
[]
[]
[]
[]
[]
[]
[]
[]
[]
[]
[]
[]
[]
[]
[]
[]
[]
[]
[]
[null,"Förderbedingungen Solar"]
[]
[null,"Basisförderung",null,null,null,null,null,null,null,null,null,null,"Warmwasserbereitung",null,null,null,null,null,null,"Warmwasser + Heizung"]
[null,"Bruttokollektorfläche",null,null,null,null,null,null,null,null,null,null,"3 - 40 m²",null,null,null,null,null,null,"1 - 40 m²"]
[null,"Fördersumme",null,null,null,null,null,null,null,null,null,null,"50 € je m²",null,null,null,null,null,null,"140 € je m²"]
[null,"Mindestförderbetrag",null,null,null,null,null,null,null,null,null,null,500,null,null,null,null,null,null,2000]
[]
[null,"Innovationsförderung",null,null,null,null,null,null,null,null,null,null,"Warmwasserbereitung",null,null,null,null,null,null,"Warmwasser + Heizung"]
[null,"Bruttokollektorfläche",null,null,null,null,null,null,null,null,null,null,"20 - 100 m²",null,null,null,null,null,null,"20 - 100 m²"]
[null,"Bestandsgebäude",null,null,null,null,null,null,null,null,null,null,"100 € je m²",null,null,null,null,null,null,"200 € je m²"]
[null,"Neubau",null,null,null,null,null,null,null,null,null,null,"75 € je m²",null,null,null,null,null,null,"150 € je m²"]
[]
[null,"Bonusförderung"]
[null,"Effizienzbonus",null,null,null,null,null,null,null,null,null,null,"50 % Basisförderung | Gebäudehülle mind. KfW-Effizienzhaus 55"]
[null,"Kombinationsbonus ",null,null,null,null,null,null,null,null,null,null,"500 € je Bauvorhaben | Förderfähiger Biomassekessel oder Wärmpepumpe"]
[null,"Bonus Heizkesseltausch",null,null,null,null,null,null,null,null,null,null,"20% Gesamtförderung + 600€ Zuschuss für Heizungsoptimierung"]
[]
[]
[]
[]
[]
[]
[]
[]
[]
[]
[]
[]
[]
[]
[]
[]
[]
[]
[]
[]
[]
[]
[]
[]
[]
[]
[]
[]
[]
[]
[]
[]
[]
[]
[]
[]
[]
[]
[]
[]
[]
[]
[]
[]
[]
[]
[]
[]
[]
[]
[]
[]
[]
[]
[]
[]
[]
[]
[]
[]
[]
[]
[]
[]
[]
[]
[]
[]
[]
[]
[]
[]
[]
[]
[]
[]
[]
[]
[]
[]
[]
[]
[]
[]
[]
[]
[]
[]
[]
[]
[]
[]
[]
[]
[]
[]
[]
[]
[]
[]
[]
[]
[]
[]
[]
[]
[]
[]
[]
[]
[]
[]
[]
[]
[]
[]
[]
[]
[]
[]
[]
[]
[]
[]
[]
[]
[]
[]
[]
[]
[]
[]
[]
[]
[]
[]
[]
[]
[]
[]
[]
[]
[]
[]
[]
[]
[]
[]
[]
[]
[]
[]
[]
[]
[]
[]
[]
[]
[]
[]
[]
[]
[]
[]
[]
[]
[]
[]
[]
[]
[]
[]
[]
[]
[]
[]
[]
[]
[]
[]
[]
[]
[]
[]
[]
[]
[]
[]
[]
[]
[]
[]
[]
[]
[]
[]
[]
[]
[]
[]
[]
[]
[]
[]
[]
[]
[]
[]
[]
[]
[]
[]
[]
[]
[]
[]
[]
[]
[]
[]
[]
[]
[]
[]
[]
[]
[]
[]
[]
[]
[]
[]
[]
[]
[]
[]
[]
[]
[]
[]
[]
[]
[]
[]
[]
[]
[]
[]
[]
[]
[]
[]
[]
[]
[]
[]
[]
[]
[]
[]
[]
[]
[]
[]
[]
[]
[]
[]
[]
[]
[]
[]
[]
[]
[]
[]
[]
[]
[]
[]
[]
[]
[]
[]
[]
[]
[]
[]
[]
[]
[]
[]
[]
[]
[]
[]
[]
[]
[]
[]
[]
[]
[]
[]
[]
[]
[]
[]
[]
[]
[]
[]
[]
[]
[]
[]
[]
[]
[]
[]
[]
[]
[]
[]
[]
[]
[]
[]
[]
[]
[]
[]
[]
[]
[]
[]
[]
[]
[]
[]
[]
[]
[]
[]
[]
[]
[]
[]
[]
[]
[]
[]
[]
[]
[]
[]
[]
[]
[]
[]
[]
[]
[]
[]
[]
[]
[]
[]
[]
[]
[]
[]
[]
[]
[]
[]
[]
[]
[]
[]
[]
[]
[]
[]
[null,"Rechtliche Hinweise"]
[]
[null,{"$f":"Berechnung!G270","v":"Stiebel Eltron übernimmt keinerlei Gewährleistung oder Garantie dafür, dass die bereitgestellten Angaben, Werte und Informationen oder die mit Hilfe bzw. anhand dieser Informationen, Werte und Angaben ermittelten Werte und Angaben in jeder Hinsicht vollständig, genau, richtig und aktuell sind. Stiebel Eltron behält sich das Recht vor, jederzeit und ohne vorherige Ankündigung Änderungen der bereitgestellten Angaben, Werte und Informationen vorzunehmen. Irrtum und Änderungen sind ausdrücklich vorbehalten. Keine der bereitgestellten Angaben, Werte und Informationen oder der mit Hilfe bzw. anhand dieser Angaben, Werte und Informationen ermittelten Werte und Angaben sind als Grundlage für eine finanzielle Entscheidung oder für einen sonstigen Zweck anzusehen, sondern dienen vielmehr nur als eine erste unverbindliche Information und als Hilfe zur ersten Orientierung.\n\nDie Haftung von Stiebel Eltron für Schäden jeglicher Art, die sich möglicherweise aus der Nutzung oder Verwendung der bereitgestellten Informationen, Werte und Angaben oder der mit Hilfe bzw. anhand dieser Angaben, Werte und Informationen ermittelten Werte und Angaben, ergeben, ist ausgeschlossen. Dieser Haftungsausschluss gilt nicht, wenn der Schaden auf Vorsatz oder grobe Fahrlässigkeit von Stiebel Eltron zurückzuführen ist sowie bei einer Verletzung des Lebens, des Körpers oder der Gesundheit.\n"}]

{"sheet":"Ausfüllhilfe Online-Antrag","index":4,"n_rows":122,"n_cols":11,"rows_kept":122,"cut":false,"hidden":true,"merged":[]}
["Antrag auf Basisförderung Wärmepumpe",null,null,null,null,null,null,"Antrag auf Innovationsförderung Wärmepumpe"]
[]
["Typ Element","Name Feld HTML","Wert","Bemerkung",null,null,null,"Typ Element","Name Feld HTML","Wert","Bemerkung"]
[1,"Antragsberechtigung","AUTO711","Radio Antragberechtigung, Privatperson = \"AUTO711\"",null,null,null,1,"Antragsberechtigung","Pg1_Obj1","Radio Antragberechtigung, Immer Privatperson"]
[2,"Anrede_1","HERR / FRAU",null,null,null,null,99,"Kommunal","Pg1_Obj17","Kommunale Mehrheitsbeteiligung ja/nein, aktuell nichts anhaken"]
[2,"VornameAnsprechpartner_1","BITTE EINTRAGEN",null,null,null,null,2,"Anrede_1","HERR / FRAU"]
[2,"NachnameAnsprechpartner_1","BITTE EINTRAGEN",null,null,null,null,2,"VornameAnsprechpartner_1","BITTE EINTRAGEN"]
[2,"FirmennameInstitutionsname_1","BITTE EINTRAGEN",null,null,null,null,2,"NachnameAnsprechpartner_1","BITTE EINTRAGEN"]
[2,"StrasseundHausnummer_1","BITTE EINTRAGEN",null,null,null,null,2,"Institutionsname_1","BITTE EINTRAGEN"]
[2,"Postleitzahl_1","EINTRAGEN",null,null,null,null,2,"StrasseundHausnummer_1","BITTE EINTRAGEN"]
[2,"Ort_1","BITTE EINTRAGEN",null,null,null,null,2,"Postleitzahl_1","EINTRAGEN"]
[2,"Telefon_1","EINTRAGEN (OPTIONAL)",null,null,null,null,2,"Ort_1","BITTE EINTRAGEN"]
[2,"EMailAdresse_1","EINTRAGEN (OPTIONAL)",null,null,null,null,2,"Telefon_1","EINTRAGEN (OPTIONAL)"]
[2,"Kontoinhaber","BITTE EINTRAGEN",null,null,null,null,2,"EMailAdresse_1","EINTRAGEN (OPTIONAL)"]
[2,"NamederBank","BITTE EINTRAGEN",null,null,null,null,2,"StrasseundHausnummer_2","BITTE EINTRAGEN"]
[2,"IBAN","BITTE EINTRAGEN",null,null,null,null,2,"Postleitzahl_2",{"$f":"C19","v":"04..."}]
[2,"BIC","BITTE EINTRAGEN",null,null,null,null,2,"Ort_2",{"$f":"C20","v":"Leipzig"}]
[2,"StrasseundHausnummer_2","BITTE EINTRAGEN",null,null,null,null,3,"Vorhabensbeginn",true,"Antrag vor Varhabensbeginn immer auf wahr"]
[2,"Postleitzahl_2",{"$f":"TEXT(Berechnung!C13,\"00000\")","v":"04..."},null,null,null,null,1,"Waermepumpenart",{"$f":"IF(Berechnung!B34=Berechnung!B37,\"Pg2_Obj6\",IF(Berechnung!B34=Berechnung!B39,\"Pg2_Obj12\",IF(Berechnung!H34=Berechnung!H40,\"Pg2_Obj13\",IF(Berechnung!H34=Berechnung!H39,\"Pg2_Obj10\",\"Pg2_Obj11\"))))","v":"Pg2_Obj6"}]
[2,"Ort_2",{"$f":"Berechnung!C14","v":"Leipzig"},null,null,null,null,2,"Datum_Erdsondenbohrung",{"$f":"IF($J$19=\"Pg4_Obj11\",\"BITTE EINTRAGEN\",\"---\")","v":"---"}]
[2,"BaujahrdesGebaeudes",{"$f":"IF(Berechnung!G6=Berechnung!G9,YEAR(TODAY()),\"EINTRAGEN\")","v":"EINTRAGEN"},null,null,null,null,2,"Bezeichnung",{"$f":"C32","v":"---"},"Erdwärmekörbe"]
[1,"gebart",{"$f":"IF(Berechnung!$D$6=Berechnung!$D$9,\"AUTO433\",\"AUTO431\")","v":"AUTO433"},"Gebäudeart: AUTO433=Wohngebäude, AUTO431=Nichtwohngebäude, AUTO432=Mischgebäude",null,null,null,1,"Betriebsweise",{"$f":"IF(Berechnung!$D$34=Berechnung!$D$37,\"Pg2_Obj7\",IF(Berechnung!$D$34=Berechnung!$D$38,\"Pg2_Obj8\",\"Pg2_Obj9\"))","v":"Pg2_Obj8"},"7 = monovalent, 8=monoenerg., 9 =bivalent"]
[2,"Anteilwohn",{"$f":"IF(Berechnung!$D$6=Berechnung!$D$9,100,0)","v":100},"Anteil Wohnfläche (für Mischgebäude, aktuell nicht wählbar im Tool)",null,null,null,2,"Hersteller_2",{"$f":"Berechnung!$G$271","v":"STIEBEL ELTRON GmbH & Co. KG"}]
[2,"AnteilNutz",{"$f":"IF(Berechnung!$D$6=Berechnung!$D$10,100,0)","v":0},"Anteil Nutzfläche",null,null,null,2,"Typbezeichnung",{"$f":"Berechnung!C34","v":"WPL 25 A"}]
[1,"Heizungvorhanden",{"$f":"IF(Berechnung!G6=Berechnung!G9,\"AUTO435\",\"AUTO434\")","v":"AUTO434"},"AUTO434=JA, AUTO435 = Nein, vorher keine Heizung",null,null,null,2,"Nennwaermeleistung",{"$f":"FIXED(Berechnung!$D$147,2)","v":"8,33"}]
[2,"ArtderHeizung_3",{"$f":"IF($C$25=\"AUTO435\",\"---\",\"BITTE EINTRAGEN z.B. ÖL/GAS/ELEKTRO\")","v":"BITTE EINTRAGEN z.B. ÖL/GAS/ELEKTRO"},"Bezeichnung der alten Heizung",null,null,null,2,"Nettoinvestitionssumme","BITTE EINTRAGEN"]
[2,"Installationsdatum_3",{"$f":"IF($C$25=\"AUTO435\",\"---\",\"BITTE EINTRAGEN\")","v":"BITTE EINTRAGEN"},"Nur Datumswerte valid",null,null,null,1,"ArtderWaermepumpe","Pg2_Obj21","Immer Förderung über hohe JAZ"]
[2,"Hersteller_3",{"$f":"IF($C$25=\"AUTO435\",\"---\",\"BITTE EINTRAGEN\")","v":"BITTE EINTRAGEN"},null,null,null,null,2,"Jahresarbeitszahl",{"$f":"FIXED(Berechnung!$E$161,1)","v":"3,8"},"JAZ"]
[2,"Typenbezeichnung_3",{"$f":"IF($C$25=\"AUTO435\",\"---\",\"BITTE EINTRAGEN\")","v":"BITTE EINTRAGEN"},null,null,null,null,2,"Simulationsberechnung","---","JAZ bei Simulationsrechnung, immer leer"]
[1,"pumpenart",{"$f":"IF(Berechnung!B34=Berechnung!B37,\"AUTO436\",IF(Berechnung!B34=Berechnung!B39,\"AUTO439\",IF(Berechnung!H34=Berechnung!H40,\"AUTO441\",IF(Berechnung!H34=Berechnung!H39,\"AUTO437\",\"AUTO438\"))))","v":"AUTO436"},"Luft=AUTO436, Kollektor=AUTO437, Sonde=AUTO438, Wasser=AUTO439, Direktverdampfer=AUTO440, Sonstige = AUTO441",null,null,null,3,"opt66",{"$f":"IF(AND(Berechnung!$D$6=Berechnung!$D$9,Berechnung!$L$34=Berechnung!$L$37),TRUE,FALSE)","v":true},"Kombinierte Warmwasserbereitung und Raumheizung von Gebäuden"]
[2,"Erdsondenbohrung",{"$f":"IF($C$30=\"AUTO438\",\"BITTE EINTRAGEN\",\"---\")","v":"---"},"wenn Sonde gewählt",null,null,null,3,"opt66a",{"$f":"IF(AND(Berechnung!$D$6=Berechnung!$D$9,Berechnung!$N$54=TRUE),TRUE,FALSE)","v":false},"Raumheizung von Gebäuden \u0096 die Warmwasserbereitung des Gebäudes erfolgt zu einem wesentlichen Teil durch andere erneuerbare Energien"]
[2,"Bezeichnung",{"$f":"IF(Berechnung!H34=Berechnung!H40,\"Erdwärmekörbe\",\"---\")","v":"---"},"Erdwärmekörbe",null,null,null,3,"opt66b",{"$f":"IF(Berechnung!$D$6=Berechnung!$D$10,TRUE,FALSE)","v":false},"Raumheizung von Nichtwohngebäuden"]
[1,"verteilung",{"$f":"IF(AND(Berechnung!G34=Berechnung!G37,Berechnung!F34=Berechnung!F42),\"Pg3_Obj1\",IF(Berechnung!G34=Berechnung!G43,\"Pg3_Obj1\",IF(AND(Berechnung!G34=Berechnung!G37,Berechnung!F34<>Berechnung!F42),\"Pg3_Obj2\",IF(OR(Berechnung!G34=Berechnung!G39,Berechnung!G34=Berechnung!G42),\"Pg3_Obj3\",IF(Berechnung!G34=Berechnung!G38,\"Pg3_Obj5\",\"Pg3_Obj4\")))))","v":"Pg3_Obj1"},"1=Radiatoren, 2=Niedrigtempradiatoren, 3=FBH,4=Wand/Decke, 5=Warmluft",null,null,null,3,"opt66c",false,"Bereitstellung von Wärme für Wärmenetze, immer falsch"]
[3,"Kombinationsbonus1",{"$f":"IF(AND(Berechnung!F27=3,Berechnung!P181=TRUE),TRUE,FALSE)","v":false},"Checkbox Kombibonus mit Solaranlage",null,null,null,3,"waermeverteilung",{"$f":"IF(OR(Berechnung!G34=Berechnung!G39,Berechnung!G34=Berechnung!G40,Berechnung!G34=Berechnung!G41,Berechnung!G34=Berechnung!G42),TRUE,FALSE)","v":false},"Wahr=Flächenheizung, falsch=Sonstiges"]
[3,"Kombinationsbonus2",false,"Kombibonus WP mit Biomasse immer auf falsch",null,null,null,2,"Baujahr",{"$f":"IF(Berechnung!G6=Berechnung!G9,YEAR(TODAY()),\"BITTE EINTRAGEN\")","v":"BITTE EINTRAGEN"}]
[{"$f":"IF(AND(C34=FALSE,C35=FALSE),99,1)","v":99},"Foerderantrag","Pg3_Obj8","Pg6_Obj8=Förderantrag liegt bei, Pg6_Obj9=Solarantrag wurde schon gestellt",null,null,null,1,"vorhanden",{"$f":"IF(Berechnung!$G$6=Berechnung!$G$10,\"Pg4_Obj4\",\"Pg4_Obj5\")","v":"Pg4_Obj4"},"alte Heizung vorhanden?"]
[2,"AktenzeichenBMWP","BITTE EINTRAGEN","Nummer des bereits gestellten Solarantrages",null,null,null,2,"Art",{"$f":"IF(Berechnung!$G$6=Berechnung!$G$10,\"BITTE EINTRAGEN\",\"---\")","v":"BITTE EINTRAGEN"}]
[3,"KombinationsbonusErrichtungSolaranlage",false,"PV+Thermie, immer Tool immer falsch",null,null,null,2,"Installationsdatum_1",{"$f":"IF(Berechnung!$G$6=Berechnung!$G$10,\"BITTE EINTRAGEN\",\"---\")","v":"BITTE EINTRAGEN"}]
[3,"KombinationsbonusAnschlussWaermenetz",false,"PV+Thermie, immer Tool immer falsch",null,null,null,2,"Hersteller_1",{"$f":"IF(Berechnung!$G$6=Berechnung!$G$10,\"BITTE EINTRAGEN\",\"---\")","v":"BITTE EINTRAGEN"}]
[3,"ZusatzfoerderungLastmanagementfaehigkeit",{"$f":"Berechnung!AN181","v":true},"Ja/Nein",null,null,null,2,"Typenbezeichnung_1",{"$f":"IF(Berechnung!$G$6=Berechnung!$G$10,\"BITTE EINTRAGEN\",\"---\")","v":"BITTE EINTRAGEN"}]
[3,"ZusatzfoerderungOptimierung",{"$f":"Berechnung!AZ181","v":false},"Ja/Nein",null,null,null,1,"gebart",{"$f":"IF(Berechnung!$D$6=Berechnung!$D$9,\"Pg4_Obj10\",\"Pg4_Obj11\")","v":"Pg4_Obj10"}]
[3,"Gebaeudeeffizienzbonus",{"$f":"Berechnung!E229","v":false},"Ja=Effizienzbonus",null,null,null,2,"AnteilWohnflaeche",{"$f":"IF(Berechnung!$D$6=Berechnung!$D$9,100,0)","v":100},"Anteil Wohnfläche (für Mischgebäude, aktuell nicht wählbar im Tool)"]
[3,"APEE",{"$f":"Berechnung!BF181","v":false},"Ja=Effizienzbonus",null,null,null,2,"AnteilNutzflaeche",{"$f":"IF(Berechnung!$D$6=Berechnung!$D$10,100,0)","v":0},"Anteil Nutzfläche"]
[3,"Kumulierung",false,"Sonstige Zuschüsse, immer nein",null,null,null,2,"Heizlast","BITTE EINTRAGEN"]
[2,"Zuschuss","FALLS SONSTIGE ZUSCHÜSSE GEWÄHRT DANN BITTE EINTRAGEN","Textfeld Art des kummulierten Zuschusses",null,null,null,2,"Datum_3",{"$f":"TEXT(TODAY(),\"TT.MM.JJJJ\")","v":"07.08.2017"}]
[2,"Datum_1",{"$f":"TEXT(TODAY(),\"TT.MM.JJJJ\")","v":"07.08.2017"},"heutiges Datum",null,null,null,2,"Datum_4",{"$f":"TEXT(TODAY(),\"TT.MM.JJJJ\")","v":"07.08.2017"}]
[2,"Anrede_4","HERR / FRAU"]
[2,"Vorname_4","BITTE EINTRAGEN"]
[2,"Nachname_4","BITTE EINTRAGEN"]
[2,"Firmenname_4","BITTE EINTRAGEN"]
[2,"Strasse_4","BITTE EINTRAGEN"]
[2,"Postleitzahl_4","EINTRAGEN"]
[2,"Ort_4","BITTE EINTRAGEN"]
[2,"Telefon_4","EINTRAGEN (OPTIONAL)"]
[2,"EMailAdresse_4","EINTRAGEN (OPTIONAL)"]
[6,"Eigenmontage",false,"nie anhaken"]
[2,"Anrede_5","HERR / FRAU"]
[2,"Vorname_5","BITTE EINTRAGEN"]
[2,"Nachname_5","BITTE EINTRAGEN"]
[2,"Strasse_5","BITTE EINTRAGEN"]
[2,"Postleitzahl_5",{"$f":"TEXT(Berechnung!C13,\"00000\")","v":"04..."},"Standort Anlage"]
[2,"Ort_5",{"$f":"Berechnung!C14","v":"Leipzig"},"Standort Anlage"]
[2,"Inbetriebnahme_6","BITTE EINTRAGEN","Inbetriebnahmedatum leer lassen"]
[2,"Hersteller_6",{"$f":"Berechnung!$G$271","v":"STIEBEL ELTRON GmbH & Co. KG"},"Hersteller Wärmepumpe"]
[2,"Typbezeichnung_6",{"$f":"Berechnung!C34","v":"WPL 25 A"},"Typ-WP"]
[3,"StromGaszaehler",true,"Stromzähler immer eingebaut"]
[3,"Waermemengenzaehler",{"$f":"Berechnung!W38","v":true},"Wahr = WMZ gewählt bzw. eingebaut, falsch=kein WMZ"]
[3,"opt4a",{"$f":"IF(AND(Berechnung!$D$6=Berechnung!$D$9,Berechnung!$L$34=Berechnung!$L$37),TRUE,FALSE)","v":true},"Kombinierte Warmwasserbereitung und Raumheizung von Gebäuden"]
[3,"opt4b",{"$f":"IF(AND(Berechnung!$D$6=Berechnung!$D$9,Berechnung!$N$54=TRUE),TRUE,FALSE)","v":false},"Raumheizung von Gebäuden \u0096 die Warmwasserbereitung des Gebäudes erfolgt zu einem wesentlichen Teil durch andere erneuerbare Energien"]
[3,"opt4c",{"$f":"IF(Berechnung!$D$6=Berechnung!$D$10,TRUE,FALSE)","v":false},"Raumheizung von Nichtwohngebäuden"]
[3,"opt4d",false,"Bereitstellung von Wärme für Wärmenetze, immer falsch"]
[2,"Art_7",{"$f":"IF(Berechnung!$G$6=Berechnung!$G$10,\"BITTE AUSFÜLLEN\",\"---\")","v":"BITTE AUSFÜLLEN"},"Alte Heizung"]
[2,"Installation_7",{"$f":"IF(Berechnung!$G$6=Berechnung!$G$10,\"BITTE AUSFÜLLEN\",\"---\")","v":"BITTE AUSFÜLLEN"},"Alte Heizung"]
[2,"Hersteller_7",{"$f":"IF(Berechnung!$G$6=Berechnung!$G$10,\"BITTE AUSFÜLLEN\",\"---\")","v":"BITTE AUSFÜLLEN"},"Alte Heizung"]
[2,"Typbezeichnung_7",{"$f":"IF(Berechnung!$G$6=Berechnung!$G$10,\"BITTE AUSFÜLLEN\",\"---\")","v":"BITTE AUSFÜLLEN"},"Alte Heizung"]
[3,"HydraulischerAbgleichwirtschaftlich",true,"Haken bei Hydraulischem Abgleich durchgeführt immer setzen"]
[3,"Heizungspaketbonus",{"$f":"Berechnung!BF181","v":false},"Wenn APEE-Bonus möglich dann Haken setzen, sonst nicht"]
[3,"AnschlussanWaermenetz",false,"WärmenetzANschluss WP an Wärmenetz immer auf falsch"]
[2,"Gesamtspeichervolumen",{"$f":"IF(Berechnung!AN181=TRUE,FIXED(Berechnung!G240,0),\"---\")","v":"500"}]
[2,"Errichtung",{"$f":"IF(Berechnung!AN181=TRUE,\"BITTE AUSFÜLLEN\",\"---\")","v":"BITTE AUSFÜLLEN"}]
[3,"Solarkollektoranlage",false,"Checkbox Solar für Wärmequelle, vorerst immer leer"]
[2,"Inbetriebnahme_8","---","Angabe zu PV immer leer"]
[2,"Hersteller_8","---","Angabe zu PV immer leer"]
[2,"Typbezeichnung_8","---","Angabe zu PV immer leer"]
[2,"AnzahlKollektoren_8","---","Angabe zu PV immer leer"]
[2,"Solarkollektoranlage_8","---","Angabe zu PV immer leer"]
[1,"Heizungsvorlauftemperatur",{"$f":"IF(Berechnung!F34=Berechnung!F42,\"Pg7_Obj7\",\"Pg7_Obj8\")","v":"Pg7_Obj7"},"Obj7 = 55°C, Obj8 = Andere"]
[2,"Temperatur",{"$f":"IF(Berechnung!F34=Berechnung!F42,\"---\",Berechnung!F34)","v":"---"},"Abweichende VL-Temp"]
[2,"Nachweis",{"$f":"IF(Berechnung!F34=Berechnung!F42,\"---\",IF(Berechnung!G34=Berechnung!G38,\"Gebläsekonvektoren\",IF(Berechnung!G34=Berechnung!G37,\"Niedrigtemperaturheizkörper\",Berechnung!G34)))","v":"---"}]
[2,"tempdiff_1",{"$f":"FIXED(VLOOKUP(Berechnung!C34,Leistungsdaten!G:H,2,FALSE),1)","v":"5,0"},"Temperaturdifferenz am Verflüssiger bei Prüfstandsmessung nach DIN EN 14511 [K]"]
[2,"tempdiff_2",{"$f":"IF(OR(Berechnung!G34=Berechnung!G39,Berechnung!G34=Berechnung!G40,Berechnung!G34=Berechnung!G41,Berechnung!G34=Berechnung!G42),\"7,0\",\"10,0\")","v":"10,0"},"Temperaturdifferenz am Verflüssiger bei Betrieb [K]"]
[{"$f":"IF(Berechnung!B34<>Berechnung!B37,99,1)","v":1},"Normaussentemperatur",{"$f":"IF(Berechnung!B34<>Berechnung!B37,\"\",IF(Berechnung!M6<=-16,\"Pg7_Obj16\",IF(OR(Berechnung!M6=-14,Berechnung!M6=-15),\"Pg7_Obj15\",IF(OR(Berechnung!M6=-12,Berechnung!M6=-13),\"Pg7_Obj14\",\"Pg7_Obj13\"))))","v":"Pg7_Obj15"},"Radios für Temperaturbereiche"]
[{"$f":"IF(Berechnung!B34<>Berechnung!B37,99,1)","v":1},"Heizgrenztemperatur",{"$f":"IF(LEFT(Berechnung!N6,2)*1=15,\"Pg7_Obj17\",IF(LEFT(Berechnung!N6,2)*1=12,\"Pg7_Obj18\",\"Pg7_Obj19\"))","v":"Pg7_Obj17"},"10/12/15 °C"]
[{"$f":"IF(Berechnung!B34<>Berechnung!B37,99,2)","v":2},"A7W35",{"$f":"Berechnung!H207","v":"2,93"},"A-7/W35"]
[{"$f":"IF(Berechnung!B34<>Berechnung!B37,99,2)","v":2},"A2W35",{"$f":"Berechnung!H208","v":"4,17"},"A2/W35"]
[{"$f":"IF(Berechnung!B34<>Berechnung!B37,99,2)","v":2},"A10W35",{"$f":"Berechnung!H209","v":"5,16"},"A10/W35"]
[{"$f":"IF(Berechnung!$B$34<>Berechnung!$B$39,99,2)","v":99},"Grundwassertemperatur",{"$f":"Berechnung!P34","v":2},"Grundwassertemp"]
[{"$f":"IF(Berechnung!$B$34<>Berechnung!$B$39,99,1)","v":99},"Zwischenkreis",{"$f":"IF(Berechnung!B54=TRUE,\"Pg7_Obj25\",\"Pg7_Obj24\")","v":"Pg7_Obj24"},"Anlage mit Zwischen-WT ? Vorerst immer Ja"]
[{"$f":"IF(Berechnung!$B$34<>Berechnung!$B$39,99,1)","v":99},"Leistungsaufnahme",{"$f":"IF(Berechnung!J140=Berechnung!H143,\"Pg7_Obj26\",\"Pg7_Obj27\")","v":"Pg7_Obj26"},"Leistungsaufnahme Grundwasserpumpe nach VDI? Ja=26, Nein=27"]
[{"$f":"IF(Berechnung!$B$34<>Berechnung!$B$39,99,2)","v":99},"AngabeHersteller",{"$f":"IF(C99=\"Pg10_Obj26\",\"---\",IF(Berechnung!B54=TRUE,Berechnung!K138*1000&\" W  (\"&Berechnung!K139&\")\",Berechnung!J138*1000&\" W  (\"&Berechnung!J139&\")\"))","v":"1042,5 W  (-)"},"Pumpenleistung Herstellerangabe"]
[{"$f":"IF(Berechnung!$B$34<>Berechnung!$B$39,99,2)","v":99},"W10W35",{"$f":"Berechnung!H207&\" (B0/W35)\"","v":"2,93 (B0/W35)"},"Wasser/Wasser"]
[{"$f":"IF(Berechnung!$B$34<>Berechnung!$B$38,99,2)","v":99},"MittelwertderminimalenSoleErdreichtemperatur",{"$f":"Berechnung!P34","v":2},"Sole/Wasser"]
[{"$f":"IF(Berechnung!$B$34<>Berechnung!$B$38,99,1)","v":99},"Leistungsaufnahme_2",{"$f":"IF(Berechnung!I136=Berechnung!H143,\"Pg8_Obj2\",\"Pg8_Obj3\")","v":"Pg8_Obj2"},"Obj2 = nach VDI, Obj3 = Manuell"]
[{"$f":"IF(Berechnung!$B$34<>Berechnung!$B$38,99,2)","v":99},"AngabeHersteller_2",{"$f":"IF(C103=\"Pg11_Obj2\",\"---\",Berechnung!I134*1000&\" W  (\"&Berechnung!I135&\")\")","v":"5160 W  (-)"},"Pumpenleistung manuell"]
[{"$f":"IF(Berechnung!$B$34<>Berechnung!$B$38,99,2)","v":99},"SoleB0W35",{"$f":"Berechnung!H207","v":"2,93"},"COP"]
[{"$f":"IF(Berechnung!$B$34<>Berechnung!$B$38,99,2)","v":99},"DirektverdampfungE1W35","---","immer leer"]
[2,"JahresarbeitszahlRaumheizung",{"$f":"FIXED(Berechnung!E158,1)","v":"3,9"},"Jahresarbeitszahl Heizung"]
[2,"JahresarbeitszahlWarmwasserbereitung",{"$f":"FIXED(Berechnung!E160,1)","v":"4,5"},"Jahresarbeitszahl Warmwasser"]
[1,"Warmwasserbereitung",{"$f":"IF(Berechnung!R34=0.18,\"AUTO573\",\"AUTO574\")","v":"AUTO573"},"Anteil WWB 573=Standard VDI, 574=Manuell"]
[2,"AngabeWert",{"$f":"IF(Berechnung!R34=0.18,\"---\",Berechnung!R34*100)","v":"---"},"Manueller Anteil WWB"]
[1,"Betriebsweise",{"$f":"IF(Berechnung!$D$34=Berechnung!$D$37,\"AUTO575\",IF(Berechnung!$D$34=Berechnung!$D$38,\"AUTO577\",\"AUTO576\"))","v":"AUTO577"},"Betriebsweise: 575=Monovalent. 577=Monoenerg., 576=bivalent"]
[2,"Energietraeger",{"$f":"IF(Berechnung!D34=Berechnung!D39,\"BITTE EINTRAGEN\",\"---\")","v":"---"},"Typ 2. WE"]
[2,"Nennwaermeleistung",{"$f":"IF(Berechnung!D34=Berechnung!D39,\"BITTE EINTRAGEN\",\"---\")","v":"---"},"Leistung 2. WE"]
[{"$f":"IF(Berechnung!D34=Berechnung!D37,99,1)","v":1},"Betriebsweise_2","AUTO578","Parallel oder alternativ (immer parallel ankreuzen, bei monovalent nichts wählen)"]
[2,"Deckungsanteil",{"$f":"FIXED(Berechnung!Q34,2)","v":"0,98"},"Deckungsanteil WP"]
[2,"Bivalenzpunkt",{"$f":"IF(Berechnung!D34=Berechnung!D37,\"-\",Berechnung!E34)","v":"-5 °C"},"Bivalenzpunkt"]
[2,"GesamtJahresarbeitszahl",{"$f":"FIXED(Berechnung!E161,1)","v":"3,8"},"Gesamt-JAZ"]
[2,"Datum_2",{"$f":"TEXT(TODAY(),\"TT.MM.JJJJ\")","v":"07.08.2017"},"Datum für FHW"]
[2,"Datum_3",{"$f":"TEXT(TODAY(),\"TT.MM.JJJJ\")","v":"07.08.2017"},"Datum Antragsteller"]
[{"$f":"IF(Berechnung!$E$222=FALSE,99,2)","v":99},"SummederNettobetraege",{"$f":"Berechnung!U6&\" €\"","v":"5000 €"}]
[{"$f":"IF(Berechnung!$E$222=FALSE,99,2)","v":99},"Datum_5",{"$f":"TEXT(TODAY(),\"TT.MM.JJJJ\")","v":"07.08.2017"}]
[{"$f":"IF(Berechnung!$E$222=FALSE,99,2)","v":99},"Datum_6","07.08.2017"]

{"sheet":"Tabellen VDI4650","index":5,"n_rows":163,"n_cols":12,"rows_kept":163,"cut":false,"hidden":true,"merged":[[6,1,14,1],[6,10,14,10],[15,1,23,1],[15,10,23,10],[24,1,32,1],[24,10,32,10],[36,1,44,1],[36,10,44,10],[45,1,53,1],[45,10,53,10],[54,1,62,1],[54,10,62,10],[66,1,74,1],[66,10,74,10],[75,1,83,1],[75,10,83,10],[84,1,92,1],[84,10,92,10],[149,9,162,9],[157,1,157,2],[158,1,158,2],[159,1,159,2],[160,1,160,2],[161,1,161,2],[162,1,162,2],[154,1,154,2],[155,1,155,2],[156,1,156,2],[153,1,153,2],[152,1,152,2],[110,1,110,2],[120,1,120,2],[118,1,118,2],[125,1,125,2],[131,1,131,2],[117,1,117,2],[123,1,123,2],[134,1,134,2],[136,1,136,2],[114,1,114,2],[111,1,111,2],[112,1,112,2],[113,1,113,2],[124,1,124,2],[135,1,135,2],[133,1,133,2],[148,1,148,2],[150,1,150,2],[151,1,151,2],[111,9,136,9],[149,1,149,2],[130,1,130,2],[132,1,132,2],[119,1,119,2],[129,1,129,2],[128,1,128,2],[121,1,121,2],[127,1,127,2],[122,1,122,2],[126,1,126,2],[115,1,115,2],[116,1,116,2]]}
[]
[]
[]
[]
[null,"JAZ Luft-Wasser - Korrekturfaktor F1"]
[null,"Heizgrenze","Norm-Außentemp.","30 °C","35 °C","40 °C","45 °C","50 °C","55 °C","Bei Vorlauftemp.","bei Norm-Außentemp."]
[null,"10 °C",-10,0.109,0.10299999999999999,9.7000000000000003E-2,9.0999999999999998E-2,8.5000000000000006E-2,0.08,{"$f":"HLOOKUP(Berechnung!$F$34,$D$6:$I$33,L7,FALSE)","v":0.08},{"$f":"VLOOKUP(Berechnung!$M$6,$C$7:$J$15,8,FALSE)","v":0.154},2]
[null,null,-11,{"$f":"AVERAGE(D7,D9)","v":0.13450000000000001},0.127,0.12,0.113,0.10600000000000001,9.9500000000000005E-2,{"$f":"HLOOKUP(Berechnung!$F$34,$D$6:$I$33,L8,FALSE)","v":9.9500000000000005E-2},null,3]
[null,null,-12,0.16,0.151,0.14299999999999999,0.13500000000000001,0.127,0.11899999999999999,{"$f":"HLOOKUP(Berechnung!$F$34,$D$6:$I$33,L9,FALSE)","v":0.11899999999999999},null,4]
[null,null,-13,{"$f":"AVERAGE(D9,D11)","v":0.182},0.17249999999999999,0.16349999999999998,0.1545,0.14550000000000002,0.13650000000000001,{"$f":"HLOOKUP(Berechnung!$F$34,$D$6:$I$33,L10,FALSE)","v":0.13650000000000001},null,5]
[null,null,-14,0.20399999999999999,0.19400000000000001,0.184,0.17399999999999999,0.16400000000000001,0.154,{"$f":"HLOOKUP(Berechnung!$F$34,$D$6:$I$33,L11,FALSE)","v":0.154},null,6]
[null,null,-15,{"$f":"AVERAGE(D11,D13)","v":0.26100000000000001},0.2485,0.23599999999999999,0.2235,0.21150000000000002,0.19900000000000001,{"$f":"HLOOKUP(Berechnung!$F$34,$D$6:$I$33,L12,FALSE)","v":0.19900000000000001},null,7]
[null,null,-16,0.318,0.30299999999999999,0.28799999999999998,0.27300000000000002,0.25900000000000001,0.24399999999999999,{"$f":"HLOOKUP(Berechnung!$F$34,$D$6:$I$33,L13,FALSE)","v":0.24399999999999999},null,8]
[null,null,-17,{"$f":"AVERAGE(D13,D15)","v":0.318},0.30299999999999999,0.28799999999999998,0.27300000000000002,0.25900000000000001,0.24399999999999999,{"$f":"HLOOKUP(Berechnung!$F$34,$D$6:$I$33,L14,FALSE)","v":0.24399999999999999},null,9]
[null,null,-18,0.318,0.30299999999999999,0.28799999999999998,0.27300000000000002,0.25900000000000001,0.24399999999999999,{"$f":"HLOOKUP(Berechnung!$F$34,$D$6:$I$33,L15,FALSE)","v":0.24399999999999999},null,10]
[null,"12 °C",-10,8.8999999999999996E-2,8.5000000000000006E-2,0.08,7.4999999999999997E-2,7.0000000000000007E-2,6.6000000000000003E-2,{"$f":"HLOOKUP(Berechnung!$F$34,$D$6:$I$33,L16,FALSE)","v":6.6000000000000003E-2},{"$f":"VLOOKUP(Berechnung!$M$6,$C$16:$J$24,8,FALSE)","v":0.13300000000000001},11]
[null,null,-11,{"$f":"AVERAGE(D16,D18)","v":0.112},0.10650000000000001,0.10050000000000001,9.4500000000000001E-2,8.8999999999999996E-2,8.3500000000000005E-2,{"$f":"HLOOKUP(Berechnung!$F$34,$D$6:$I$33,L17,FALSE)","v":8.3500000000000005E-2},null,12]
[null,null,-12,0.13500000000000001,0.128,0.121,0.114,0.108,0.10100000000000001,{"$f":"HLOOKUP(Berechnung!$F$34,$D$6:$I$33,L18,FALSE)","v":0.10100000000000001},null,13]
[null,null,-13,{"$f":"AVERAGE(D18,D20)","v":0.1555},0.14750000000000002,0.13950000000000001,0.13200000000000001,0.1245,0.11700000000000001,{"$f":"HLOOKUP(Berechnung!$F$34,$D$6:$I$33,L19,FALSE)","v":0.11700000000000001},null,14]
[null,null,-14,0.17599999999999999,0.16700000000000001,0.158,0.15,0.14099999999999999,0.13300000000000001,{"$f":"HLOOKUP(Berechnung!$F$34,$D$6:$I$33,L20,FALSE)","v":0.13300000000000001},null,15]
[null,null,-15,{"$f":"AVERAGE(D20,D22)","v":0.22750000000000001},0.21650000000000003,0.20550000000000002,0.19500000000000001,0.184,0.17349999999999999,{"$f":"HLOOKUP(Berechnung!$F$34,$D$6:$I$33,L21,FALSE)","v":0.17349999999999999},null,16]
[null,null,-16,0.27900000000000003,0.26600000000000001,0.253,0.24,0.22700000000000001,0.214,{"$f":"HLOOKUP(Berechnung!$F$34,$D$6:$I$33,L22,FALSE)","v":0.214},null,17]
[null,null,-17,{"$f":"AVERAGE(D22,D24)","v":0.27900000000000003},0.26600000000000001,0.253,0.24,0.22700000000000001,0.214,{"$f":"HLOOKUP(Berechnung!$F$34,$D$6:$I$33,L23,FALSE)","v":0.214},null,18]
[null,null,-18,0.27900000000000003,0.26600000000000001,0.253,0.24,0.22700000000000001,0.214,{"$f":"HLOOKUP(Berechnung!$F$34,$D$6:$I$33,L24,FALSE)","v":0.214},null,19]
[null,"15 °C",-10,7.0000000000000007E-2,6.6000000000000003E-2,6.2E-2,5.8999999999999997E-2,5.5E-2,5.0999999999999997E-2,{"$f":"HLOOKUP(Berechnung!$F$34,$D$6:$I$33,L25,FALSE)","v":5.0999999999999997E-2},{"$f":"VLOOKUP(Berechnung!$M$6,$C$25:$J$33,8,FALSE)","v":0.109},20]
[null,null,-11,{"$f":"AVERAGE(D25,D27)","v":8.9499999999999996E-2},8.4999999999999992E-2,0.08,7.5499999999999998E-2,7.0999999999999994E-2,6.6000000000000003E-2,{"$f":"HLOOKUP(Berechnung!$F$34,$D$6:$I$33,L26,FALSE)","v":6.6000000000000003E-2},null,21]
[null,null,-12,0.109,0.104,9.8000000000000004E-2,9.1999999999999998E-2,8.6999999999999994E-2,8.1000000000000003E-2,{"$f":"HLOOKUP(Berechnung!$F$34,$D$6:$I$33,L27,FALSE)","v":8.1000000000000003E-2},null,22]
[null,null,-13,{"$f":"AVERAGE(D27,D29)","v":0.1265},0.1205,0.114,0.1075,0.10150000000000001,9.5000000000000001E-2,{"$f":"HLOOKUP(Berechnung!$F$34,$D$6:$I$33,L28,FALSE)","v":9.5000000000000001E-2},null,23]
[null,null,-14,0.14399999999999999,0.13700000000000001,0.13,0.123,0.11600000000000001,0.109,{"$f":"HLOOKUP(Berechnung!$F$34,$D$6:$I$33,L29,FALSE)","v":0.109},null,24]
[null,null,-15,{"$f":"AVERAGE(D29,D31)","v":0.1895},0.18049999999999999,0.17149999999999999,0.16250000000000001,0.1535,0.14449999999999999,{"$f":"HLOOKUP(Berechnung!$F$34,$D$6:$I$33,L30,FALSE)","v":0.14449999999999999},null,25]
[null,null,-16,0.23499999999999999,0.224,0.21299999999999999,0.20200000000000001,0.191,0.18,{"$f":"HLOOKUP(Berechnung!$F$34,$D$6:$I$33,L31,FALSE)","v":0.18},null,26]
[null,null,-17,{"$f":"AVERAGE(D31,D33)","v":0.23499999999999999},0.224,0.21299999999999999,0.20200000000000001,0.191,0.18,{"$f":"HLOOKUP(Berechnung!$F$34,$D$6:$I$33,L32,FALSE)","v":0.18},null,27]
[null,null,-18,0.23499999999999999,0.224,0.21299999999999999,0.20200000000000001,0.191,0.18,{"$f":"HLOOKUP(Berechnung!$F$34,$D$6:$I$33,L33,FALSE)","v":0.18},null,28]
[]
[null,"JAZ Luft-Wasser - Korrekturfaktor F2"]
[null,"Heizgrenze","Stadt","30 °C","35 °C","40 °C","45 °C","50 °C","55 °C","Bei Vorlauftemp.","bei Norm-Außentemp.","Hilfsspalte"]
[null,"10 °C",-10,0.94199999999999995,0.90300000000000002,0.86299999999999999,0.82399999999999995,0.78500000000000003,0.745,{"$f":"HLOOKUP(Berechnung!$F$34,$D$36:$I$63,L37,FALSE)","v":0.745},{"$f":"VLOOKUP(Berechnung!$M$6,$C$37:$J$45,8,FALSE)","v":0.67900000000000005},2]
[null,null,-11,{"$f":"AVERAGE(D37,D39)","v":0.91549999999999998},0.878,0.84,0.80249999999999999,0.76500000000000001,0.72699999999999998,{"$f":"HLOOKUP(Berechnung!$F$34,$D$36:$I$63,L38,FALSE)","v":0.72699999999999998},null,3]
[null,null,-12,0.88900000000000001,0.85299999999999998,0.81699999999999995,0.78100000000000003,0.745,0.70899999999999996,{"$f":"HLOOKUP(Berechnung!$F$34,$D$36:$I$63,L39,FALSE)","v":0.70899999999999996},null,4]
[null,null,-13,{"$f":"AVERAGE(D39,D41)","v":0.86699999999999999},0.83250000000000002,0.79800000000000004,0.76350000000000007,0.72849999999999993,0.69399999999999995,{"$f":"HLOOKUP(Berechnung!$F$34,$D$36:$I$63,L40,FALSE)","v":0.69399999999999995},null,5]
[null,null,-14,0.84499999999999997,0.81200000000000006,0.77900000000000003,0.746,0.71199999999999997,0.67900000000000005,{"$f":"HLOOKUP(Berechnung!$F$34,$D$36:$I$63,L41,FALSE)","v":0.67900000000000005},null,6]
[null,null,-15,{"$f":"AVERAGE(D41,D43)","v":0.78849999999999998},0.75800000000000001,0.72750000000000004,0.69750000000000001,0.66649999999999998,0.63600000000000001,{"$f":"HLOOKUP(Berechnung!$F$34,$D$36:$I$63,L42,FALSE)","v":0.63600000000000001},null,7]
[null,null,-16,0.73199999999999998,0.70399999999999996,0.67600000000000005,0.64900000000000002,0.621,0.59299999999999997,{"$f":"HLOOKUP(Berechnung!$F$34,$D$36:$I$63,L43,FALSE)","v":0.59299999999999997},null,8]
[null,null,-17,{"$f":"AVERAGE(D43,D45)","v":0.73199999999999998},0.70399999999999996,0.67600000000000005,0.64900000000000002,0.621,0.59299999999999997,{"$f":"HLOOKUP(Berechnung!$F$34,$D$36:$I$63,L44,FALSE)","v":0.59299999999999997},null,9]
[null,null,-18,0.73199999999999998,0.70399999999999996,0.67600000000000005,0.64900000000000002,0.621,0.59299999999999997,{"$f":"HLOOKUP(Berechnung!$F$34,$D$36:$I$63,L45,FALSE)","v":0.59299999999999997},null,10]
[null,"12 °C",-10,0.89100000000000001,0.85399999999999998,0.81699999999999995,0.78100000000000003,0.74399999999999999,0.70699999999999996,{"$f":"HLOOKUP(Berechnung!$F$34,$D$36:$I$63,L46,FALSE)","v":0.70699999999999996},{"$f":"VLOOKUP(Berechnung!$M$6,$C$46:$J$54,8,FALSE)","v":0.66600000000000004},11]
[null,null,-11,{"$f":"AVERAGE(D46,D48)","v":0.875},0.83899999999999997,0.80299999999999994,0.76800000000000002,0.73199999999999998,0.69650000000000001,{"$f":"HLOOKUP(Berechnung!$F$34,$D$36:$I$63,L47,FALSE)","v":0.69650000000000001},null,12]
[null,null,-12,0.85899999999999999,0.82399999999999995,0.78900000000000003,0.755,0.72,0.68600000000000005,{"$f":"HLOOKUP(Berechnung!$F$34,$D$36:$I$63,L48,FALSE)","v":0.68600000000000005},null,13]
[null,null,-13,{"$f":"AVERAGE(D48,D50)","v":0.84299999999999997},0.8095,0.77600000000000002,0.74249999999999994,0.70899999999999996,0.67600000000000005,{"$f":"HLOOKUP(Berechnung!$F$34,$D$36:$I$63,L49,FALSE)","v":0.67600000000000005},null,14]
[null,null,-14,0.82699999999999996,0.79500000000000004,0.76300000000000001,0.73,0.69799999999999995,0.66600000000000004,{"$f":"HLOOKUP(Berechnung!$F$34,$D$36:$I$63,L50,FALSE)","v":0.66600000000000004},null,15]
[null,null,-15,{"$f":"AVERAGE(D50,D52)","v":0.77749999999999997},0.74750000000000005,0.71799999999999997,0.6875,0.65799999999999992,0.628,{"$f":"HLOOKUP(Berechnung!$F$34,$D$36:$I$63,L51,FALSE)","v":0.628},null,16]
[null,null,-16,0.72799999999999998,0.7,0.67300000000000004,0.64500000000000002,0.61799999999999999,0.59,{"$f":"HLOOKUP(Berechnung!$F$34,$D$36:$I$63,L52,FALSE)","v":0.59},null,17]
[null,null,-17,{"$f":"AVERAGE(D52,D54)","v":0.72799999999999998},0.7,0.67300000000000004,0.64500000000000002,0.61799999999999999,0.59,{"$f":"HLOOKUP(Berechnung!$F$34,$D$36:$I$63,L53,FALSE)","v":0.59},null,18]
[null,null,-18,0.72799999999999998,0.7,0.67300000000000004,0.64500000000000002,0.61799999999999999,0.59,{"$f":"HLOOKUP(Berechnung!$F$34,$D$36:$I$63,L54,FALSE)","v":0.59},null,19]
[null,"15 °C",-10,0.79900000000000004,0.76600000000000001,0.73399999999999999,0.70099999999999996,0.66800000000000004,0.63500000000000001,{"$f":"HLOOKUP(Berechnung!$F$34,$D$36:$I$63,L55,FALSE)","v":0.63500000000000001},{"$f":"VLOOKUP(Berechnung!$M$6,$C$55:$J$63,8,FALSE)","v":0.626},20]
[null,null,-11,{"$f":"AVERAGE(D55,D57)","v":0.79649999999999999},0.76400000000000001,0.73199999999999998,0.69950000000000001,0.66749999999999998,0.63500000000000001,{"$f":"HLOOKUP(Berechnung!$F$34,$D$36:$I$63,L56,FALSE)","v":0.63500000000000001},null,21]
[null,null,-12,0.79400000000000004,0.76200000000000001,0.73,0.69799999999999995,0.66700000000000004,0.63500000000000001,{"$f":"HLOOKUP(Berechnung!$F$34,$D$36:$I$63,L57,FALSE)","v":0.63500000000000001},null,22]
[null,null,-13,{"$f":"AVERAGE(D57,D59)","v":0.78500000000000003},0.754,0.72299999999999998,0.69199999999999995,0.66149999999999998,0.63050000000000006,{"$f":"HLOOKUP(Berechnung!$F$34,$D$36:$I$63,L58,FALSE)","v":0.63050000000000006},null,23]
[null,null,-14,0.77600000000000002,0.746,0.71599999999999997,0.68600000000000005,0.65600000000000003,0.626,{"$f":"HLOOKUP(Berechnung!$F$34,$D$36:$I$63,L59,FALSE)","v":0.626},null,24]
[null,null,-15,{"$f":"AVERAGE(D59,D61)","v":0.73550000000000004},0.70700000000000007,0.67900000000000005,0.65100000000000002,0.623,0.59499999999999997,{"$f":"HLOOKUP(Berechnung!$F$34,$D$36:$I$63,L60,FALSE)","v":0.59499999999999997},null,25]
[null,null,-16,0.69499999999999995,0.66800000000000004,0.64200000000000002,0.61599999999999999,0.59,0.56399999999999995,{"$f":"HLOOKUP(Berechnung!$F$34,$D$36:$I$63,L61,FALSE)","v":0.56399999999999995},null,26]
[null,null,-17,{"$f":"AVERAGE(D61,D63)","v":0.69499999999999995},0.66800000000000004,0.64200000000000002,0.61599999999999999,0.59,0.56399999999999995,{"$f":"HLOOKUP(Berechnung!$F$34,$D$36:$I$63,L62,FALSE)","v":0.56399999999999995},null,27]
[null,null,-18,0.69499999999999995,0.66800000000000004,0.64200000000000002,0.61599999999999999,0.59,0.56399999999999995,{"$f":"HLOOKUP(Berechnung!$F$34,$D$36:$I$63,L63,FALSE)","v":0.56399999999999995},null,28]
[]
[null,"JAZ Luft-Wasser - Korrekturfaktor F3"]
[null,"Heizgrenze","Stadt","30 °C","35 °C","40 °C","45 °C","50 °C","55 °C","Bei Vorlauftemp.","bei Norm-Außentemp."]
[null,"10 °C",-10,6.3E-2,6.0999999999999999E-2,5.8999999999999997E-2,5.7000000000000002E-2,5.5E-2,5.2999999999999999E-2,{"$f":"HLOOKUP(Berechnung!$F$34,$D$66:$I$93,L67,FALSE)","v":5.2999999999999999E-2},{"$f":"VLOOKUP(Berechnung!$M$6,$C$67:$J$75,8,FALSE)","v":3.5999999999999997E-2},2]
[null,null,-11,{"$f":"AVERAGE(D67,D69)","v":5.6999999999999995E-2},5.5E-2,5.2999999999999999E-2,5.1500000000000004E-2,4.9500000000000002E-2,4.7500000000000001E-2,{"$f":"HLOOKUP(Berechnung!$F$34,$D$66:$I$93,L68,FALSE)","v":4.7500000000000001E-2},null,3]
[null,null,-12,5.0999999999999997E-2,4.9000000000000002E-2,4.7E-2,4.5999999999999999E-2,4.3999999999999997E-2,4.2000000000000003E-2,{"$f":"HLOOKUP(Berechnung!$F$34,$D$66:$I$93,L69,FALSE)","v":4.2000000000000003E-2},null,4]
[null,null,-13,{"$f":"AVERAGE(D69,D71)","v":4.7E-2},4.5499999999999999E-2,4.3499999999999997E-2,4.2499999999999996E-2,4.0999999999999995E-2,3.9E-2,{"$f":"HLOOKUP(Berechnung!$F$34,$D$66:$I$93,L70,FALSE)","v":3.9E-2},null,5]
[null,null,-14,4.2999999999999997E-2,4.2000000000000003E-2,0.04,3.9E-2,3.7999999999999999E-2,3.5999999999999997E-2,{"$f":"HLOOKUP(Berechnung!$F$34,$D$66:$I$93,L71,FALSE)","v":3.5999999999999997E-2},null,6]
[null,null,-15,{"$f":"AVERAGE(D71,D73)","v":3.9499999999999993E-2},3.8500000000000006E-2,3.7000000000000005E-2,3.6000000000000004E-2,3.5000000000000003E-2,3.3500000000000002E-2,{"$f":"HLOOKUP(Berechnung!$F$34,$D$66:$I$93,L72,FALSE)","v":3.3500000000000002E-2},null,7]
[null,null,-16,3.5999999999999997E-2,3.5000000000000003E-2,3.4000000000000002E-2,3.3000000000000002E-2,3.2000000000000001E-2,3.1E-2,{"$f":"HLOOKUP(Berechnung!$F$34,$D$66:$I$93,L73,FALSE)","v":3.1E-2},null,8]
[null,null,-17,{"$f":"AVERAGE(D73,D75)","v":3.5999999999999997E-2},3.5000000000000003E-2,3.4000000000000002E-2,3.3000000000000002E-2,3.2000000000000001E-2,3.1E-2,{"$f":"HLOOKUP(Berechnung!$F$34,$D$66:$I$93,L74,FALSE)","v":3.1E-2},null,9]
[null,null,-18,3.5999999999999997E-2,3.5000000000000003E-2,3.4000000000000002E-2,3.3000000000000002E-2,3.2000000000000001E-2,3.1E-2,{"$f":"HLOOKUP(Berechnung!$F$34,$D$66:$I$93,L75,FALSE)","v":3.1E-2},null,10]
[null,"12 °C",-10,0.13900000000000001,0.13400000000000001,0.13,0.125,0.121,0.11600000000000001,{"$f":"HLOOKUP(Berechnung!$F$34,$D$66:$I$93,L76,FALSE)","v":0.11600000000000001},{"$f":"VLOOKUP(Berechnung!$M$6,$C$76:$J$84,8,FALSE)","v":8.2000000000000003E-2},11]
[null,null,-11,{"$f":"AVERAGE(D76,D78)","v":0.1255},0.121,0.11749999999999999,0.113,0.1095,0.10500000000000001,{"$f":"HLOOKUP(Berechnung!$F$34,$D$66:$I$93,L77,FALSE)","v":0.10500000000000001},null,12]
[null,null,-12,0.112,0.108,0.105,0.10100000000000001,9.8000000000000004E-2,9.4E-2,{"$f":"HLOOKUP(Berechnung!$F$34,$D$66:$I$93,L78,FALSE)","v":9.4E-2},null,13]
[null,null,-13,{"$f":"AVERAGE(D78,D80)","v":0.10450000000000001},0.10100000000000001,9.8000000000000004E-2,9.4500000000000001E-2,9.1499999999999998E-2,8.7999999999999995E-2,{"$f":"HLOOKUP(Berechnung!$F$34,$D$66:$I$93,L79,FALSE)","v":8.7999999999999995E-2},null,14]
[null,null,-14,9.7000000000000003E-2,9.4E-2,9.0999999999999998E-2,8.7999999999999995E-2,8.5000000000000006E-2,8.2000000000000003E-2,{"$f":"HLOOKUP(Berechnung!$F$34,$D$66:$I$93,L80,FALSE)","v":8.2000000000000003E-2},null,15]
[null,null,-15,{"$f":"AVERAGE(D80,D82)","v":9.1499999999999998E-2},8.8499999999999995E-2,8.5999999999999993E-2,8.299999999999999E-2,8.0500000000000002E-2,7.7499999999999999E-2,{"$f":"HLOOKUP(Berechnung!$F$34,$D$66:$I$93,L81,FALSE)","v":7.7499999999999999E-2},null,16]
[null,null,-16,8.5999999999999993E-2,8.3000000000000004E-2,8.1000000000000003E-2,7.8E-2,7.5999999999999998E-2,7.2999999999999995E-2,{"$f":"HLOOKUP(Berechnung!$F$34,$D$66:$I$93,L82,FALSE)","v":7.2999999999999995E-2},null,17]
[null,null,-17,{"$f":"AVERAGE(D82,D84)","v":8.5999999999999993E-2},8.3000000000000004E-2,8.1000000000000003E-2,7.8E-2,7.5999999999999998E-2,7.2999999999999995E-2,{"$f":"HLOOKUP(Berechnung!$F$34,$D$66:$I$93,L83,FALSE)","v":7.2999999999999995E-2},null,18]
[null,null,-18,8.5999999999999993E-2,8.3000000000000004E-2,8.1000000000000003E-2,7.8E-2,7.5999999999999998E-2,7.2999999999999995E-2,{"$f":"HLOOKUP(Berechnung!$F$34,$D$66:$I$93,L84,FALSE)","v":7.2999999999999995E-2},null,19]
[null,"15 °C",-10,0.25800000000000001,0.25,0.24199999999999999,0.23300000000000001,0.22500000000000001,0.217,{"$f":"HLOOKUP(Berechnung!$F$34,$D$66:$I$93,L85,FALSE)","v":0.217},{"$f":"VLOOKUP(Berechnung!$M$6,$C$85:$J$93,8,FALSE)","v":0.16},20]
[null,null,-11,{"$f":"AVERAGE(D85,D87)","v":0.23499999999999999},0.22749999999999998,0.22,0.21250000000000002,0.20500000000000002,0.19800000000000001,{"$f":"HLOOKUP(Berechnung!$F$34,$D$66:$I$93,L86,FALSE)","v":0.19800000000000001},null,21]
[null,null,-12,0.21199999999999999,0.20499999999999999,0.19800000000000001,0.192,0.185,0.17899999999999999,{"$f":"HLOOKUP(Berechnung!$F$34,$D$66:$I$93,L87,FALSE)","v":0.17899999999999999},null,22]
[null,null,-13,{"$f":"AVERAGE(D87,D89)","v":0.2},0.19350000000000001,0.1875,0.18149999999999999,0.17499999999999999,0.16949999999999998,{"$f":"HLOOKUP(Berechnung!$F$34,$D$66:$I$93,L88,FALSE)","v":0.16949999999999998},null,23]
[null,null,-14,0.188,0.182,0.17699999999999999,0.17100000000000001,0.16500000000000001,0.16,{"$f":"HLOOKUP(Berechnung!$F$34,$D$66:$I$93,L89,FALSE)","v":0.16},null,24]
[null,null,-15,{"$f":"AVERAGE(D89,D91)","v":0.18049999999999999},0.17499999999999999,0.16999999999999998,0.16450000000000001,0.159,0.1535,{"$f":"HLOOKUP(Berechnung!$F$34,$D$66:$I$93,L90,FALSE)","v":0.1535},null,25]
[null,null,-16,0.17299999999999999,0.16800000000000001,0.16300000000000001,0.158,0.153,0.14699999999999999,{"$f":"HLOOKUP(Berechnung!$F$34,$D$66:$I$93,L91,FALSE)","v":0.14699999999999999},null,26]
[null,null,-17,{"$f":"AVERAGE(D91,D93)","v":0.17299999999999999},0.16800000000000001,0.16300000000000001,0.158,0.153,0.14699999999999999,{"$f":"HLOOKUP(Berechnung!$F$34,$D$66:$I$93,L92,FALSE)","v":0.14699999999999999},null,27]
[null,null,-18,0.17299999999999999,0.16800000000000001,0.16300000000000001,0.158,0.153,0.14699999999999999,{"$f":"HLOOKUP(Berechnung!$F$34,$D$66:$I$93,L93,FALSE)","v":0.14699999999999999},null,28]
[]
[]
[]
[]
[]
[]
[]
[]
[]
[]
[]
[]
[]
[]
[]
[]
[null,"Korrekturfaktor Verdampfer Sole"]
[null,"Soletemperatur",null,"30 °C","35 °C","40 °C","45 °C","50 °C","55 °C","Auswahl"]
[null,0,null,1.135,1.087,1.0389999999999999,0.99,0.94,0.89,{"$f":"INDEX(D112:I137,MATCH(Berechnung!$P$34,B112:B137,0),MATCH(Berechnung!$F$34,$D$111:$I$111,0))","v":0.91700000000000004}]
[null,1,null,1.1479999999999999,1.1000000000000001,1.052,1.0029999999999999,0.95399999999999996,0.90400000000000003]
[null,2,null,1.161,1.113,1.0649999999999999,1.016,0.96699999999999997,0.91700000000000004]
[null,3,null,1.173,1.125,1.077,1.028,0.97899999999999998,0.93]
[null,4,null,1.1850000000000001,1.137,1.0900000000000001,1.0409999999999999,0.99199999999999999,0.94299999999999995]
[null,5,null,1.198,1.1499999999999999,1.1020000000000001,1.0529999999999999,1.0049999999999999,0.95599999999999996]
[null,6,null,1.21,1.1619999999999999,1.115,1.0649999999999999,1.018,0.96899999999999997]
[null,7,null,1.2230000000000001,1.175,1.127,1.0780000000000001,1.0309999999999999,0.98199999999999998]
[null,8,null,1.2350000000000001,1.1870000000000001,1.1399999999999999,1.0900000000000001,1.0429999999999999,0.995]
[null,9,null,1.248,1.2,1.153,1.1020000000000001,1.056,1.008]
[null,10,null,1.26,1.212,1.165,1.115,1.069,1.022]
[null,11,null,1.2729999999999999,1.2250000000000001,1.1779999999999999,1.127,1.0820000000000001,1.0349999999999999]
[null,12,null,1.2849999999999999,1.2370000000000001,1.19,1.1399999999999999,1.095,1.048]
[null,13,null,1.298,1.25,1.2030000000000001,1.1519999999999999,1.1080000000000001,1.0609999999999999]
[null,14,null,1.31,1.262,1.216,1.165,1.1200000000000001,1.0740000000000001]
[null,15,null,1.323,1.2749999999999999,1.228,1.177,1.133,1.087]
[null,16,null,1.335,1.2869999999999999,1.2410000000000001,1.1890000000000001,1.1459999999999999,1.1000000000000001]
[null,17,null,1.3480000000000001,1.3,1.2529999999999999,1.202,1.159,1.113]
[null,18,null,1.36,1.3120000000000001,1.266,1.214,1.1719999999999999,1.1259999999999999]
[null,19,null,1.373,1.325,1.2789999999999999,1.2270000000000001,1.1850000000000001,1.139]
[null,20,null,1.385,1.337,1.2909999999999999,1.2390000000000001,1.1970000000000001,1.153]
[]
[]
[]
[]
[]
[]
[]
[]
[]
[]
[]
[]
[]
[]
[]
[null,"Korrekturfaktor Verdampfer Wasser"]
[null,"Temp. Wasser",null,"30 °C","35 °C","40 °C","45 °C","50 °C","55 °C","Auswahl"]
[null,2,null,0.96799999999999997,0.91600000000000004,0.86399999999999999,0.81,0.75372727272727402,0.69816363636363699,{"$f":"INDEX(D150:I163,MATCH(Berechnung!$P$34,B150:B163,0),MATCH(Berechnung!$F$34,$D$149:$I$149,0))","v":0.69816363636363699}]
[null,3,null,0.98699999999999999,0.93500000000000005,0.88300000000000001,0.82899999999999996,0.77304545454545603,0.71756363636363696]
[null,4,null,1.006,0.95399999999999996,0.90200000000000002,0.84799999999999998,0.79236363636363705,0.73696363636363704]
[null,5,null,1.0249999999999999,0.97299999999999998,0.92100000000000004,0.86699999999999999,0.81200000000000006,0.75600000000000001]
[null,6,null,1.044,0.99199999999999999,0.94,0.88600000000000001,0.83099999999999996,0.77600000000000002]
[null,7,null,1.0629999999999999,1.0109999999999999,0.95899999999999996,0.90500000000000003,0.85,0.79500000000000004]
[null,8,null,1.0820000000000001,1.03,0.97799999999999998,0.92400000000000004,0.87,0.81499999999999995]
[null,9,null,1.101,1.0489999999999999,0.997,0.94299999999999995,0.88900000000000001,0.83399999999999996]
[null,10,null,1.1200000000000001,1.0680000000000001,1.016,0.96199999999999997,0.90800000000000003,0.85299999999999998]
[null,11,null,1.139,1.087,1.0349999999999999,0.98099999999999998,0.92700000000000005,0.873]
[null,12,null,1.1579999999999999,1.1060000000000001,1.054,1,0.94699999999999995,0.89200000000000002]
[null,13,null,1.177,1.125,1.073,1.0189999999999999,0.96599999999999997,0.91200000000000003]
[null,14,null,1.196,1.1439999999999999,1.0920000000000001,1.038,0.98599999999999999,0.93100000000000005]
[null,15,null,1.2150000000000001,1.163,1.111,1.0569999999999999,1.0049999999999999,0.95]

{"sheet":"Linksammlung","index":6,"n_rows":15,"n_cols":6,"rows_kept":15,"cut":false,"hidden":true,"merged":[[100,8,101,15],[2,2,2,3],[2,5,2,6]]}
[]
[null,null,"Linksammlung"]
[null,null,"Förderanträge",null,null,"Weiterführende Informationen"]
[]
[null,null,"Basisförderung Wärmepumpe",null,null,"BAFA-Förderrichtlinie 2016"]
[]
[null,null,"Innovationsförderung Wärmepumpe",null,null,"Übersicht Wärmepumpenförderung"]
[]
[null,null,"Basisförderung Solarthermie",null,null,"Übersicht Solarförderung"]
[]
[null,null,"Innovationsförderung Solarthermie",null,null,"Liste förderfähiger Wärmepumpen"]
[]
[null,null,"Qualitätscheck Wärmepumpe",null,null,"Liste förderfähiger Solarkollektoren"]
[]
[null,null,"Weitere Anträge auf der Bafa-Webseite"]