{"text_format":"1","workbook":"xlsx","n_sheets":7,"sheets":["Eingabe","Manuelle Eingabe","Berechnung","Leistungsdaten","Klimadaten","Vorlauftemperatur","Translation"],"not_rendered":{"charts":1,"images":46,"macros":1,"external_links":0,"defined_names":5,"comments":0,"pivot_tables":0},"unopened":[],"bounds":{"document_bytes":16777216,"sheet_cells":100000,"rows_first":2000,"rows_last":500,"rows_between":2000,"halvings":0,"cell_chars":16384,"cell_head_chars":4096},"cells_cut":0,"cells_raw":0,"read":"whole","date_system":"1900"}

{"sheet":"Eingabe","index":0,"n_rows":232,"n_cols":10,"rows_kept":232,"cut":false,"hidden":false,"merged":[[231,1,231,3],[6,1,6,2],[8,1,8,2],[10,1,10,2],[12,1,12,2],[14,1,14,2],[16,1,16,2],[18,1,18,2],[20,1,20,2],[22,1,22,2],[24,1,24,2],[29,1,29,2],[31,1,31,2],[33,1,33,2],[35,1,35,2],[197,1,197,2],[229,1,229,2],[211,1,211,2],[213,1,213,2],[219,1,219,2],[221,1,221,2],[223,1,223,2],[2,1,2,2],[207,1,207,2],[209,1,209,2],[225,1,225,2],[227,1,227,2],[199,1,199,2],[201,1,201,2],[37,1,37,3],[203,1,203,2],[205,1,205,2]]}
[]
[null,{"$f":"Translation!A3","v":"Jahresarbeitszahl"}]
[null,"Beispielprojekt",null,"IMT v1.09"]
[]
[null,{"$f":"Translation!A5","v":"Eingabewerte"},null,null,null,null,null,null,{"$f":"Translation!A29","v":"Rechenwerte Heizungswärmepumpe"}]
[]
[null,{"$f":"Translation!A6","v":"Wärmequelle"},null,null,null,null,null,null,{"$f":"B198","v":"Temperaturdifferenz Prüfstand"},{"$f":"IF(ISERROR(D198),Translation!A49,D198)","v":"5 K"}]
[]
[null,{"$f":"Translation!A7","v":"Anzahl | Typ Wärmepumpe"},null,null,null,null,null,null,{"$f":"B200","v":"Leistungszahl A-7/W35"},{"$f":"IF(ISERROR(D200),Translation!A49,D200)","v":"2,83"}]
[]
[null,{"$f":"Translation!A8","v":"Betriebsweise | Bivalenzpunkt"},null,null,null,null,null,null,{"$f":"B202","v":"Leistungszahl A2/W35"},{"$f":"IF(ISERROR(D202),Translation!A49,D202)","v":"3,88"}]
[]
[null,{"$f":"IF(OR(Berechnung!H6=Berechnung!H12,Berechnung!H6=Berechnung!H13),Translation!A9&\" \"&Translation!A10,Translation!A9)","v":"Vorlauftemperatur"},null,null,null,null,null,null,{"$f":"B204","v":"Leistungszahl A10/W35"},{"$f":"IF(ISERROR(D204),Translation!A49,D204)","v":"4,83"}]
[]
[null,{"$f":"Translation!A11","v":"Temperaturspreizung Heizung"},null,null,null,null,null,null,{"$f":"B206","v":"Korrekturfaktor F1"},{"$f":"IF(ISERROR(D206),Translation!A49,D206)","v":"0,085"}]
[]
[null,{"$f":"IF(Berechnung!E6=Berechnung!E9,Translation!A12,IF(Berechnung!E6=Berechnung!E10,Translation!A13,Translation!A14))","v":"Heizgrenztemperatur"},null,null,null,null,null,null,{"$f":"B208","v":"Korrekturfaktor F2"},{"$f":"IF(ISERROR(D208),Translation!A49,D208)","v":0.85399999999999998}]
[]
[null,{"$f":"IF(Berechnung!E6=Berechnung!E9,Translation!A15,IF(Berechnung!E6=Berechnung!E10,Translation!A16,IF(Berechnung!E6=Berechnung!E11,Translation!A17,Translation!A18)))","v":"Norm-Außentemperatur Standort"},null,null,null,null,null,null,{"$f":"B210","v":"Korrekturfaktor F3"},{"$f":"IF(ISERROR(D210),Translation!A49,D210)","v":0.13400000000000001}]
[]
[null,{"$f":"Translation!A19","v":"Warmwasserbereitung"},null,null,null,null,null,null,{"$f":"Translation!A47&\" \"&B212","v":"Heizung Korrekturfaktor (Verflüssiger)"},{"$f":"IF(ISERROR(D212),Translation!A49,D212)","v":"1,021"}]
[]
[null,{"$f":"Translation!A20","v":"Warmwasser-Wärmepumpe"},null,null,null,null,null,null,{"$f":"Translation!A26&\" \"&B228","v":"WWB Korrekturfaktor (Verdampfer)"},{"$f":"IF(ISERROR(D228),Translation!A49,D228)","v":"---"}]
[]
[null,{"$f":"Translation!A21","v":"Anteil Warmwasserbereitung"},null,null,null,null,null,null,{"$f":"Translation!A26&\" \"&B230","v":"WWB Korrekturfaktor (Verflüssiger)"},{"$f":"IF(ISERROR(D230),Translation!A49,D230)","v":"---"}]
[]
[]
[null,{"$f":"Translation!A22","v":"Ergebnisse"},null,null,null,null,null,null,{"$f":"Translation!A48","v":"Rechenwerte Warmwasser-Wärmepumpe"}]
[]
[null,{"$f":"Translation!A23","v":"Deckungsanteil Wärmepumpe"},null,{"$f":"IF(ISERROR(Berechnung!J67),Translation!A49,Berechnung!J67)","v":"98 %"},null,null,null,null,{"$f":"B220","v":"Leistungszahl WW-Wärmepumpe"},{"$f":"IF(ISERROR(D220),Translation!A49,D220)","v":"3,42"}]
[]
[null,{"$f":"Translation!A24","v":"Jahresarbeitszahl Heizung"},null,{"$f":"IF(ISERROR(Berechnung!J68),Translation!A49,Berechnung!J68)","v":"4,02"},null,null,null,null,{"$f":"B222","v":"WW-Temperatur Prüfstand"},{"$f":"IF(Berechnung!Q6=Berechnung!Q10,D222,\"---\")","v":"55 °C"}]
[]
[null,{"$f":"Translation!A25","v":"Jahresarbeitszahl WWB"},null,{"$f":"IF(ISERROR(Berechnung!J69),Translation!A49,Berechnung!J69)","v":"3,23"},null,null,null,null,{"$f":"B224","v":"Korrekturfaktor (Prüfstand)"},{"$f":"IF(ISERROR(D224),Translation!A49,D224)","v":"1,05"}]
[]
[null,{"$f":"Translation!A27","v":"Gesamt-Jahresarbeitszahl"},null,{"$f":"IF(ISERROR(Berechnung!J70),Translation!A49,Berechnung!J70)","v":"3,82"},null,null,null,null,{"$f":"B226","v":"Korrekturfaktor (Wärmequelle WWB)"},{"$f":"IF(ISERROR(D226),Translation!A49,D226)","v":0.9}]
[]
[null,{"$f":"IF(Translation!A28=\"\",\"\",Translation!C28)","v":" "}]
[]
[]
[]
[]
[]
[]
[]
[]
[]
[]
[]
[]
[]
[]
[]
[]
[]
[]
[]
[]
[]
[]
[]
[]
[]
[]
[]
[]
[]
[]
[]
[]
[]
[]
[]
[]
[]
[]
[]
[]
[]
[]
[]
[]
[]
[]
[]
[]
[]
[]
[]
[]
[]
[]
[]
[]
[]
[]
[]
[]
[]
[]
[]
[]
[]
[]
[]
[]
[]
[]
[]
[]
[]
[]
[]
[]
[]
[]
[]
[]
[]
[]
[]
[]
[]
[]
[]
[]
[]
[]
[]
[]
[]
[]
[]
[]
[]
[]
[]
[]
[]
[]
[]
[]
[]
[]
[]
[]
[]
[]
[]
[]
[]
[]
[]
[]
[]
[]
[]
[]
[]
[]
[]
[]
[]
[]
[]
[]
[]
[]
[]
[]
[]
[]
[]
[]
[]
[]
[]
[]
[]
[]
[]
[]
[]
[]
[]
[]
[]
[]
[]
[]
[]
[]
[]
[]
[]
[null,{"$f":"Translation!A30","v":"Rechenwerte Heizung"}]
[]
[null,{"$f":"Translation!A31","v":"Temperaturdifferenz Prüfstand"},null,{"$f":"Berechnung!J71","v":"5 K"}]
[]
[null,{"$f":"Berechnung!J72","v":"Leistungszahl A-7/W35"},null,{"$f":"Berechnung!J73","v":"2,83"}]
[]
[null,{"$f":"Berechnung!J87","v":"Leistungszahl A2/W35"},null,{"$f":"Berechnung!J89","v":"3,88"}]
[]
[null,{"$f":"Berechnung!J88","v":"Leistungszahl A10/W35"},null,{"$f":"Berechnung!J90","v":"4,83"}]
[]
[null,{"$f":"Berechnung!J74","v":"Korrekturfaktor F1"},null,{"$f":"Berechnung!J75","v":"0,085"}]
[]
[null,{"$f":"Berechnung!J76","v":"Korrekturfaktor F2"},null,{"$f":"Berechnung!J77","v":0.85399999999999998}]
[]
[null,{"$f":"Berechnung!J78","v":"Korrekturfaktor F3"},null,{"$f":"Berechnung!J79","v":0.13400000000000001}]
[]
[null,{"$f":"Translation!A40","v":"Korrekturfaktor (Verflüssiger)"},null,{"$f":"Berechnung!J80","v":"1,021"}]
[]
[null,{"$f":"Translation!A41","v":"Jahresarbeitszahl (Monovalent)"},null,{"$f":"Berechnung!J81","v":"4,3"}]
[]
[]
[]
[null,{"$f":"Translation!A42","v":"Rechenwerte Warmwasserbereitung"}]
[]
[null,{"$f":"Translation!A43","v":"Leistungszahl WW-Wärmepumpe"},null,{"$f":"Berechnung!J82","v":"3,42"}]
[]
[null,{"$f":"Translation!A44","v":"WW-Temperatur Prüfstand"},null,{"$f":"IF(Berechnung!Q6=Berechnung!Q10,Berechnung!S44&\" °C\",\"---\")","v":"55 °C"}]
[]
[null,{"$f":"Translation!A45","v":"Korrekturfaktor (Prüfstand)"},null,{"$f":"Berechnung!J83","v":"1,05"}]
[]
[null,{"$f":"Translation!A46","v":"Korrekturfaktor (Wärmequelle WWB)"},null,{"$f":"Berechnung!J84","v":0.9}]
[]
[null,{"$f":"Translation!A39","v":"Korrekturfaktor (Verdampfer)"},null,{"$f":"Berechnung!J85","v":"---"}]
[]
[null,{"$f":"Translation!A40","v":"Korrekturfaktor (Verflüssiger)"},null,{"$f":"Berechnung!J86","v":"---"}]
[]
[null,{"$f":"Translation!A28","v":"Berechnung nach VDI 4650 | Teil 1 (März 2009). Irrtum und Technische Änderungen vorbehalten."}]

{"sheet":"Manuelle Eingabe","index":1,"n_rows":40,"n_cols":10,"rows_kept":40,"cut":false,"hidden":true,"merged":[[3,2,3,3],[13,2,13,3],[23,2,23,3],[33,2,33,3]]}
[]
[null,{"$f":"Translation!A78","v":"Manuelle Eingabe"}]
[]
[null,null,{"$f":"Translation!A79","v":"Luft-Wasser-Wärmepumpe"}]
[]
[null,null,{"$f":"Translation!A31&\" [K]\"","v":"Temperaturdifferenz Prüfstand [K]"},5]
[]
[null,null,{"$f":"Translation!A32&\" A-7/W35\"","v":"Leistungszahl A-7/W35"},2.7]
[]
[null,null,{"$f":"Translation!A32&\" A2/W35\"","v":"Leistungszahl A2/W35"},3.5]
[]
[null,null,{"$f":"Translation!A32&\" A10/W35\"","v":"Leistungszahl A10/W35"},4]
[]
[null,null,{"$f":"Translation!A80","v":"Sole-Wasser-Wärmepumpe"}]
[]
[null,null,{"$f":"Translation!A31&\" [K]\"","v":"Temperaturdifferenz Prüfstand [K]"},5]
[]
[null,null,{"$f":"Translation!A32&\" B0/W35\"","v":"Leistungszahl B0/W35"},4.5]
[]
[null,null,{"$f":"Translation!A34&\" B0/W35 [KW]\"","v":"Leistungsaufnahme Verdichter B0/W35 [KW]"},4]
[]
[null,null,{"$f":"Translation!A33&\" B10/W35 [KW]\"","v":"Heizleistung B10/W35 [KW]"},20]
[]
[null,null,{"$f":"Translation!A81","v":"Wasser-Wasser-Wärmepumpe"}]
[]
[null,null,{"$f":"Translation!A31&\" [K]\"","v":"Temperaturdifferenz Prüfstand [K]"},5]
[]
[null,null,{"$f":"Translation!A32&\" W10/W35\"","v":"Leistungszahl W10/W35"},5]
[]
[null,null,{"$f":"Translation!A34&\" W10/W35 [KW]\"","v":"Leistungsaufnahme Verdichter W10/W35 [KW]"},3]
[]
[null,null,{"$f":"Translation!A33&\" W10/W35 [KW]\"","v":"Heizleistung W10/W35 [KW]"},15]
[]
[null,null,{"$f":"Translation!A20","v":"Warmwasser-Wärmepumpe"}]
[]
[null,null,{"$f":"Translation!A82","v":"Leistungszahl Aufheizung von 15°C auf 50°C"},5]
[]
[null,null,{"$f":"Translation!A44","v":"WW-Temperatur Prüfstand"},55,null,null,null,null,null,"Kellerluft-WP"]
[null,null,null,null,null,null,null,null,null,"Abluft-WP"]
[null,null,{"$f":"Translation!A83","v":"Wärmepumpen-Typ"},"Kellerluft-WP"]

{"sheet":"Berechnung","index":2,"n_rows":293,"n_cols":27,"rows_kept":293,"cut":false,"hidden":true,"merged":[[226,4,226,5],[227,4,227,5],[228,4,228,5],[229,4,229,5],[4,19,6,20],[39,10,39,12],[40,10,40,11],[41,10,41,11],[42,10,42,11],[43,10,43,11],[44,10,44,11],[45,10,45,11],[46,10,46,11],[44,13,44,14],[45,13,45,14],[45,16,45,17],[181,18,189,18],[142,18,150,18],[151,18,159,18],[163,18,171,18],[172,18,180,18],[103,18,111,18],[112,18,120,18],[121,18,129,18],[230,4,230,5],[231,4,231,5],[232,4,232,5],[233,4,233,5],[234,4,234,5],[235,4,235,5],[283,9,283,10],[283,7,283,8],[283,11,283,12],[252,4,252,5],[256,4,256,5],[257,4,257,5],[258,4,258,5],[253,4,253,5],[263,4,263,5],[264,4,264,5],[265,4,265,5],[266,4,266,5],[259,4,259,5],[262,4,262,5],[254,4,254,5],[255,4,255,5],[260,4,260,5],[261,4,261,5],[133,18,141,18],[49,16,49,17],[54,7,54,15],[53,7,53,15],[52,7,52,15],[51,7,51,15],[50,7,50,8],[50,13,50,14],[50,16,50,17],[49,10,49,11],[50,10,50,11],[44,16,44,17],[47,4,47,5],[47,16,47,17],[46,7,46,8],[46,13,46,14],[46,16,46,17],[48,4,48,5],[46,4,46,5],[44,4,44,5],[45,4,45,5],[47,10,47,11],[48,10,48,11],[44,7,44,8],[45,7,45,8],[48,16,48,17],[47,7,47,8],[47,13,47,14],[41,16,41,17],[39,16,39,18],[40,7,40,8],[40,13,40,14],[40,16,40,17],[43,4,43,5],[43,7,43,8],[43,13,43,14],[43,16,43,17],[42,7,42,8],[42,13,42,14],[42,16,42,17],[39,4,39,6],[39,7,39,9],[39,13,39,15],[40,4,40,5],[42,4,42,5],[41,4,41,5],[223,4,223,5],[224,4,224,5],[225,4,225,5],[112,4,120,4],[121,4,129,4],[206,4,206,5],[210,4,210,5],[211,4,211,5],[212,4,212,5],[207,4,207,5],[208,4,208,5],[209,4,209,5],[218,4,218,5],[217,4,217,5],[213,4,213,5],[214,4,214,5],[215,4,215,5],[216,4,216,5],[54,4,54,6],[51,4,51,6],[52,4,52,6],[53,4,53,6],[49,4,49,5],[219,4,219,5],[220,4,220,5],[221,4,221,5],[222,4,222,5],[267,4,267,5],[268,4,268,5],[269,4,269,5],[270,4,270,5],[271,4,271,5],[1,25,3,26],[1,13,1,14],[4,13,4,14],[5,13,5,14],[6,13,6,14],[25,13,25,14],[103,4,111,4],[172,4,180,4],[181,4,189,4],[151,4,159,4],[163,4,171,4],[133,4,141,4],[142,4,150,4],[41,7,41,8],[41,13,41,14],[48,7,48,8],[48,13,48,14],[49,7,49,8],[49,13,49,14]]}
[null,null,null,null,"Comoboxen Wärmepumpe"]
[null,null,null,null,null,"Anzahl WP",null,null,null,null,null,null,null,"Wärmequellentemperatur",null,"Leistung",null,null,null,"Zahlenwert","Zahlenwert","Deckungsanteil","Zahlenwert","Zahlenwert","Zahlenwert","Sprache"]
[null,null,null,null,"Wärmequelle",null,"WP-Typ","Betriebsweise","Bivalenzpunkt","Vorlauftemperatur","Spreizung","Heizgrenztemperatur","Außentemperatur","Sole","Wasser","Quellenpumpe","Warmwasserbereitung","Warmwasser-WP","Anteil WWB","Temp. Quelle","Temp. Quelle","Alpha-WP","Deckung","Vorlauftemperatur","Anzahl WP"]
[null,null,null,null,null,null,null,null,null,null,null,null,null,null,null,null,null,null,null,"Sole-Wasser","Wasser-Wasser",null,"WWB"]
[null,null,null,null,null,null,null,null,null,null,null,null,null,null,null,null,null,null,null,{"$f":"IF(E6=E10,VLOOKUP(N6,N8:T25,7,FALSE),IF(E6=E11,VLOOKUP(N6,O8:U25,7,FALSE)-3,VLOOKUP(N6,O8:U25,7,FALSE)))","v":{"$error":"#N/A"}}]
[null,null,null,null,"Außenluft","1 x","WPL 15 ACS","Monoenergetisch","-5 °C","35 °C","7 K","12 °C","-10 °C","Standard Sonde (2 °C)",null,"Standard VDI 4650","Warmwasser-Wärmepumpe","WWK 220 electronic","18",null,null,{"$f":"IF(H6=H10,VLOOKUP(I6,I9:V24,14,FALSE),1)","v":0.98},{"$f":"IF(S6=S9,0.18,IF(OR(Q6=Q11,Q6=Q12),0,S6/100))","v":0.18},{"$f":"IF(OR(H6=H12,H6=H13),Vorlauftemperatur!R26,VLOOKUP(J6,J8:X26,15,FALSE))","v":35},{"$f":"VLOOKUP(F6,F8:Y24,20,FALSE)","v":1},1,{"$f":"VLOOKUP(Z6,Z8:AA26,2,FALSE)","v":"| Deutsch"}]
[]
[]
[null,null,null,null,{"$f":"Translation!A50","v":"Außenluft"},"1 x",null,{"$f":"Translation!A58","v":"Monovalent"},"-10 °C","30 °C","3 K","10 °C","-10 °C",{"$f":"Translation!A63","v":"Standard Sonde (2 °C)"},{"$f":"Translation!A65","v":"Standardwert (10 °C)"},{"$f":"Translation!A67","v":"Standard VDI 4650"},{"$f":"Translation!A69","v":"Mit Heizungs-Wärmepumpe"},{"$f":"Leistungsdaten!A256","v":"Warmwasser-WP (Manuell)"},{"$f":"Translation!A74","v":"Standardwert (18 %)"},2,10,1,null,30,1,1,"| Deutsch"]
[null,null,null,null,{"$f":"Translation!A51","v":"Erdreich"},"2 x",null,{"$f":"Translation!A59","v":"Monoenergetisch"},"-9 °C","35 °C","4 K","12 °C","-11 °C",{"$f":"Translation!A64","v":"Standard Kollektor (0 °C)"},"5 °C",{"$f":"Translation!A68","v":"Eingabe [Watt]"},{"$f":"Translation!A70","v":"Warmwasser-Wärmepumpe"},{"$f":"Leistungsdaten!A257","v":"WWK 220 electronic"},{"$f":"Translation!A75","v":"Eingabe in %"},0,5,0.99,null,35,2,2,"| English"]
[null,null,null,null,{"$f":"Translation!A52","v":"Grundwasser (Zwischen-WT)"},"3 x",null,{"$f":"Translation!A60","v":"Bivalent-Parallel"},"-8 °C","40 °C","5 K","15 °C","-12 °C","-3 °C","6 °C",null,{"$f":"Translation!A71","v":"Sonstige Wärmeerzeuger"},{"$f":"Leistungsdaten!A258","v":"WWK 300 electronic"},null,-3,6,0.99,null,40,3,3,"| Nederlands"]
[null,null,null,null,{"$f":"Translation!A53","v":"Grundwasser"},"4 x",null,{"$f":"Translation!A61","v":"Bivalent-Alternativ"},"-7 °C","45 °C","6 K",null,"-13 °C","-2 °C","7 °C",null,{"$f":"Translation!A72","v":"Keine Warmwasserbereitung"},{"$f":"Leistungsdaten!A259","v":"WWK 300 electronic SOL"},null,-2,7,0.99,null,45,4,4,"| Francais"]
[null,null,null,null,null,"5 x",null,{"$f":"Translation!A62","v":"Bivalent-Teilparallel"},"-6 °C","50 °C","7 K",null,"-14 °C","-1 °C","8 °C",null,null,{"$f":"Leistungsdaten!A260","v":"WWK 221 electronic"},null,-1,8,0.99,null,50,5,5,"| Suomi"]
[null,null,null,null,null,"6 x",null,null,"-5 °C","55 °C","8 K",null,"-15 °C","0 °C","9 °C",null,null,{"$f":"Leistungsdaten!A261","v":"WWK 301 electronic"},null,0,9,0.98,null,55,6]
[null,null,null,null,null,null,null,null,"-4 °C",null,"9 K",null,"-16 °C","1 °C","10 °C",null,null,{"$f":"Leistungsdaten!A262","v":"WWK 301 electronic SOL"},null,1,10,0.97]
[null,null,null,null,null,null,null,null,"-3 °C",null,"10 K",null,"-17 °C","2 °C","11 °C",null,null,{"$f":"Leistungsdaten!A263","v":"WWS 20"},null,2,11,0.96]
[null,null,null,null,null,null,null,null,"-2 °C",null,null,null,"-18 °C","3 °C","12 °C",null,null,{"$f":"Leistungsdaten!A264","v":"LWA 252"},null,3,12,0.95]
[null,null,null,null,null,null,null,null,"-1 °C",null,null,null,null,"4 °C","13 °C",null,null,{"$f":"Leistungsdaten!A265","v":"LWA 100"},null,4,13,0.93]
[null,null,null,null,null,null,null,null,"  0 °C",null,null,null,null,"5 °C","14 °C",null,null,{"$f":"Leistungsdaten!A266","v":0},null,5,14,0.9]
[null,null,null,null,null,null,null,null,"  1 °C",null,null,null,null,null,"15 °C",null,null,{"$f":"Leistungsdaten!A267","v":0},null,null,15,0.87]
[null,null,null,null,null,null,null,null,"  2 °C",null,null,null,null,null,"16 °C",null,null,{"$f":"Leistungsdaten!A268","v":0},null,null,16,0.83]
[null,null,null,null,null,null,null,null,"  3 °C",null,null,null,null,null,"17 °C",null,null,{"$f":"Leistungsdaten!A269","v":0},null,null,17,0.77]
[null,null,null,null,null,null,null,null,"  4 °C",null,null,null,null,null,"18 °C",null,null,{"$f":"Leistungsdaten!A270","v":0},null,null,18,0.7]
[null,null,null,null,null,null,null,null,"  5 °C",null,null,null,null,null,"19 °C",null,null,{"$f":"Leistungsdaten!A271","v":0},null,null,19,0.61]
[null,null,null,null,null,null,null,null,null,"Abweichende VL-Temp ?",null,null,null,null,"20 °C",null,null,{"$f":"Leistungsdaten!A272","v":0},null,null,20]
[null,null,null,null,null,null,null,null,null,{"$f":"IF(ISERROR(VLOOKUP(J6,J9:J14,1,FALSE)),TRUE,FALSE)","v":false},null,null,null,{"$f":"Translation!A66","v":"Angabe wird nicht benötigt"}]
[]
[]
[]
[]
[]
[]
[]
[]
[]
[]
[]
[]
[null,null,null,null,"JAZ-Berechnung"]
[null,null,null,null,"Luft-Wasser-WP",null,null,"Sole-Wasser-WP",null,null,"Sole-Wasser-WP (Zwischen-WT)",null,null,"Wasser-Wasser-WP",null,null,"Kellerluft-WP"]
[null,null,null,null,"Leistungszahl A-7/W35",null,{"$f":"FIXED(VLOOKUP($G$6,Leistungsdaten!$A:$K,3,FALSE),2)","v":"2,83"},"Leistungszahl B0/W35","Leistungszahl B0/W35:",{"$f":"FIXED(VLOOKUP($G$6,Leistungsdaten!$A:$K,3,FALSE),2)","v":"2,83"},"Leistungszahl B0/W35","Leistungszahl B0/W35:",{"$f":"J41","v":"2,83"},"Leistungszahl W10/W35:",null,{"$f":"FIXED(VLOOKUP($G$6,Leistungsdaten!$A:$K,3,FALSE),2)","v":"2,83"},"Leistungszahl",null,{"$f":"FIXED(VLOOKUP($R$6,Leistungsdaten!$A:$K,2,FALSE),2)","v":"3,42"}]
[null,null,null,null,"Leistungszahl A2/W35",null,{"$f":"FIXED(VLOOKUP($G$6,Leistungsdaten!$A:$K,4,FALSE),2)","v":"3,88"},"Korrektur Verdampfer:",null,{"$f":"VLOOKUP(T5,E208:R236,14,FALSE)","v":{"$error":"#N/A"}},"Korrektur Verdampfer:",null,{"$f":"J42","v":{"$error":"#N/A"}},"Korrektur Verdampfer:",null,{"$f":"VLOOKUP(T5,E254:R272,14,FALSE)","v":{"$error":"#N/A"}},"Korrekturfaktor Prüfstand",null,{"$f":"VLOOKUP($R$6,Leistungsdaten!$A:$K,4,FALSE)","v":1.05}]
[null,null,null,null,"Leistungszahl A10/W35",null,{"$f":"FIXED(VLOOKUP($G$6,Leistungsdaten!$A:$K,5,FALSE),2)","v":"4,83"},"Korrektur Verflüssiger:",null,{"$f":"VLOOKUP(K6,E286:F293,2,FALSE)","v":1.0206000000000002},"Korrektur Verflüssiger:",null,{"$f":"J43","v":1.0206000000000002},"Korrektur Verflüssiger:",null,{"$f":"VLOOKUP(K6,E286:F293,2,FALSE)","v":1.0206000000000002},"Korrekturfaktor WP-Art",null,{"$f":"VLOOKUP($R$6,Leistungsdaten!$A:$K,5,FALSE)","v":0.9}]
[null,null,null,null,"Korrekturfaktor F1",null,{"$f":"VLOOKUP($L$6,$E$104:$S$130,15,FALSE)","v":8.5000000000000006E-2},"Korrektur Quellenpumpe",null,{"$f":"I293","v":1.075},"Korrektur Quellenpumpe",null,{"$f":"K293","v":1.325},"Korrektur Quellenpumpe",null,{"$f":"M293","v":1.25},"Temperatur Prüfstand",null,{"$f":"VLOOKUP($R$6,Leistungsdaten!$A:$K,3,FALSE)","v":55}]
[null,null,null,null,"Korrekturfaktor F2",null,{"$f":"VLOOKUP($L$6,$E$134:$S$160,15,FALSE)","v":0.85399999999999998}]
[null,null,null,null,"Korrekturfaktor F3",null,{"$f":"VLOOKUP($L$6,$E$164:$S$190,15,FALSE)","v":0.13400000000000001}]
[null,null,null,null,"Korrektur Verflüssiger",null,{"$f":"VLOOKUP(K6,E286:F293,2,FALSE)","v":1.0206000000000002}]
[null,null,null,null,"Jahresarbeitszahl HZG (monovalent):",null,{"$f":"(G47*(G41*G44+G42*G45+G43*G46))","v":4.2878365740000008},"Jahresarbeitszahl HZG (monovalent):",null,{"$f":"J41*J42*J43/J44","v":{"$error":"#N/A"}},"Jahresarbeitszahl HZG (monovalent):",null,{"$f":"M41*M42*M43/M44","v":{"$error":"#N/A"}},"Jahresarbeitszahl HZG (monovalent):",null,{"$f":"P41*P42*P43/P44","v":{"$error":"#N/A"}}]
[null,null,null,null,"Jahresarbeitszahl WWB",null,{"$f":"($G$41*0.103+$G$42*0.903+$G$43*0.061)*F290","v":4.1740090560000009},"Jahresarbeitszahl WWB",null,{"$f":"J41*F293*VLOOKUP(T5,E208:O236,11,FALSE)/I293","v":{"$error":"#N/A"}},"Jahresarbeitszahl WWB",null,{"$f":"M41*F293*VLOOKUP(T5,E208:O236,11,FALSE)/K293","v":{"$error":"#N/A"}},"Jahresarbeitszahl WWB",null,{"$f":"P41*F293*VLOOKUP(T5,E254:O272,11,FALSE)/M293","v":{"$error":"#N/A"}},"Jahresarbeitszahl WWB",null,{"$f":"S41*S42*S43","v":3.2319000000000004}]
[]
[]
[null,null,null,null,"JAZ-Heizung (monovalent)",null,null,{"$f":"IF(E6=E9,G48,IF(E6=E10,J48,IF(E6=E11,M48,P48)))","v":4.2878365740000008}]
[null,null,null,null,"JAZ-Heizung (mit Deckungsanteil)",null,null,{"$f":"1/((V6/H52)+1-V6)","v":4.0232789034750418}]
[null,null,null,null,"JAZ-Warmwasserbereitung",null,null,{"$f":"IF(Q6=Q10,S49,IF(OR(Q6=Q11,Q6=Q12),1,IF(E6=E9,G49,IF(E6=E10,J49,IF(E6=E11,M49,P49)))))","v":3.2319000000000004}]
[null,null,null,null,"JAZ-Gesamt",null,null,{"$f":"IF(OR(Q6=Q11,Q6=Q12),H53,1/(((1-W6)*V6/H52+W6*V6/H54+1-V6)))","v":3.8168702903046072}]
[]
[]
[]
[]
[]
[]
[]
[]
[]
[null,null,null,null,"Ergebnisübergabe"]
[null,null,null,null,"Bezeichnung",{"$f":"E9","v":"Außenluft"},{"$f":"E10","v":"Erdreich"},{"$f":"E11","v":"Grundwasser (Zwischen-WT)"},{"$f":"E12","v":"Grundwasser"},"Auswahl"]
[null,null,null,null,"Deckungsanteil Alpha",null,null,null,null,{"$f":"V6*100&\" %\"","v":"98 %"}]
[null,null,null,null,"JAZ Heizung",null,null,null,null,{"$f":"FIXED(H53,2)","v":"4,02"}]
[null,null,null,null,"JAZ WWB",null,null,null,null,{"$f":"IF(OR(Q6=Q11,Q6=Q12),\"---\",FIXED(H54,2))","v":"3,23"}]
[null,null,null,null,"JAZ Gesamt",null,null,null,null,{"$f":"FIXED(H55,2)","v":"3,82"}]
[null,null,null,null,"DeltaT Prüfstand",null,null,null,null,{"$f":"F285&\" K\"","v":"5 K"}]
[null,null,null,null,"Text Leistungszahl 1","A-7/W35","B0/W35","B0/W35","W10/W35",{"$f":"Translation!A32&\" \"&HLOOKUP($E$6,$F$66:$I$96,7,FALSE)","v":"Leistungszahl A-7/W35"}]
[null,null,null,null,"Leistungszahl 1",{"$f":"G41","v":"2,83"},{"$f":"J41","v":"2,83"},{"$f":"M41","v":"2,83"},{"$f":"P41","v":"2,83"},{"$f":"FIXED(HLOOKUP($E$6,$F$66:$I$96,8,FALSE),2)","v":"2,83"}]
[null,null,null,null,"Text Korrekturfaktor 1",{"$f":"Translation!A35&\" F1\"","v":"Korrekturfaktor F1"},{"$f":"Translation!A34","v":"Leistungsaufnahme Verdichter"},{"$f":"Translation!A34","v":"Leistungsaufnahme Verdichter"},{"$f":"Translation!A34","v":"Leistungsaufnahme Verdichter"},{"$f":"HLOOKUP($E$6,$F$66:$I$96,9,FALSE)","v":"Korrekturfaktor F1"}]
[null,null,null,null,"Wert Korrekturfaktor 1",{"$f":"FIXED(G44,3)","v":"0,085"},{"$f":"FIXED(I287,2)&\" KW\"","v":"3,88 KW"},{"$f":"FIXED(K287,2)&\" KW\"","v":"3,88 KW"},{"$f":"FIXED(M287,2)&\" KW\"","v":"3,88 KW"},{"$f":"HLOOKUP($E$6,$F$66:$I$96,10,FALSE)","v":"0,085"}]
[null,null,null,null,"Text Korrekturfaktor 2",{"$f":"Translation!A35&\" F2\"","v":"Korrekturfaktor F2"},{"$f":"Translation!A36","v":"Korrekturfaktor (Solepumpe)"},{"$f":"Translation!A37","v":"Korrekturfaktor (Quellenpumpen)"},{"$f":"Translation!A38","v":"Korrekturfaktor (Quellenpumpe)"},{"$f":"HLOOKUP($E$6,$F$66:$I$96,11,FALSE)","v":"Korrekturfaktor F2"}]
[null,null,null,null,"Wert Korrekturfaktor 2",{"$f":"ROUND(G45,3)","v":0.85399999999999998},{"$f":"ROUND(I293,3)","v":1.075},{"$f":"ROUND(K293,3)","v":1.325},{"$f":"ROUND(M293,3)","v":1.25},{"$f":"HLOOKUP($E$6,$F$66:$I$96,12,FALSE)","v":0.85399999999999998}]
[null,null,null,null,"Text Korrekturfaktor 3",{"$f":"Translation!A35&\" F3\"","v":"Korrekturfaktor F3"},{"$f":"Translation!A39","v":"Korrekturfaktor (Verdampfer)"},{"$f":"Translation!A39","v":"Korrekturfaktor (Verdampfer)"},{"$f":"Translation!A39","v":"Korrekturfaktor (Verdampfer)"},{"$f":"HLOOKUP($E$6,$F$66:$I$96,13,FALSE)","v":"Korrekturfaktor F3"}]
[null,null,null,null,"Wert Korrekturfaktor 3",{"$f":"ROUND(G46,3)","v":0.13400000000000001},{"$f":"ROUND(J42,3)","v":{"$error":"#N/A"}},{"$f":"ROUND(M42,3)","v":{"$error":"#N/A"}},{"$f":"ROUND(P42,3)","v":{"$error":"#N/A"}},{"$f":"HLOOKUP($E$6,$F$66:$I$96,14,FALSE)","v":0.13400000000000001}]
[null,null,null,null,"Wert Korrekturfaktor Verflüssiger",{"$f":"G47","v":1.0206000000000002},{"$f":"J43","v":1.0206000000000002},{"$f":"M43","v":1.0206000000000002},{"$f":"P43","v":1.0206000000000002},{"$f":"FIXED(HLOOKUP($E$6,$F$66:$I$96,15,FALSE),3)","v":"1,021"}]
[null,null,null,null,"Jahresarbeitszahl monovalent",null,null,null,null,{"$f":"FIXED(H52,1)","v":"4,3"}]
[null,null,null,null,"Leistungszahl WW-WP",null,null,null,null,{"$f":"IF($Q$6=$Q$10,FIXED(S41,2),\"---\")","v":"3,42"}]
[null,null,null,null,"Korrekturfaktor Prüfstand",null,null,null,null,{"$f":"IF($Q$6=$Q$10,FIXED(S42,2),\"---\")","v":"1,05"}]
[null,null,null,null,"Korrekturfaktor WP-Art",null,null,null,null,{"$f":"IF($Q$6=$Q$10,ROUND(S43,2),\"---\")","v":0.9}]
[null,null,null,null,"Korrektur Verdampfer (WWB)","---",{"$f":"FIXED(VLOOKUP(T5,E208:O236,11,FALSE),3)","v":{"$error":"#N/A"}},{"$f":"FIXED(VLOOKUP(T5,E208:R236,11,FALSE),3)","v":{"$error":"#N/A"}},{"$f":"FIXED(VLOOKUP(T5,E254:O272,11,FALSE),3)","v":{"$error":"#N/A"}},{"$f":"IF($Q$6=$Q$9,HLOOKUP($E$6,$F$66:$I$96,20,FALSE),\"---\")","v":"---"}]
[null,null,null,null,"Korrektur Verflüssiger WWB",{"$f":"FIXED(F290,3)","v":"1,021"},{"$f":"FIXED(F293,3)","v":"1,052"},{"$f":"FIXED(F293,3)","v":"1,052"},{"$f":"FIXED(F293,3)","v":"1,052"},{"$f":"IF($Q$6=$Q$9,HLOOKUP($E$6,$F$66:$I$96,21,FALSE),\"---\")","v":"---"}]
[null,null,null,null,"Text Leistungszahl 2",{"$f":"Translation!A32&\" A2/W35\"","v":"Leistungszahl A2/W35"},{"$f":"Translation!A33&\" B0/W35\"","v":"Heizleistung B0/W35"},{"$f":"Translation!A33&\" B10/W35\"","v":"Heizleistung B10/W35"},{"$f":"Translation!A33&\" W10/W35\"","v":"Heizleistung W10/W35"},{"$f":"HLOOKUP($E$6,$F$66:$I$96,22,FALSE)","v":"Leistungszahl A2/W35"}]
[null,null,null,null,"Text Leistungszahl 3",{"$f":"Translation!A32&\" A10/W35\"","v":"Leistungszahl A10/W35"},"---","---","---",{"$f":"HLOOKUP($E$6,$F$66:$I$96,23,FALSE)","v":"Leistungszahl A10/W35"}]
[null,null,null,null,"Wert Leistungszahl 2",{"$f":"G42","v":"3,88"},"---",{"$f":"FIXED(K288,2)&\" KW\"","v":"4,83 KW"},{"$f":"FIXED(K288,2)&\" KW\"","v":"4,83 KW"},{"$f":"HLOOKUP($E$6,$F$66:$I$96,24,FALSE)","v":"3,88"}]
[null,null,null,null,"Wert Leistungszahl 3",{"$f":"G43","v":"4,83"},"---","---","---",{"$f":"HLOOKUP($E$6,$F$66:$I$96,25,FALSE)","v":"4,83"}]
[null,null,null,null,"Button Rechenwerte anzeigen",null,null,null,null,{"$f":"\"| \"&Translation!A76","v":"| Rechenwerte"}]
[null,null,null,null,"Button Drucken",null,null,null,null,{"$f":"\"| \"&Translation!A77","v":"| Drucken"}]
[null,null,null,null,"Button Solepumpe",null,null,null,null,{"$f":"\"| \"&Translation!A108","v":"| Empfehlung Solepumpe"}]
[null,null,null,null,"Button übernehmen",null,null,null,null,{"$f":"\"| \"&Translation!A109","v":"| Werte übernehmen"}]
[null,null,null,null,"Button Zurück",null,null,null,null,{"$f":"\"| \"&Translation!A84","v":"| Zurück zum Hauptfenster"}]
[]
[]
[]
[]
[]
[]
[null,null,null,null,"JAZ Luft-Wasser - Korrekturfaktor F1"]
[null,null,null,null,"Heizgrenze","Norm-Außentemp.",15,20,25,30,35,40,45,50,55,60,65,"Bei Vorlauftemp.","bei Norm-Außentemp."]
[null,null,null,null,"10 °C",{"$f":"$M$9","v":"-10 °C"},0.12638095238095201,0.12052380952381,0.114666666666667,0.109,0.10299999999999999,9.7000000000000003E-2,9.0999999999999998E-2,8.5000000000000006E-2,0.08,7.3666666666666797E-2,6.7809523809523903E-2,{"$f":"HLOOKUP(FLOOR($X$6,5),$G$103:$Q$130,T104,FALSE)-($X$6-FLOOR($X$6,5))*((HLOOKUP(FLOOR($X$6,5),$G$103:$Q$130,T104,FALSE)-HLOOKUP(FLOOR($X$6,5)+5,$G$103:$Q$130,T104,FALSE))/5)","v":0.10299999999999999},{"$f":"VLOOKUP($M$6,F104:S112,13,FALSE)","v":0.10299999999999999},2]
[null,null,null,null,null,{"$f":"$M$10","v":"-11 °C"},{"$f":"AVERAGE(G104,G106)","v":0.15516666666666651},{"$f":"AVERAGE(H104,H106)","v":0.148166666666667},0.141166666666667,0.13450000000000001,0.127,0.12,0.113,0.10600000000000001,9.9500000000000005E-2,9.2166666666666897E-2,8.5166666666666946E-2,0.127,null,3]
[null,null,null,null,null,{"$f":"$M$11","v":"-12 °C"},0.18395238095238101,0.175809523809524,0.16766666666666699,0.16,0.151,0.14299999999999999,0.13500000000000001,0.127,0.11899999999999999,0.110666666666667,0.10252380952381,0.151,null,4]
[null,null,null,null,null,{"$f":"$M$12","v":"-13 °C"},{"$f":"AVERAGE(G106,G108)","v":0.20897619047619051},{"$f":"AVERAGE(H106,H108)","v":0.199904761904762},{"$f":"AVERAGE(I106,I108)","v":0.19083333333333349},{"$f":"AVERAGE(J106,J108)","v":0.182},{"$f":"AVERAGE(K106,K108)","v":0.17249999999999999},{"$f":"AVERAGE(L106,L108)","v":0.16349999999999998},{"$f":"AVERAGE(M106,M108)","v":0.1545},{"$f":"AVERAGE(N106,N108)","v":0.14550000000000002},{"$f":"AVERAGE(O106,O108)","v":0.13650000000000001},{"$f":"AVERAGE(P106,P108)","v":0.12733333333333349},{"$f":"AVERAGE(Q106,Q108)","v":0.11826190476190501},0.17249999999999999,null,5]
[null,null,null,null,null,{"$f":"$M$13","v":"-14 °C"},0.23400000000000001,0.224,0.214,0.20399999999999999,0.19400000000000001,0.184,0.17399999999999999,0.16400000000000001,0.154,0.14399999999999999,0.13400000000000001,0.19400000000000001,null,6]
[null,null,null,null,null,{"$f":"$M$14","v":"-15 °C"},{"$f":"AVERAGE(G108,G110)","v":0.29803809523809549},{"$f":"AVERAGE(H108,H110)","v":0.28565238095238099},{"$f":"AVERAGE(I108,I110)","v":0.27326666666666699},{"$f":"AVERAGE(J108,J110)","v":0.26100000000000001},{"$f":"AVERAGE(K108,K110)","v":0.2485},{"$f":"AVERAGE(L108,L110)","v":0.23599999999999999},{"$f":"AVERAGE(M108,M110)","v":0.2235},{"$f":"AVERAGE(N108,N110)","v":0.21150000000000002},{"$f":"AVERAGE(O108,O110)","v":0.19900000000000001},{"$f":"AVERAGE(P108,P110)","v":0.18656666666666649},{"$f":"AVERAGE(Q108,Q110)","v":0.17418095238095249},0.2485,null,7]
[null,null,null,null,null,{"$f":"$M$15","v":"-16 °C"},0.362076190476191,0.347304761904762,0.33253333333333401,0.318,0.30299999999999999,0.28799999999999998,0.27300000000000002,0.25900000000000001,0.24399999999999999,0.22913333333333299,0.214361904761905,0.30299999999999999,null,8]
[null,null,null,null,null,{"$f":"$M$16","v":"-17 °C"},{"$f":"AVERAGE(G110,G112)","v":0.362076190476191},{"$f":"AVERAGE(H110,H112)","v":0.347304761904762},{"$f":"AVERAGE(I110,I112)","v":0.33253333333333401},{"$f":"AVERAGE(J110,J112)","v":0.318},{"$f":"AVERAGE(K110,K112)","v":0.30299999999999999},{"$f":"AVERAGE(L110,L112)","v":0.28799999999999998},{"$f":"AVERAGE(M110,M112)","v":0.27300000000000002},{"$f":"AVERAGE(N110,N112)","v":0.25900000000000001},{"$f":"AVERAGE(O110,O112)","v":0.24399999999999999},{"$f":"AVERAGE(P110,P112)","v":0.22913333333333299},{"$f":"AVERAGE(Q110,Q112)","v":0.214361904761905},0.30299999999999999,null,9]
[null,null,null,null,null,{"$f":"$M$17","v":"-18 °C"},0.362076190476191,0.347304761904762,0.33253333333333401,0.318,0.30299999999999999,0.28799999999999998,0.27300000000000002,0.25900000000000001,0.24399999999999999,0.22913333333333299,0.214361904761905,0.30299999999999999,null,10]
[null,null,null,null,"12 °C",{"$f":"$M$9","v":"-10 °C"},0.10342857142857199,9.8714285714285796E-2,9.4000000000000097E-2,8.8999999999999996E-2,8.5000000000000006E-2,0.08,7.4999999999999997E-2,7.0000000000000007E-2,6.6000000000000003E-2,6.0999999999999797E-2,5.6285714285714099E-2,8.5000000000000006E-2,{"$f":"VLOOKUP($M$6,F113:S121,13,FALSE)","v":8.5000000000000006E-2},11]
[null,null,null,null,null,{"$f":"$M$10","v":"-11 °C"},{"$f":"AVERAGE(G113,G115)","v":0.12925238095238101},{"$f":"AVERAGE(H113,H115)","v":0.1235095238095239},{"$f":"AVERAGE(I113,I115)","v":0.11776666666666655},{"$f":"AVERAGE(J113,J115)","v":0.112},{"$f":"AVERAGE(K113,K115)","v":0.10650000000000001},{"$f":"AVERAGE(L113,L115)","v":0.10050000000000001},{"$f":"AVERAGE(M113,M115)","v":9.4500000000000001E-2},{"$f":"AVERAGE(N113,N115)","v":8.8999999999999996E-2},{"$f":"AVERAGE(O113,O115)","v":8.3500000000000005E-2},{"$f":"AVERAGE(P113,P115)","v":7.7566666666666603E-2},{"$f":"AVERAGE(Q113,Q115)","v":7.1823809523809498E-2},0.10650000000000001,null,12]
[null,null,null,null,null,{"$f":"$M$11","v":"-12 °C"},0.15507619047619001,0.14830476190476199,0.14153333333333301,0.13500000000000001,0.128,0.121,0.114,0.108,0.10100000000000001,9.4133333333333402E-2,8.7361904761904904E-2,0.128,null,13]
[null,null,null,null,null,{"$f":"$M$12","v":"-13 °C"},{"$f":"AVERAGE(G115,G117)","v":0.1782714285714285},{"$f":"AVERAGE(H115,H117)","v":0.17058571428571451},{"$f":"AVERAGE(I115,I117)","v":0.16289999999999999},{"$f":"AVERAGE(J115,J117)","v":0.1555},{"$f":"AVERAGE(K115,K117)","v":0.14750000000000002},{"$f":"AVERAGE(L115,L117)","v":0.13950000000000001},{"$f":"AVERAGE(M115,M117)","v":0.13200000000000001},{"$f":"AVERAGE(N115,N117)","v":0.1245},{"$f":"AVERAGE(O115,O117)","v":0.11700000000000001},{"$f":"AVERAGE(P115,P117)","v":0.1091000000000002},{"$f":"AVERAGE(Q115,Q117)","v":0.10141428571428596},0.14750000000000002,null,14]
[null,null,null,null,null,{"$f":"$M$13","v":"-14 °C"},0.20146666666666699,0.19286666666666699,0.184266666666667,0.17599999999999999,0.16700000000000001,0.158,0.15,0.14099999999999999,0.13300000000000001,0.12406666666666701,0.11546666666666699,0.16700000000000001,null,15]
[null,null,null,null,null,{"$f":"$M$14","v":"-15 °C"},{"$f":"AVERAGE(G117,G119)","v":0.25973333333333348},{"$f":"AVERAGE(H117,H119)","v":0.24893333333333351},{"$f":"AVERAGE(I117,I119)","v":0.23813333333333347},{"$f":"AVERAGE(J117,J119)","v":0.22750000000000001},{"$f":"AVERAGE(K117,K119)","v":0.21650000000000003},{"$f":"AVERAGE(L117,L119)","v":0.20550000000000002},{"$f":"AVERAGE(M117,M119)","v":0.19500000000000001},{"$f":"AVERAGE(N117,N119)","v":0.184},{"$f":"AVERAGE(O117,O119)","v":0.17349999999999999},{"$f":"AVERAGE(P117,P119)","v":0.1625333333333335},{"$f":"AVERAGE(Q117,Q119)","v":0.1517333333333335},0.21650000000000003,null,16]
[null,null,null,null,null,{"$f":"$M$15","v":"-16 °C"},0.318,0.30499999999999999,0.29199999999999998,0.27900000000000003,0.26600000000000001,0.253,0.24,0.22700000000000001,0.214,0.20100000000000001,0.188,0.26600000000000001,null,17]
[null,null,null,null,null,{"$f":"$M$16","v":"-17 °C"},{"$f":"AVERAGE(G119,G121)","v":0.318},{"$f":"AVERAGE(H119,H121)","v":0.30499999999999999},{"$f":"AVERAGE(I119,I121)","v":0.29199999999999998},{"$f":"AVERAGE(J119,J121)","v":0.27900000000000003},{"$f":"AVERAGE(K119,K121)","v":0.26600000000000001},{"$f":"AVERAGE(L119,L121)","v":0.253},{"$f":"AVERAGE(M119,M121)","v":0.24},{"$f":"AVERAGE(N119,N121)","v":0.22700000000000001},{"$f":"AVERAGE(O119,O121)","v":0.214},{"$f":"AVERAGE(P119,P121)","v":0.20100000000000001},{"$f":"AVERAGE(Q119,Q121)","v":0.188},0.26600000000000001,null,18]
[null,null,null,null,null,{"$f":"$M$17","v":"-18 °C"},0.318,0.30499999999999999,0.29199999999999998,0.27900000000000003,0.26600000000000001,0.253,0.24,0.22700000000000001,0.214,0.20100000000000001,0.188,0.26600000000000001,null,19]
[null,null,null,null,"15 °C",{"$f":"$M$9","v":"-10 °C"},8.1085714285714205E-2,7.7342857142857102E-2,7.3599999999999999E-2,7.0000000000000007E-2,6.6000000000000003E-2,6.2E-2,5.8999999999999997E-2,5.5E-2,5.0999999999999997E-2,4.7399999999999998E-2,4.3657142857142901E-2,6.6000000000000003E-2,{"$f":"VLOOKUP($M$6,F122:S130,13,FALSE)","v":6.6000000000000003E-2},20]
[null,null,null,null,null,{"$f":"$M$10","v":"-11 °C"},{"$f":"AVERAGE(G122,G124)","v":0.1036047619047621},{"$f":"AVERAGE(H122,H124)","v":9.8919047619047545E-2},{"$f":"AVERAGE(I122,I124)","v":9.4233333333333502E-2},{"$f":"AVERAGE(J122,J124)","v":8.9499999999999996E-2},{"$f":"AVERAGE(K122,K124)","v":8.4999999999999992E-2},{"$f":"AVERAGE(L122,L124)","v":0.08},{"$f":"AVERAGE(M122,M124)","v":7.5499999999999998E-2},{"$f":"AVERAGE(N122,N124)","v":7.0999999999999994E-2},{"$f":"AVERAGE(O122,O124)","v":6.6000000000000003E-2},{"$f":"AVERAGE(P122,P124)","v":6.1433333333333298E-2},{"$f":"AVERAGE(Q122,Q124)","v":5.6747619047619005E-2},8.4999999999999992E-2,null,21]
[null,null,null,null,null,{"$f":"$M$11","v":"-12 °C"},0.12612380952381,0.120495238095238,0.11486666666666701,0.109,0.104,9.8000000000000004E-2,9.1999999999999998E-2,8.6999999999999994E-2,8.1000000000000003E-2,7.5466666666666599E-2,6.9838095238095102E-2,0.104,null,22]
[null,null,null,null,null,{"$f":"$M$12","v":"-13 °C"},{"$f":"AVERAGE(G124,G126)","v":0.145561904761905},{"$f":"AVERAGE(H124,H126)","v":0.13924761904761901},{"$f":"AVERAGE(I124,I126)","v":0.13293333333333351},{"$f":"AVERAGE(J124,J126)","v":0.1265},{"$f":"AVERAGE(K124,K126)","v":0.1205},{"$f":"AVERAGE(L124,L126)","v":0.114},{"$f":"AVERAGE(M124,M126)","v":0.1075},{"$f":"AVERAGE(N124,N126)","v":0.10150000000000001},{"$f":"AVERAGE(O124,O126)","v":9.5000000000000001E-2},{"$f":"AVERAGE(P124,P126)","v":8.8733333333333303E-2},{"$f":"AVERAGE(Q124,Q126)","v":8.2419047619047503E-2},0.1205,null,23]
[null,null,null,null,null,{"$f":"$M$13","v":"-14 °C"},0.16500000000000001,0.158,0.151,0.14399999999999999,0.13700000000000001,0.13,0.123,0.11600000000000001,0.109,0.10199999999999999,9.4999999999999904E-2,0.13700000000000001,null,24]
[null,null,null,null,null,{"$f":"$M$14","v":"-15 °C"},{"$f":"AVERAGE(G126,G128)","v":0.21650000000000003},{"$f":"AVERAGE(H126,H128)","v":0.20750000000000002},{"$f":"AVERAGE(I126,I128)","v":0.19850000000000001},{"$f":"AVERAGE(J126,J128)","v":0.1895},{"$f":"AVERAGE(K126,K128)","v":0.18049999999999999},{"$f":"AVERAGE(L126,L128)","v":0.17149999999999999},{"$f":"AVERAGE(M126,M128)","v":0.16250000000000001},{"$f":"AVERAGE(N126,N128)","v":0.1535},{"$f":"AVERAGE(O126,O128)","v":0.14449999999999999},{"$f":"AVERAGE(P126,P128)","v":0.13550000000000001},{"$f":"AVERAGE(Q126,Q128)","v":0.12649999999999995},0.18049999999999999,null,25]
[null,null,null,null,null,{"$f":"$M$15","v":"-16 °C"},0.26800000000000002,0.25700000000000001,0.246,0.23499999999999999,0.224,0.21299999999999999,0.20200000000000001,0.191,0.18,0.16900000000000001,0.158,0.224,null,26]
[null,null,null,null,null,{"$f":"$M$16","v":"-17 °C"},{"$f":"AVERAGE(G128,G130)","v":0.26800000000000002},{"$f":"AVERAGE(H128,H130)","v":0.25700000000000001},{"$f":"AVERAGE(I128,I130)","v":0.246},{"$f":"AVERAGE(J128,J130)","v":0.23499999999999999},{"$f":"AVERAGE(K128,K130)","v":0.224},{"$f":"AVERAGE(L128,L130)","v":0.21299999999999999},{"$f":"AVERAGE(M128,M130)","v":0.20200000000000001},{"$f":"AVERAGE(N128,N130)","v":0.191},{"$f":"AVERAGE(O128,O130)","v":0.18},{"$f":"AVERAGE(P128,P130)","v":0.16900000000000001},{"$f":"AVERAGE(Q128,Q130)","v":0.158},0.224,null,27]
[null,null,null,null,null,{"$f":"$M$17","v":"-18 °C"},0.26800000000000002,0.25700000000000001,0.246,0.23499999999999999,0.224,0.21299999999999999,0.20200000000000001,0.191,0.18,0.16900000000000001,0.158,0.224,null,28]
[]
[null,null,null,null,"JAZ Luft-Wasser - Korrekturfaktor F2"]
[null,null,null,null,"Heizgrenze","Stadt",15,20,25,30,35,40,45,50,55,60,65,"Bei Vorlauftemp.","bei Norm-Außentemp."]
[null,null,null,null,"10 °C",{"$f":"$M$9","v":"-10 °C"},1.0602095238095199,1.0208380952381,0.98146666666666704,0.94199999999999995,0.90300000000000002,0.86299999999999999,0.82399999999999995,0.78500000000000003,0.745,0.70586666666666698,0.66649523809523803,{"$f":"HLOOKUP(FLOOR($X$6,5),$G$133:$Q$160,T134,FALSE)-($X$6-FLOOR($X$6,5))*((HLOOKUP(FLOOR($X$6,5),$G$133:$Q$160,T134,FALSE)-HLOOKUP(FLOOR($X$6,5)+5,$G$133:$Q$160,T134,FALSE))/5)","v":0.90300000000000002},{"$f":"VLOOKUP($M$6,F134:S142,13,FALSE)","v":0.90300000000000002},2]
[null,null,null,null,null,{"$f":"$M$10","v":"-11 °C"},{"$f":"AVERAGE(G134,G136)","v":1.02860476190476},{"$f":"AVERAGE(H134,H136)","v":0.99091904761904992},{"$f":"AVERAGE(I134,I136)","v":0.9532333333333336},{"$f":"AVERAGE(J134,J136)","v":0.91549999999999998},{"$f":"AVERAGE(K134,K136)","v":0.878},{"$f":"AVERAGE(L134,L136)","v":0.84},{"$f":"AVERAGE(M134,M136)","v":0.80249999999999999},{"$f":"AVERAGE(N134,N136)","v":0.76500000000000001},{"$f":"AVERAGE(O134,O136)","v":0.72699999999999998},{"$f":"AVERAGE(P134,P136)","v":0.68943333333333356},{"$f":"AVERAGE(Q134,Q136)","v":0.65174761904761902},0.878,null,3]
[null,null,null,null,null,{"$f":"$M$11","v":"-12 °C"},0.997,0.96099999999999997,0.92500000000000004,0.88900000000000001,0.85299999999999998,0.81699999999999995,0.78100000000000003,0.745,0.70899999999999996,0.67300000000000004,0.63700000000000001,0.85299999999999998,null,4]
[null,null,null,null,null,{"$f":"$M$12","v":"-13 °C"},{"$f":"AVERAGE(G136,G138)","v":0.97096190476190503},{"$f":"AVERAGE(H136,H138)","v":0.93634761904761943},{"$f":"AVERAGE(I136,I138)","v":0.9017333333333335},{"$f":"AVERAGE(J136,J138)","v":0.86699999999999999},{"$f":"AVERAGE(K136,K138)","v":0.83250000000000002},{"$f":"AVERAGE(L136,L138)","v":0.79800000000000004},{"$f":"AVERAGE(M136,M138)","v":0.76350000000000007},{"$f":"AVERAGE(N136,N138)","v":0.72849999999999993},{"$f":"AVERAGE(O136,O138)","v":0.69399999999999995},{"$f":"AVERAGE(P136,P138)","v":0.65943333333333354},{"$f":"AVERAGE(Q136,Q138)","v":0.6248190476190475},0.83250000000000002,null,5]
[null,null,null,null,null,{"$f":"$M$13","v":"-14 °C"},0.94492380952381005,0.911695238095239,0.87846666666666695,0.84499999999999997,0.81200000000000006,0.77900000000000003,0.746,0.71199999999999997,0.67900000000000005,0.64586666666666703,0.61263809523809498,0.81200000000000006,null,6]
[null,null,null,null,null,{"$f":"$M$14","v":"-15 °C"},{"$f":"AVERAGE(G138,G140)","v":0.88000476190476251},{"$f":"AVERAGE(H138,H140)","v":0.84951904761904851},{"$f":"AVERAGE(I138,I140)","v":0.8190333333333335},{"$f":"AVERAGE(J138,J140)","v":0.78849999999999998},{"$f":"AVERAGE(K138,K140)","v":0.75800000000000001},{"$f":"AVERAGE(L138,L140)","v":0.72750000000000004},{"$f":"AVERAGE(M138,M140)","v":0.69750000000000001},{"$f":"AVERAGE(N138,N140)","v":0.66649999999999998},{"$f":"AVERAGE(O138,O140)","v":0.63600000000000001},{"$f":"AVERAGE(P138,P140)","v":0.60563333333333302},{"$f":"AVERAGE(Q138,Q140)","v":0.57514761904761846},0.75800000000000001,null,7]
[null,null,null,null,null,{"$f":"$M$15","v":"-16 °C"},0.81508571428571497,0.78734285714285801,0.75960000000000005,0.73199999999999998,0.70399999999999996,0.67600000000000005,0.64900000000000002,0.621,0.59299999999999997,0.56539999999999901,0.53765714285714195,0.70399999999999996,null,8]
[null,null,null,null,null,{"$f":"$M$16","v":"-17 °C"},{"$f":"AVERAGE(G140,G142)","v":0.81508571428571497},{"$f":"AVERAGE(H140,H142)","v":0.78734285714285801},{"$f":"AVERAGE(I140,I142)","v":0.75960000000000005},{"$f":"AVERAGE(J140,J142)","v":0.73199999999999998},{"$f":"AVERAGE(K140,K142)","v":0.70399999999999996},{"$f":"AVERAGE(L140,L142)","v":0.67600000000000005},{"$f":"AVERAGE(M140,M142)","v":0.64900000000000002},{"$f":"AVERAGE(N140,N142)","v":0.621},{"$f":"AVERAGE(O140,O142)","v":0.59299999999999997},{"$f":"AVERAGE(P140,P142)","v":0.56539999999999901},{"$f":"AVERAGE(Q140,Q142)","v":0.53765714285714195},0.70399999999999996,null,9]
[null,null,null,null,null,{"$f":"$M$17","v":"-18 °C"},0.81508571428571497,0.78734285714285801,0.75960000000000005,0.73199999999999998,0.70399999999999996,0.67600000000000005,0.64900000000000002,0.621,0.59299999999999997,0.56539999999999901,0.53765714285714195,0.70399999999999996,null,10]
[null,null,null,null,"12 °C",{"$f":"$M$9","v":"-10 °C"},1.0010857142857199,0.96434285714285894,0.92760000000000098,0.89100000000000001,0.85399999999999998,0.81699999999999995,0.78100000000000003,0.74399999999999999,0.70699999999999996,0.670399999999999,0.63365714285714203,0.85399999999999998,{"$f":"VLOOKUP($M$6,F143:S151,13,FALSE)","v":0.85399999999999998},11]
[null,null,null,null,null,{"$f":"$M$10","v":"-11 °C"},{"$f":"AVERAGE(G143,G145)","v":0.98177619047619347},{"$f":"AVERAGE(H143,H145)","v":0.94610476190476289},{"$f":"AVERAGE(I143,I145)","v":0.91043333333333398},{"$f":"AVERAGE(J143,J145)","v":0.875},{"$f":"AVERAGE(K143,K145)","v":0.83899999999999997},{"$f":"AVERAGE(L143,L145)","v":0.80299999999999994},{"$f":"AVERAGE(M143,M145)","v":0.76800000000000002},{"$f":"AVERAGE(N143,N145)","v":0.73199999999999998},{"$f":"AVERAGE(O143,O145)","v":0.69650000000000001},{"$f":"AVERAGE(P143,P145)","v":0.66073333333333295},{"$f":"AVERAGE(Q143,Q145)","v":0.6250619047619046},0.83899999999999997,null,12]
[null,null,null,null,null,{"$f":"$M$11","v":"-12 °C"},0.96246666666666703,0.92786666666666695,0.89326666666666699,0.85899999999999999,0.82399999999999995,0.78900000000000003,0.755,0.72,0.68600000000000005,0.65106666666666702,0.61646666666666705,0.82399999999999995,null,13]
[null,null,null,null,null,{"$f":"$M$12","v":"-13 °C"},{"$f":"AVERAGE(G145,G147)","v":0.94319047619047658},{"$f":"AVERAGE(H145,H147)","v":0.90976190476190499},{"$f":"AVERAGE(I145,I147)","v":0.87633333333333352},{"$f":"AVERAGE(J145,J147)","v":0.84299999999999997},{"$f":"AVERAGE(K145,K147)","v":0.8095},{"$f":"AVERAGE(L145,L147)","v":0.77600000000000002},{"$f":"AVERAGE(M145,M147)","v":0.74249999999999994},{"$f":"AVERAGE(N145,N147)","v":0.70899999999999996},{"$f":"AVERAGE(O145,O147)","v":0.67600000000000005},{"$f":"AVERAGE(P145,P147)","v":0.64233333333333298},{"$f":"AVERAGE(Q145,Q147)","v":0.60890476190476206},0.8095,null,14]
[null,null,null,null,null,{"$f":"$M$13","v":"-14 °C"},0.92391428571428602,0.89165714285714304,0.85940000000000005,0.82699999999999996,0.79500000000000004,0.76300000000000001,0.73,0.69799999999999995,0.66600000000000004,0.63359999999999905,0.60134285714285696,0.79500000000000004,null,15]
[null,null,null,null,null,{"$f":"$M$14","v":"-15 °C"},{"$f":"AVERAGE(G147,G149)","v":0.86719999999999997},{"$f":"AVERAGE(H147,H149)","v":0.83730000000000004},{"$f":"AVERAGE(I147,I149)","v":0.80740000000000001},{"$f":"AVERAGE(J147,J149)","v":0.77749999999999997},{"$f":"AVERAGE(K147,K149)","v":0.74750000000000005},{"$f":"AVERAGE(L147,L149)","v":0.71799999999999997},{"$f":"AVERAGE(M147,M149)","v":0.6875},{"$f":"AVERAGE(N147,N149)","v":0.65799999999999992},{"$f":"AVERAGE(O147,O149)","v":0.628},{"$f":"AVERAGE(P147,P149)","v":0.59809999999999952},{"$f":"AVERAGE(Q147,Q149)","v":0.56819999999999948},0.74750000000000005,null,16]
[null,null,null,null,null,{"$f":"$M$15","v":"-16 °C"},0.81048571428571403,0.78294285714285705,0.75539999999999996,0.72799999999999998,0.7,0.67300000000000004,0.64500000000000002,0.61799999999999999,0.59,0.56259999999999999,0.53505714285714201,0.7,null,17]
[null,null,null,null,null,{"$f":"$M$16","v":"-17 °C"},{"$f":"AVERAGE(G149,G151)","v":0.81048571428571403},{"$f":"AVERAGE(H149,H151)","v":0.78294285714285705},{"$f":"AVERAGE(I149,I151)","v":0.75539999999999996},{"$f":"AVERAGE(J149,J151)","v":0.72799999999999998},{"$f":"AVERAGE(K149,K151)","v":0.7},{"$f":"AVERAGE(L149,L151)","v":0.67300000000000004},{"$f":"AVERAGE(M149,M151)","v":0.64500000000000002},{"$f":"AVERAGE(N149,N151)","v":0.61799999999999999},{"$f":"AVERAGE(O149,O151)","v":0.59},{"$f":"AVERAGE(P149,P151)","v":0.56259999999999999},{"$f":"AVERAGE(Q149,Q151)","v":0.53505714285714201},0.7,null,18]
[null,null,null,null,null,{"$f":"$M$17","v":"-18 °C"},0.81048571428571403,0.78294285714285705,0.75539999999999996,0.72799999999999998,0.7,0.67300000000000004,0.64500000000000002,0.61799999999999999,0.59,0.56259999999999999,0.53505714285714201,0.7,null,19]
[null,null,null,null,"15 °C",{"$f":"$M$9","v":"-10 °C"},0.89740952380952399,0.86463809523809598,0.83186666666666698,0.79900000000000004,0.76600000000000001,0.73399999999999999,0.70099999999999996,0.66800000000000004,0.63500000000000001,0.60246666666666704,0.56969523809523803,0.76600000000000001,{"$f":"VLOOKUP($M$6,F152:S160,13,FALSE)","v":0.76600000000000001},20]
[null,null,null,null,null,{"$f":"$M$10","v":"-11 °C"},{"$f":"AVERAGE(G152,G154)","v":0.89324285714285701},{"$f":"AVERAGE(H152,H154)","v":0.8609714285714285},{"$f":"AVERAGE(I152,I154)","v":0.82869999999999999},{"$f":"AVERAGE(J152,J154)","v":0.79649999999999999},{"$f":"AVERAGE(K152,K154)","v":0.76400000000000001},{"$f":"AVERAGE(L152,L154)","v":0.73199999999999998},{"$f":"AVERAGE(M152,M154)","v":0.69950000000000001},{"$f":"AVERAGE(N152,N154)","v":0.66749999999999998},{"$f":"AVERAGE(O152,O154)","v":0.63500000000000001},{"$f":"AVERAGE(P152,P154)","v":0.60280000000000045},{"$f":"AVERAGE(Q152,Q154)","v":0.5705285714285715},0.76400000000000001,null,21]
[null,null,null,null,null,{"$f":"$M$11","v":"-12 °C"},0.88907619047619002,0.85730476190476101,0.82553333333333301,0.79400000000000004,0.76200000000000001,0.73,0.69799999999999995,0.66700000000000004,0.63500000000000001,0.60313333333333397,0.57136190476190496,0.76200000000000001,null,22]
[null,null,null,null,null,{"$f":"$M$12","v":"-13 °C"},{"$f":"AVERAGE(G154,G156)","v":0.87753809523809501},{"$f":"AVERAGE(H154,H156)","v":0.84665238095238049},{"$f":"AVERAGE(I154,I156)","v":0.81576666666666653},{"$f":"AVERAGE(J154,J156)","v":0.78500000000000003},{"$f":"AVERAGE(K154,K156)","v":0.754},{"$f":"AVERAGE(L154,L156)","v":0.72299999999999998},{"$f":"AVERAGE(M154,M156)","v":0.69199999999999995},{"$f":"AVERAGE(N154,N156)","v":0.66149999999999998},{"$f":"AVERAGE(O154,O156)","v":0.63050000000000006},{"$f":"AVERAGE(P154,P156)","v":0.59956666666666703},{"$f":"AVERAGE(Q154,Q156)","v":0.5686809523809524},0.754,null,23]
[null,null,null,null,null,{"$f":"$M$13","v":"-14 °C"},0.86599999999999999,0.83599999999999997,0.80600000000000005,0.77600000000000002,0.746,0.71599999999999997,0.68600000000000005,0.65600000000000003,0.626,0.59599999999999997,0.56599999999999995,0.746,null,24]
[null,null,null,null,null,{"$f":"$M$14","v":"-15 °C"},{"$f":"AVERAGE(G156,G158)","v":0.81947619047619091},{"$f":"AVERAGE(H156,H158)","v":0.79140476190476194},{"$f":"AVERAGE(I156,I158)","v":0.76333333333333353},{"$f":"AVERAGE(J156,J158)","v":0.73550000000000004},{"$f":"AVERAGE(K156,K158)","v":0.70700000000000007},{"$f":"AVERAGE(L156,L158)","v":0.67900000000000005},{"$f":"AVERAGE(M156,M158)","v":0.65100000000000002},{"$f":"AVERAGE(N156,N158)","v":0.623},{"$f":"AVERAGE(O156,O158)","v":0.59499999999999997},{"$f":"AVERAGE(P156,P158)","v":0.56683333333333352},{"$f":"AVERAGE(Q156,Q158)","v":0.53876190476190455},0.70700000000000007,null,25]
[null,null,null,null,null,{"$f":"$M$15","v":"-16 °C"},0.77295238095238195,0.74680952380952403,0.72066666666666701,0.69499999999999995,0.66800000000000004,0.64200000000000002,0.61599999999999999,0.59,0.56399999999999995,0.53766666666666696,0.51152380952380905,0.66800000000000004,null,26]
[null,null,null,null,null,{"$f":"$M$16","v":"-17 °C"},{"$f":"AVERAGE(G158,G160)","v":0.77295238095238195},{"$f":"AVERAGE(H158,H160)","v":0.74680952380952403},{"$f":"AVERAGE(I158,I160)","v":0.72066666666666701},{"$f":"AVERAGE(J158,J160)","v":0.69499999999999995},{"$f":"AVERAGE(K158,K160)","v":0.66800000000000004},{"$f":"AVERAGE(L158,L160)","v":0.64200000000000002},{"$f":"AVERAGE(M158,M160)","v":0.61599999999999999},{"$f":"AVERAGE(N158,N160)","v":0.59},{"$f":"AVERAGE(O158,O160)","v":0.56399999999999995},{"$f":"AVERAGE(P158,P160)","v":0.53766666666666696},{"$f":"AVERAGE(Q158,Q160)","v":0.51152380952380905},0.66800000000000004,null,27]
[null,null,null,null,null,{"$f":"$M$17","v":"-18 °C"},0.77295238095238195,0.74680952380952403,0.72066666666666701,0.69499999999999995,0.66800000000000004,0.64200000000000002,0.61599999999999999,0.59,0.56399999999999995,0.53766666666666696,0.51152380952380905,0.66800000000000004,null,28]
[]
[null,null,null,null,"JAZ Luft-Wasser - Korrekturfaktor F3"]
[null,null,null,null,"Heizgrenze","Stadt",15,20,25,30,35,40,45,50,55,60,65,"Bei Vorlauftemp.","bei Norm-Außentemp."]
[null,null,null,null,"10 °C",{"$f":"$M$9","v":"-10 °C"},6.9000000000000006E-2,6.7000000000000004E-2,6.5000000000000002E-2,6.3E-2,6.0999999999999999E-2,5.8999999999999997E-2,5.7000000000000002E-2,5.5E-2,5.2999999999999999E-2,5.0999999999999997E-2,4.9000000000000002E-2,{"$f":"HLOOKUP(FLOOR($X$6,5),$G$163:$Q$190,T164,FALSE)-($X$6-FLOOR($X$6,5))*((HLOOKUP(FLOOR($X$6,5),$G$163:$Q$190,T164,FALSE)-HLOOKUP(FLOOR($X$6,5)+5,$G$163:$Q$190,T164,FALSE))/5)","v":6.0999999999999999E-2},{"$f":"VLOOKUP($M$6,F164:S172,13,FALSE)","v":6.0999999999999999E-2},2]
[null,null,null,null,null,{"$f":"$M$10","v":"-11 °C"},{"$f":"AVERAGE(G164,G166)","v":6.254285714285715E-2},{"$f":"AVERAGE(H164,H166)","v":6.0671428571428598E-2},{"$f":"AVERAGE(I164,I166)","v":5.8800000000000005E-2},{"$f":"AVERAGE(J164,J166)","v":5.6999999999999995E-2},{"$f":"AVERAGE(K164,K166)","v":5.5E-2},{"$f":"AVERAGE(L164,L166)","v":5.2999999999999999E-2},{"$f":"AVERAGE(M164,M166)","v":5.1500000000000004E-2},{"$f":"AVERAGE(N164,N166)","v":4.9500000000000002E-2},{"$f":"AVERAGE(O164,O166)","v":4.7500000000000001E-2},{"$f":"AVERAGE(P164,P166)","v":4.5700000000000046E-2},{"$f":"AVERAGE(Q164,Q166)","v":4.3828571428571501E-2},5.5E-2,null,3]
[null,null,null,null,null,{"$f":"$M$11","v":"-12 °C"},5.6085714285714301E-2,5.43428571428572E-2,5.2600000000000001E-2,5.0999999999999997E-2,4.9000000000000002E-2,4.7E-2,4.5999999999999999E-2,4.3999999999999997E-2,4.2000000000000003E-2,4.0400000000000102E-2,3.8657142857143001E-2,4.9000000000000002E-2,null,4]
[null,null,null,null,null,{"$f":"$M$12","v":"-13 °C"},{"$f":"AVERAGE(G166,G168)","v":5.1647619047619102E-2},{"$f":"AVERAGE(H166,H168)","v":5.0090476190476255E-2},{"$f":"AVERAGE(I166,I168)","v":4.8533333333333352E-2},{"$f":"AVERAGE(J166,J168)","v":4.7E-2},{"$f":"AVERAGE(K166,K168)","v":4.5499999999999999E-2},{"$f":"AVERAGE(L166,L168)","v":4.3499999999999997E-2},{"$f":"AVERAGE(M166,M168)","v":4.2499999999999996E-2},{"$f":"AVERAGE(N166,N168)","v":4.0999999999999995E-2},{"$f":"AVERAGE(O166,O168)","v":3.9E-2},{"$f":"AVERAGE(P166,P168)","v":3.7633333333333352E-2},{"$f":"AVERAGE(Q166,Q168)","v":3.6076190476190553E-2},4.5499999999999999E-2,null,5]
[null,null,null,null,null,{"$f":"$M$13","v":"-14 °C"},4.7209523809523903E-2,4.5838095238095303E-2,4.4466666666666703E-2,4.2999999999999997E-2,4.2000000000000003E-2,0.04,3.9E-2,3.7999999999999999E-2,3.5999999999999997E-2,3.4866666666666601E-2,3.3495238095238099E-2,4.2000000000000003E-2,null,6]
[null,null,null,null,null,{"$f":"$M$14","v":"-15 °C"},{"$f":"AVERAGE(G168,G170)","v":4.3104761904761951E-2},{"$f":"AVERAGE(H168,H170)","v":4.1919047619047647E-2},{"$f":"AVERAGE(I168,I170)","v":4.0733333333333351E-2},{"$f":"AVERAGE(J168,J170)","v":3.9499999999999993E-2},{"$f":"AVERAGE(K168,K170)","v":3.8500000000000006E-2},{"$f":"AVERAGE(L168,L170)","v":3.7000000000000005E-2},{"$f":"AVERAGE(M168,M170)","v":3.6000000000000004E-2},{"$f":"AVERAGE(N168,N170)","v":3.5000000000000003E-2},{"$f":"AVERAGE(O168,O170)","v":3.3500000000000002E-2},{"$f":"AVERAGE(P168,P170)","v":3.24333333333333E-2},{"$f":"AVERAGE(Q168,Q170)","v":3.1247619047619052E-2},3.8500000000000006E-2,null,7]
[null,null,null,null,null,{"$f":"$M$15","v":"-16 °C"},3.9E-2,3.7999999999999999E-2,3.6999999999999998E-2,3.5999999999999997E-2,3.5000000000000003E-2,3.4000000000000002E-2,3.3000000000000002E-2,3.2000000000000001E-2,3.1E-2,0.03,2.9000000000000001E-2,3.5000000000000003E-2,null,8]
[null,null,null,null,null,{"$f":"$M$16","v":"-17 °C"},{"$f":"AVERAGE(G170,G172)","v":3.9E-2},{"$f":"AVERAGE(H170,H172)","v":3.7999999999999999E-2},{"$f":"AVERAGE(I170,I172)","v":3.6999999999999998E-2},{"$f":"AVERAGE(J170,J172)","v":3.5999999999999997E-2},{"$f":"AVERAGE(K170,K172)","v":3.5000000000000003E-2},{"$f":"AVERAGE(L170,L172)","v":3.4000000000000002E-2},{"$f":"AVERAGE(M170,M172)","v":3.3000000000000002E-2},{"$f":"AVERAGE(N170,N172)","v":3.2000000000000001E-2},{"$f":"AVERAGE(O170,O172)","v":3.1E-2},{"$f":"AVERAGE(P170,P172)","v":0.03},{"$f":"AVERAGE(Q170,Q172)","v":2.9000000000000001E-2},3.5000000000000003E-2,null,9]
[null,null,null,null,null,{"$f":"$M$17","v":"-18 °C"},3.9E-2,3.7999999999999999E-2,3.6999999999999998E-2,3.5999999999999997E-2,3.5000000000000003E-2,3.4000000000000002E-2,3.3000000000000002E-2,3.2000000000000001E-2,3.1E-2,0.03,2.9000000000000001E-2,3.5000000000000003E-2,null,10]
[null,null,null,null,"12 °C",{"$f":"$M$9","v":"-10 °C"},0.152485714285714,0.14794285714285699,0.1434,0.13900000000000001,0.13400000000000001,0.13,0.125,0.121,0.11600000000000001,0.1116,0.107057142857143,0.13400000000000001,{"$f":"VLOOKUP($M$6,F173:S181,13,FALSE)","v":0.13400000000000001},11]
[null,null,null,null,null,{"$f":"$M$10","v":"-11 °C"},{"$f":"AVERAGE(G173,G175)","v":0.13748571428571399},{"$f":"AVERAGE(H173,H175)","v":0.133442857142857},{"$f":"AVERAGE(I173,I175)","v":0.12940000000000002},{"$f":"AVERAGE(J173,J175)","v":0.1255},{"$f":"AVERAGE(K173,K175)","v":0.121},{"$f":"AVERAGE(L173,L175)","v":0.11749999999999999},{"$f":"AVERAGE(M173,M175)","v":0.113},{"$f":"AVERAGE(N173,N175)","v":0.1095},{"$f":"AVERAGE(O173,O175)","v":0.10500000000000001},{"$f":"AVERAGE(P173,P175)","v":0.10110000000000005},{"$f":"AVERAGE(Q173,Q175)","v":9.7057142857143008E-2},0.121,null,12]
[null,null,null,null,null,{"$f":"$M$11","v":"-12 °C"},0.122485714285714,0.118942857142857,0.1154,0.112,0.108,0.105,0.10100000000000001,9.8000000000000004E-2,9.4E-2,9.0600000000000097E-2,8.7057142857142999E-2,0.108,null,13]
[null,null,null,null,null,{"$f":"$M$12","v":"-13 °C"},{"$f":"AVERAGE(G175,G177)","v":0.11424285714285701},{"$f":"AVERAGE(H175,H177)","v":0.1109714285714285},{"$f":"AVERAGE(I175,I177)","v":0.1077},{"$f":"AVERAGE(J175,J177)","v":0.10450000000000001},{"$f":"AVERAGE(K175,K177)","v":0.10100000000000001},{"$f":"AVERAGE(L175,L177)","v":9.8000000000000004E-2},{"$f":"AVERAGE(M175,M177)","v":9.4500000000000001E-2},{"$f":"AVERAGE(N175,N177)","v":9.1499999999999998E-2},{"$f":"AVERAGE(O175,O177)","v":8.7999999999999995E-2},{"$f":"AVERAGE(P175,P177)","v":8.4800000000000042E-2},{"$f":"AVERAGE(Q175,Q177)","v":8.1528571428571506E-2},0.10100000000000001,null,14]
[null,null,null,null,null,{"$f":"$M$13","v":"-14 °C"},0.106,0.10299999999999999,0.1,9.7000000000000003E-2,9.4E-2,9.0999999999999998E-2,8.7999999999999995E-2,8.5000000000000006E-2,8.2000000000000003E-2,7.9000000000000001E-2,7.5999999999999998E-2,9.4E-2,null,15]
[null,null,null,null,null,{"$f":"$M$14","v":"-15 °C"},{"$f":"AVERAGE(G177,G179)","v":9.9742857142857189E-2},{"$f":"AVERAGE(H177,H179)","v":9.6971428571428653E-2},{"$f":"AVERAGE(I177,I179)","v":9.4200000000000061E-2},{"$f":"AVERAGE(J177,J179)","v":9.1499999999999998E-2},{"$f":"AVERAGE(K177,K179)","v":8.8499999999999995E-2},{"$f":"AVERAGE(L177,L179)","v":8.5999999999999993E-2},{"$f":"AVERAGE(M177,M179)","v":8.299999999999999E-2},{"$f":"AVERAGE(N177,N179)","v":8.0500000000000002E-2},{"$f":"AVERAGE(O177,O179)","v":7.7499999999999999E-2},{"$f":"AVERAGE(P177,P179)","v":7.4800000000000005E-2},{"$f":"AVERAGE(Q177,Q179)","v":7.20285714285714E-2},8.8499999999999995E-2,null,16]
[null,null,null,null,null,{"$f":"$M$15","v":"-16 °C"},9.3485714285714394E-2,9.0942857142857297E-2,8.8400000000000103E-2,8.5999999999999993E-2,8.3000000000000004E-2,8.1000000000000003E-2,7.8E-2,7.5999999999999998E-2,7.2999999999999995E-2,7.0599999999999996E-2,6.8057142857142802E-2,8.3000000000000004E-2,null,17]
[null,null,null,null,null,{"$f":"$M$16","v":"-17 °C"},{"$f":"AVERAGE(G179,G181)","v":9.3485714285714394E-2},{"$f":"AVERAGE(H179,H181)","v":9.0942857142857297E-2},{"$f":"AVERAGE(I179,I181)","v":8.8400000000000103E-2},{"$f":"AVERAGE(J179,J181)","v":8.5999999999999993E-2},{"$f":"AVERAGE(K179,K181)","v":8.3000000000000004E-2},{"$f":"AVERAGE(L179,L181)","v":8.1000000000000003E-2},{"$f":"AVERAGE(M179,M181)","v":7.8E-2},{"$f":"AVERAGE(N179,N181)","v":7.5999999999999998E-2},{"$f":"AVERAGE(O179,O181)","v":7.2999999999999995E-2},{"$f":"AVERAGE(P179,P181)","v":7.0599999999999996E-2},{"$f":"AVERAGE(Q179,Q181)","v":6.8057142857142802E-2},8.3000000000000004E-2,null,18]
[null,null,null,null,null,{"$f":"$M$17","v":"-18 °C"},9.3485714285714394E-2,9.0942857142857297E-2,8.8400000000000103E-2,8.5999999999999993E-2,8.3000000000000004E-2,8.1000000000000003E-2,7.8E-2,7.5999999999999998E-2,7.2999999999999995E-2,7.0599999999999996E-2,6.8057142857142802E-2,8.3000000000000004E-2,null,19]
[null,null,null,null,"15 °C",{"$f":"$M$9","v":"-10 °C"},0.28291428571428601,0.27465714285714299,0.26640000000000003,0.25800000000000001,0.25,0.24199999999999999,0.23300000000000001,0.22500000000000001,0.217,0.20860000000000001,0.20034285714285699,0.25,{"$f":"VLOOKUP($M$6,F182:S190,13,FALSE)","v":0.25},20]
[null,null,null,null,null,{"$f":"$M$10","v":"-11 °C"},{"$f":"AVERAGE(G182,G184)","v":0.25719047619047652},{"$f":"AVERAGE(H182,H184)","v":0.24976190476190499},{"$f":"AVERAGE(I182,I184)","v":0.24233333333333351},{"$f":"AVERAGE(J182,J184)","v":0.23499999999999999},{"$f":"AVERAGE(K182,K184)","v":0.22749999999999998},{"$f":"AVERAGE(L182,L184)","v":0.22},{"$f":"AVERAGE(M182,M184)","v":0.21250000000000002},{"$f":"AVERAGE(N182,N184)","v":0.20500000000000002},{"$f":"AVERAGE(O182,O184)","v":0.19800000000000001},{"$f":"AVERAGE(P182,P184)","v":0.19033333333333352},{"$f":"AVERAGE(Q182,Q184)","v":0.18290476190476201},0.22749999999999998,null,21]
[null,null,null,null,null,{"$f":"$M$11","v":"-12 °C"},0.23146666666666699,0.22486666666666699,0.218266666666667,0.21199999999999999,0.20499999999999999,0.19800000000000001,0.192,0.185,0.17899999999999999,0.17206666666666701,0.16546666666666701,0.20499999999999999,null,22]
[null,null,null,null,null,{"$f":"$M$12","v":"-13 °C"},{"$f":"AVERAGE(G184,G186)","v":0.2181285714285715},{"$f":"AVERAGE(H184,H186)","v":0.21201428571428599},{"$f":"AVERAGE(I184,I186)","v":0.2059},{"$f":"AVERAGE(J184,J186)","v":0.2},{"$f":"AVERAGE(K184,K186)","v":0.19350000000000001},{"$f":"AVERAGE(L184,L186)","v":0.1875},{"$f":"AVERAGE(M184,M186)","v":0.18149999999999999},{"$f":"AVERAGE(N184,N186)","v":0.17499999999999999},{"$f":"AVERAGE(O184,O186)","v":0.16949999999999998},{"$f":"AVERAGE(P184,P186)","v":0.16310000000000052},{"$f":"AVERAGE(Q184,Q186)","v":0.15698571428571451},0.19350000000000001,null,23]
[null,null,null,null,null,{"$f":"$M$13","v":"-14 °C"},0.204790476190476,0.19916190476190501,0.193533333333333,0.188,0.182,0.17699999999999999,0.17100000000000001,0.16500000000000001,0.16,0.15413333333333401,0.148504761904762,0.182,null,24]
[null,null,null,null,null,{"$f":"$M$14","v":"-15 °C"},{"$f":"AVERAGE(G186,G188)","v":0.19670476190476199},{"$f":"AVERAGE(H186,H188)","v":0.191319047619048},{"$f":"AVERAGE(I186,I188)","v":0.18593333333333301},{"$f":"AVERAGE(J186,J188)","v":0.18049999999999999},{"$f":"AVERAGE(K186,K188)","v":0.17499999999999999},{"$f":"AVERAGE(L186,L188)","v":0.16999999999999998},{"$f":"AVERAGE(M186,M188)","v":0.16450000000000001},{"$f":"AVERAGE(N186,N188)","v":0.159},{"$f":"AVERAGE(O186,O188)","v":0.1535},{"$f":"AVERAGE(P186,P188)","v":0.14823333333333349},{"$f":"AVERAGE(Q186,Q188)","v":0.142847619047619},0.17499999999999999,null,25]
[null,null,null,null,null,{"$f":"$M$15","v":"-16 °C"},0.18861904761904799,0.18347619047619099,0.17833333333333301,0.17299999999999999,0.16800000000000001,0.16300000000000001,0.158,0.153,0.14699999999999999,0.14233333333333301,0.137190476190476,0.16800000000000001,null,26]
[null,null,null,null,null,{"$f":"$M$16","v":"-17 °C"},{"$f":"AVERAGE(G188,G190)","v":0.18861904761904799},{"$f":"AVERAGE(H188,H190)","v":0.18347619047619099},{"$f":"AVERAGE(I188,I190)","v":0.17833333333333301},{"$f":"AVERAGE(J188,J190)","v":0.17299999999999999},{"$f":"AVERAGE(K188,K190)","v":0.16800000000000001},{"$f":"AVERAGE(L188,L190)","v":0.16300000000000001},{"$f":"AVERAGE(M188,M190)","v":0.158},{"$f":"AVERAGE(N188,N190)","v":0.153},{"$f":"AVERAGE(O188,O190)","v":0.14699999999999999},{"$f":"AVERAGE(P188,P190)","v":0.14233333333333301},{"$f":"AVERAGE(Q188,Q190)","v":0.137190476190476},0.16800000000000001,null,27]
[null,null,null,null,null,{"$f":"$M$17","v":"-18 °C"},0.18861904761904799,0.18347619047619099,0.17833333333333301,0.17299999999999999,0.16800000000000001,0.16300000000000001,0.158,0.153,0.14699999999999999,0.14233333333333301,0.137190476190476,0.16800000000000001,null,28]
[]
[]
[]
[]
[]
[]
[]
[]
[]
[]
[]
[]
[]
[]
[]
[null,null,null,null,"JAZ Sole-Wasser - Korrekturfaktor Verdampfer"]
[null,null,null,null,"Temp. Sole",null,15,20,25,30,35,40,45,50,55,60,65,"Bei Vorlauftemp."]
[null,null,null,null,-6,null,1.2109664550264601,1.1613713756613799,1.1117762962963,1.06050555555556,1.01250555555556,0.96368888888888804,0.91673888888888899,0.86372222222222295,0.81200000000000006,0.76461074074073798,0.71501566137565797,{"$f":"HLOOKUP(FLOOR($X$6,5),$G$207:$Q$234,S208,FALSE)-($X$6-FLOOR($X$6,5))*((HLOOKUP(FLOOR($X$6,5),$G$207:$Q$234,S208,FALSE)-HLOOKUP(FLOOR($X$6,5)+5,$G$207:$Q$234,S208,FALSE))/5)","v":1.01250555555556},2]
[null,null,null,null,-5,null,1.2230194708994699,1.17353343915344,1.12404740740741,1.0729888888888901,1.0249888888888901,0.97628888888888798,0.92918888888888895,0.87655555555555598,0.82506666666666595,0.777645185185185,0.72815915343915305,1.0249888888888901,3]
[null,null,null,null,-4,null,1.2350518518518501,1.1856796296296299,1.1363074074074,1.08547222222222,1.0374722222222199,0.98888888888888804,0.94163888888888903,0.88938888888889001,0.83816666666666595,0.79070185185185404,0.741329629629632,1.0374722222222199,4]
[null,null,null,null,-3,null,1.2482095238095301,1.1988380952380999,1.14946666666667,1.099,1.0509999999999999,1.002,0.95299999999999996,0.90300000000000002,0.85199999999999998,0.80386666666666595,0.754495238095235,1.0509999999999999,5]
[null,null,null,null,-2,null,1.25861904761905,1.2094761904761899,1.1603333333333301,1.1100000000000001,1.0620000000000001,1.014,0.96499999999999997,0.91500000000000004,0.86399999999999999,0.81633333333333302,0.76719047619047598,1.0620000000000001,6]
[null,null,null,null,-1,null,1.27,1.2210000000000001,1.1719999999999999,1.1220000000000001,1.0740000000000001,1.026,0.97699999999999998,0.92700000000000005,0.877,0.82899999999999896,0.78,1.0740000000000001,7]
[null,null,null,null,0,null,1.2829999999999999,1.234,1.1850000000000001,1.135,1.087,1.0389999999999999,0.99,0.94,0.89,0.84199999999999997,0.79300000000000004,1.087,8]
[null,null,null,null,1,null,1.29507619047619,1.24630476190476,1.19753333333333,1.1479999999999999,1.1000000000000001,1.052,1.0029999999999999,0.95399999999999996,0.90400000000000003,0.85613333333333297,0.80736190476190595,1.1000000000000001,9]
[null,null,null,null,2,null,1.3080761904761899,1.2593047619047599,1.2105333333333299,1.161,1.113,1.0649999999999999,1.016,0.96699999999999997,0.91700000000000004,0.86913333333333398,0.82036190476190596,1.113,10]
[null,null,null,null,3,null,1.31945714285714,1.2708285714285701,1.2222,1.173,1.125,1.077,1.028,0.97899999999999998,0.93,0.88180000000000003,0.83317142857143001,1.125,11]
[null,null,null,null,4,null,1.33086666666666,1.28246666666667,1.23406666666667,1.1850000000000001,1.137,1.0900000000000001,1.0409999999999999,0.99199999999999999,0.94299999999999995,0.89526666666666799,0.84686666666666799,1.137,12]
[null,null,null,null,5,null,1.3435333333333399,1.2951333333333299,1.2467333333333299,1.198,1.1499999999999999,1.1020000000000001,1.0529999999999999,1.0049999999999999,0.95599999999999996,0.90793333333333304,0.85953333333333204,1.1499999999999999,13]
[null,null,null,null,6,null,1.3553700096200101,1.30710781625781,1.25884562289562,1.21030555555555,1.1623055555555499,1.1148888888888899,1.06518434343434,1.01772222222222,0.96916111111111103,0.92101026936026997,0.87274807599807702,1.1623055555555499,14]
[null,null,null,null,7,null,1.3674028845228801,1.3192534184334199,1.27110395234395,1.22278888888889,1.17478888888889,1.1274888888888901,1.0776028749028701,1.0305555555555499,0.982259829059829,0.93405768971768999,0.88590822362822497,1.17478888888889,15]
[null,null,null,null,8,null,1.37943575942576,1.33139902060902,1.2833622817922801,1.2352722222222201,1.1872722222222201,1.14008888888889,1.09002140637141,1.04338888888889,0.99535854700854698,0.947105110075111,0.89906837125837302,1.1872722222222201,16]
[null,null,null,null,9,null,1.39146863432863,1.3435446227846199,1.2956206112406099,1.24775555555555,1.1997555555555499,1.15268888888889,1.1024399378399401,1.05622222222222,1.0084572649572701,0.96015253043253102,0.91222851888852097,1.1997555555555499,17]
[null,null,null,null,10,null,1.40350150923151,1.3556902249602201,1.30787894068894,1.26023888888889,1.21223888888889,1.1652888888888899,1.11485846930847,1.0690555555555501,1.0215559829059799,0.97319995078995203,0.92538866651866802,1.21223888888889,18]
[null,null,null,null,11,null,1.4155343841343799,1.36783582713582,1.32013727013727,1.2727222222222201,1.22472222222222,1.1778888888888901,1.1272770007770001,1.08188888888889,1.0346547008547,0.98624737114737204,0.93854881414881597,1.22472222222222,19]
[null,null,null,null,12,null,1.4275672590372599,1.3799814293114201,1.3323955995856001,1.2852055555555499,1.2372055555555499,1.19048888888889,1.13969553224553,1.0947222222222199,1.0477534188034201,0.99929479150479295,0.95170896177896402,1.2372055555555499,20]
[null,null,null,null,13,null,1.4396001339401301,1.39212703148703,1.3446539290339301,1.29768888888889,1.24968888888889,1.20308888888889,1.1521140637140601,1.1075555555555501,1.06085213675214,1.0123422118622101,0.96486910940911197,1.24968888888889,21]
[null,null,null,null,14,null,1.4516330088430001,1.4042726336626301,1.3569122584822599,1.3101722222222201,1.26217222222222,1.2156888888888899,1.16453259518259,1.12038888888889,1.07395085470086,1.0253896322196301,0.97802925703926002,1.26217222222222,22]
[null,null,null,null,15,null,1.46366588374588,1.41641823583823,1.36917058793058,1.3226555555555499,1.2746555555555501,1.2282888888888901,1.1769511266511301,1.1332222222222199,1.0870495726495699,1.0384370525770501,0.99118940466940797,1.2746555555555501,23]
[null,null,null,null,16,null,1.47569875864875,1.4285638380138299,1.38142891737891,1.33513888888889,1.2871388888888899,1.24088888888889,1.18936965811966,1.1460555555555501,1.10014829059829,1.0514844729344699,1.00434955229956,1.2871388888888899,24]
[null,null,null,null,17,null,1.48773163355163,1.44070944018943,1.3936872468272401,1.3476222222222201,1.29962222222222,1.25348888888889,1.2017881895881899,1.15888888888889,1.1132470085470101,1.0645318932918999,1.0175096999297,1.29962222222222,25]
[null,null,null,null,18,null,1.4997645084544999,1.4528550423650399,1.4059455762755699,1.3601055555555499,1.3121055555555501,1.2660888888888899,1.21420672105672,1.1717222222222199,1.1263457264957299,1.0775793136493199,1.0306698475598499,1.3121055555555501,26]
[null,null,null,null,19,null,1.5117973833573799,1.4650006445406401,1.4182039057239,1.37258888888889,1.3245888888888899,1.2786888888888901,1.2266252525252499,1.18455555555555,1.13944444444445,1.0906267340067399,1.0438299951900001,1.3245888888888899,27]
[null,null,null,null,20,null,1.5238302582602501,1.47714624671624,1.43046223517223,1.38507222222222,1.33707222222222,1.29128888888889,1.23904378399378,1.1973888888888899,1.1525431623931599,1.1036741543641599,1.05699014282015,1.33707222222222,28]
[]
[]
[]
[]
[]
[]
[]
[]
[]
[]
[]
[]
[]
[]
[]
[]
[]
[null,null,null,null,"JAZ Wasser-Wasser - Korrekturfaktor Verdampfer"]
[null,null,null,null,"Temp. Wasser",null,15,20,25,30,35,40,45,50,55,60,65,"Bei Vorlauftemp."]
[null,null,null,null,2,null,1.13198181818182,1.0779818181818199,1.0239818181818201,0.96799999999999997,0.91600000000000004,0.86399999999999999,0.81,0.75372727272727402,0.69816363636363699,0.64598181818181799,0.59198181818181705,{"$f":"HLOOKUP(FLOOR($X$6,5),$G$253:$Q$272,2,FALSE)-($X$6-FLOOR($X$6,5))*((HLOOKUP(FLOOR($X$6,5),$G$253:$Q$272,2,FALSE)-HLOOKUP(FLOOR($X$6,5)+5,$G$253:$Q$272,2,FALSE))/5)","v":0.91600000000000004}]
[null,null,null,null,3,null,1.15063722943723,1.0967216450216499,1.0428060606060601,0.98699999999999999,0.93500000000000005,0.88300000000000001,0.82899999999999996,0.77304545454545603,0.71756363636363696,0.66539696969697004,0.61148138528138596,{"$f":"HLOOKUP(FLOOR($X$6,5),$G$253:$Q$272,3,FALSE)-($X$6-FLOOR($X$6,5))*((HLOOKUP(FLOOR($X$6,5),$G$253:$Q$272,3,FALSE)-HLOOKUP(FLOOR($X$6,5)+5,$G$253:$Q$272,3,FALSE))/5)","v":0.93500000000000005}]
[null,null,null,null,4,null,1.1692926406926401,1.1154614718614699,1.0616303030303,1.006,0.95399999999999996,0.90200000000000002,0.84799999999999998,0.79236363636363705,0.73696363636363704,0.68481212121212198,0.63098095238095298,{"$f":"HLOOKUP(FLOOR($X$6,5),$G$253:$Q$272,4,FALSE)-($X$6-FLOOR($X$6,5))*((HLOOKUP(FLOOR($X$6,5),$G$253:$Q$272,4,FALSE)-HLOOKUP(FLOOR($X$6,5)+5,$G$253:$Q$272,4,FALSE))/5)","v":0.95399999999999996}]
[null,null,null,null,5,null,1.1880761904761901,1.1343047619047599,1.08053333333333,1.0249999999999999,0.97299999999999998,0.92100000000000004,0.86699999999999999,0.81200000000000006,0.75600000000000001,0.70413333333333405,0.65036190476190503,{"$f":"HLOOKUP(FLOOR($X$6,5),$G$253:$Q$272,5,FALSE)-($X$6-FLOOR($X$6,5))*((HLOOKUP(FLOOR($X$6,5),$G$253:$Q$272,5,FALSE)-HLOOKUP(FLOOR($X$6,5)+5,$G$253:$Q$272,5,FALSE))/5)","v":0.97299999999999998}]
[null,null,null,null,6,null,1.20645714285714,1.15282857142857,1.0992,1.044,0.99199999999999999,0.94,0.88600000000000001,0.83099999999999996,0.77600000000000002,0.723800000000001,0.67017142857142997,{"$f":"HLOOKUP(FLOOR($X$6,5),$G$253:$Q$272,6,FALSE)-($X$6-FLOOR($X$6,5))*((HLOOKUP(FLOOR($X$6,5),$G$253:$Q$272,6,FALSE)-HLOOKUP(FLOOR($X$6,5)+5,$G$253:$Q$272,6,FALSE))/5)","v":0.99199999999999999}]
[null,null,null,null,7,null,1.2254571428571399,1.1718285714285701,1.1182000000000001,1.0629999999999999,1.0109999999999999,0.95899999999999996,0.90500000000000003,0.85,0.79500000000000004,0.74280000000000102,0.68917142857142999,{"$f":"HLOOKUP(FLOOR($X$6,5),$G$253:$Q$272,7,FALSE)-($X$6-FLOOR($X$6,5))*((HLOOKUP(FLOOR($X$6,5),$G$253:$Q$272,7,FALSE)-HLOOKUP(FLOOR($X$6,5)+5,$G$253:$Q$272,7,FALSE))/5)","v":1.0109999999999999}]
[null,null,null,null,8,null,1.24353333333333,1.1901333333333299,1.13673333333333,1.0820000000000001,1.03,0.97799999999999998,0.92400000000000004,0.87,0.81499999999999995,0.76293333333333502,0.70953333333333601,{"$f":"HLOOKUP(FLOOR($X$6,5),$G$253:$Q$272,8,FALSE)-($X$6-FLOOR($X$6,5))*((HLOOKUP(FLOOR($X$6,5),$G$253:$Q$272,8,FALSE)-HLOOKUP(FLOOR($X$6,5)+5,$G$253:$Q$272,8,FALSE))/5)","v":1.03}]
[null,null,null,null,9,null,1.26253333333333,1.2091333333333301,1.1557333333333299,1.101,1.0489999999999999,0.997,0.94299999999999995,0.88900000000000001,0.83399999999999996,0.78193333333333503,0.72853333333333503,{"$f":"HLOOKUP(FLOOR($X$6,5),$G$253:$Q$272,9,FALSE)-($X$6-FLOOR($X$6,5))*((HLOOKUP(FLOOR($X$6,5),$G$253:$Q$272,9,FALSE)-HLOOKUP(FLOOR($X$6,5)+5,$G$253:$Q$272,9,FALSE))/5)","v":1.0489999999999999}]
[null,null,null,null,10,null,1.2815333333333301,1.22813333333333,1.1747333333333301,1.1200000000000001,1.0680000000000001,1.016,0.96199999999999997,0.90800000000000003,0.85299999999999998,0.80093333333333505,0.74753333333333605,{"$f":"HLOOKUP(FLOOR($X$6,5),$G$253:$Q$272,10,FALSE)-($X$6-FLOOR($X$6,5))*((HLOOKUP(FLOOR($X$6,5),$G$253:$Q$272,10,FALSE)-HLOOKUP(FLOOR($X$6,5)+5,$G$253:$Q$272,10,FALSE))/5)","v":1.0680000000000001}]
[null,null,null,null,11,null,1.29991428571429,1.24665714285715,1.1934,1.139,1.087,1.0349999999999999,0.98099999999999998,0.92700000000000005,0.873,0.820599999999999,0.76734285714285599,{"$f":"HLOOKUP(FLOOR($X$6,5),$G$253:$Q$272,11,FALSE)-($X$6-FLOOR($X$6,5))*((HLOOKUP(FLOOR($X$6,5),$G$253:$Q$272,11,FALSE)-HLOOKUP(FLOOR($X$6,5)+5,$G$253:$Q$272,11,FALSE))/5)","v":1.087}]
[null,null,null,null,12,null,1.3186095238095299,1.2654380952380999,1.2122666666666699,1.1579999999999999,1.1060000000000001,1.054,1,0.94699999999999995,0.89200000000000002,0.84006666666666396,0.78689523809523498,{"$f":"HLOOKUP(FLOOR($X$6,5),$G$253:$Q$272,12,FALSE)-($X$6-FLOOR($X$6,5))*((HLOOKUP(FLOOR($X$6,5),$G$253:$Q$272,12,FALSE)-HLOOKUP(FLOOR($X$6,5)+5,$G$253:$Q$272,12,FALSE))/5)","v":1.1060000000000001}]
[null,null,null,null,13,null,1.3369904761904801,1.28396190476191,1.2309333333333301,1.177,1.125,1.073,1.0189999999999999,0.96599999999999997,0.91200000000000003,0.85973333333333102,0.80670476190476004,{"$f":"HLOOKUP(FLOOR($X$6,5),$G$253:$Q$272,13,FALSE)-($X$6-FLOOR($X$6,5))*((HLOOKUP(FLOOR($X$6,5),$G$253:$Q$272,13,FALSE)-HLOOKUP(FLOOR($X$6,5)+5,$G$253:$Q$272,13,FALSE))/5)","v":1.125}]
[null,null,null,null,14,null,1.3556857142857199,1.3027428571428601,1.2498,1.196,1.1439999999999999,1.0920000000000001,1.038,0.98599999999999999,0.93100000000000005,0.87919999999999898,0.82625714285714102,{"$f":"HLOOKUP(FLOOR($X$6,5),$G$253:$Q$272,14,FALSE)-($X$6-FLOOR($X$6,5))*((HLOOKUP(FLOOR($X$6,5),$G$253:$Q$272,14,FALSE)-HLOOKUP(FLOOR($X$6,5)+5,$G$253:$Q$272,14,FALSE))/5)","v":1.1439999999999999}]
[null,null,null,null,15,null,1.3746857142857101,1.32174285714286,1.2687999999999999,1.2150000000000001,1.163,1.111,1.0569999999999999,1.0049999999999999,0.95,0.8982,0.84525714285714404,{"$f":"HLOOKUP(FLOOR($X$6,5),$G$253:$Q$272,15,FALSE)-($X$6-FLOOR($X$6,5))*((HLOOKUP(FLOOR($X$6,5),$G$253:$Q$272,15,FALSE)-HLOOKUP(FLOOR($X$6,5)+5,$G$253:$Q$272,15,FALSE))/5)","v":1.163}]
[null,null,null,null,16,null,1.39315757575758,1.3403393939393999,1.2875212121212101,1.234,1.1819999999999999,1.1299999999999999,1.0760000000000001,1.0241818181818201,0.96976363636363605,0.91779393939393805,0.86497575757575695,{"$f":"HLOOKUP(FLOOR($X$6,5),$G$253:$Q$272,16,FALSE)-($X$6-FLOOR($X$6,5))*((HLOOKUP(FLOOR($X$6,5),$G$253:$Q$272,16,FALSE)-HLOOKUP(FLOOR($X$6,5)+5,$G$253:$Q$272,16,FALSE))/5)","v":1.1819999999999999}]
[null,null,null,null,17,null,1.4118129870129901,1.3590792207792199,1.30634545454545,1.2529999999999999,1.2010000000000001,1.149,1.095,1.0435000000000001,0.98916363636363602,0.93720909090908899,0.88447532467532397,{"$f":"HLOOKUP(FLOOR($X$6,5),$G$253:$Q$272,17,FALSE)-($X$6-FLOOR($X$6,5))*((HLOOKUP(FLOOR($X$6,5),$G$253:$Q$272,17,FALSE)-HLOOKUP(FLOOR($X$6,5)+5,$G$253:$Q$272,17,FALSE))/5)","v":1.2010000000000001}]
[null,null,null,null,18,null,1.4304683982684001,1.3778190476190499,1.3251696969697,1.272,1.22,1.1679999999999999,1.1140000000000001,1.0628181818181801,1.0085636363636401,0.95662424242424104,0.90397489177489099,{"$f":"HLOOKUP(FLOOR($X$6,5),$G$253:$Q$272,18,FALSE)-($X$6-FLOOR($X$6,5))*((HLOOKUP(FLOOR($X$6,5),$G$253:$Q$272,18,FALSE)-HLOOKUP(FLOOR($X$6,5)+5,$G$253:$Q$272,18,FALSE))/5)","v":1.22}]
[null,null,null,null,19,null,1.4491238095238099,1.3965588744588799,1.34399393939394,1.2909999999999999,1.2390000000000001,1.1870000000000001,1.133,1.0821363636363599,1.02796363636364,0.97603939393939199,0.923474458874458,{"$f":"HLOOKUP(FLOOR($X$6,5),$G$253:$Q$272,19,FALSE)-($X$6-FLOOR($X$6,5))*((HLOOKUP(FLOOR($X$6,5),$G$253:$Q$272,19,FALSE)-HLOOKUP(FLOOR($X$6,5)+5,$G$253:$Q$272,19,FALSE))/5)","v":1.2390000000000001}]
[null,null,null,null,20,null,1.46777922077922,1.4152987012987099,1.3628181818181799,1.31,1.258,1.206,1.1519999999999999,1.1014545454545399,1.04736363636364,0.99545454545454304,0.94297402597402502,{"$f":"HLOOKUP(FLOOR($X$6,5),$G$253:$Q$272,20,FALSE)-($X$6-FLOOR($X$6,5))*((HLOOKUP(FLOOR($X$6,5),$G$253:$Q$272,20,FALSE)-HLOOKUP(FLOOR($X$6,5)+5,$G$253:$Q$272,20,FALSE))/5)","v":1.258}]
[]
[]
[]
[]
[]
[]
[]
[]
[]
[]
[null,null,null,null,"JAZ - Korrekturfaktor Verflüssiger",null,null,"JAZ - Korrekturfaktor Quellenpumpe"]
[null,null,null,null,null,null,null,"Sole-Wasser",null,"Sole-Wasser (Zwischen-WT)",null,"Wasser-Wasser"]
[null,null,null,null,"DeltaT Prüfstand:",{"$f":"VLOOKUP(G6,Leistungsdaten!$A:$K,2,FALSE)","v":5},null,"Standardwert ?",{"$f":"IF(P6=P9,TRUE,FALSE)","v":true},"Standardwert",{"$f":"I285","v":true},"Standardwert ?",{"$f":"I285","v":true}]
[null,null,null,null,{"$f":"K9","v":"3 K"},{"$f":"-0.0103*$F$285+1.031","v":0.97949999999999993},null,"Pumpenleistung (manuell)","0","Pumpenleistung (manuell)",{"$f":"I286","v":"0"},"Pumpenleistung (manuell)",{"$f":"I286","v":"0"}]
[null,null,null,null,"4 K",{"$f":"-0.0102*$F$285+1.0407","v":0.98969999999999991},null,"Leistungsaufnahme Bo",{"$f":"VLOOKUP($G$6,Leistungsdaten!$A:$K,4,FALSE)*Y6","v":3.88},"Leistungsaufnahme Bo",{"$f":"I287","v":3.88},"Leistungsaufnahme W10",{"$f":"I287","v":3.88}]
[null,null,null,null,"5 K",{"$f":"-0.0102*$F$285+1.0508","v":0.99979999999999991},null,null,null,"Heizleistung B10",{"$f":"VLOOKUP($G$6,Leistungsdaten!$A:$K,5,FALSE)*Y6","v":4.83},"Heizleistung W10",{"$f":"K288","v":4.83}]
[null,null,null,null,"6 K",{"$f":"-0.0102*$F$285+1.0613","v":1.0103}]
[null,null,null,null,"7 K",{"$f":"-0.0102*$F$285+1.0716","v":1.0206000000000002}]
[null,null,null,null,"8 K",{"$f":"-0.0102*$F$285+1.0815","v":1.0305},null,"Faktor Standard",1.075,"Faktor Standard",{"$f":"IF(K288<10,1.325,IF(K288>20,1.215,1.275))","v":1.325},"Faktor Standard",{"$f":"IF(M288<10,1.25,IF(M288>20,1.14,1.2))","v":1.25}]
[null,null,null,null,"9 K",{"$f":"-0.0102*$F$285+1.0917","v":1.0407},null,"Faktor Manuell",{"$f":"1+(I286/1000)/I287","v":1},"Faktor Manuell",{"$f":"1+(K286/1000)/K287","v":1},"Faktor Manuell",{"$f":"1+(M286/1000)/M287","v":1}]
[null,null,null,null,"10 K",{"$f":"-0.0102*$F$285+1.1025","v":1.0515000000000001},null,"Faktor Ergebnis",{"$f":"IF(I285=TRUE,I291,I292)","v":1.075},"Faktor Ergebnis",{"$f":"IF(K285=TRUE,K291,K292)","v":1.325},"Faktor Ergebnis",{"$f":"IF(M285=TRUE,M291,M292)","v":1.25}]

{"sheet":"Leistungsdaten","index":3,"n_rows":265,"n_cols":17,"rows_kept":265,"cut":false,"hidden":true,"merged":[[1,0,2,0],[253,0,254,0],[103,0,104,0]]}
["Luft-Wasser-Wärmepumpen"]
["WP-Typ","DT","Leistungszahl","Leistungszahl","Leistungszahl"]
[null,"Prüfstand","A-7 / W35","A2 / W35","A10 / W35"]
[{"$f":"Translation!A55","v":"Luft-Wasser-WP (Manuell)"},{"$f":"'Manuelle Eingabe'!D6","v":5},{"$f":"'Manuelle Eingabe'!D8","v":2.7},{"$f":"'Manuelle Eingabe'!D10","v":3.5},{"$f":"'Manuelle Eingabe'!D12","v":4}]
["WPL 15 ACS",5,2.83,3.88,4.83]
["WPL 20 AC",5,3.38,3.99,4.91]
["WPL 25 AC",5,2.93,4.17,5.16]
["WPL 15 AS",5,2.83,3.88,4.83]
["WPL 20 A",5,3.38,3.99,4.91]
["WPL 25 A",5,2.93,4.17,5.16]
["WPL 15 IS-2",5,2.92,4.01,5.35]
["WPL 25 I-2",5,3.05,3.89,5.28]
["WPL 15 IKS-2",5,2.92,4.01,5.35]
["WPL 25 IK-2",5,3.05,3.89,5.28]
["WPL 08 S trend",5,2.89,3.89,4.87]
["WPL 12 S trend",5,2.82,4.13,5.14]
["WPL 16 S trend",5,2.95,4.29,5.18]
["WPL 22 trend",5,2.85,4.05,5.2]
["WPL 28 trend",5,2.5499999999999998,4.03,5.12]
["WPL 10 AC",5,3.06,3.51,4.16]
["WPL 10 I",5,2.94,3.27,4.08]
["WPL 10 IK",5,2.94,3.27,4.08]
["WPL 13 E",5,3.2,3.76,4.6500000000000004]
["WPL 18 E",5,3.3,3.7,4.5999999999999996]
["WPL 23 E",5,3.1,3.6,4.4000000000000004]
["WPL 13 cool",5,3,3.4,4.3]
["WPL 18 cool",5,3.2,3.7,4.5999999999999996]
["WPL 23 cool",5,3.02,3.48,4.34]
["WPL 33 HT",5,2.46,3.45,4.84]
["WPL 34",5,2.78,3.14,3.94]
["WPL 47",5,3.05,3.43,4.24]
["WPL 57",5,2.84,3.3,3.89]
["WPL 44 AC",5,3.5,4.2,4.9000000000000004]
["WPL 60 AC",5,3.4,4.0999999999999996,4.9000000000000004]
["WPL 130 AC",5,2.96,3.26,4.05]
["LWZ 504",5,2.61,3.74,4.95]
["LWZ 304 SOL",5,2.72,3.4,4.1399999999999997]
["LWZ 404 SOL",5,2.82,3.46,4.1900000000000004]
["LWZ 304 Trend",5,2.72,3.4,4.1399999999999997]
["LWZ 404 Trend",5,2.82,3.46,4.1900000000000004]
["LWZ 304 flex",5,2.72,3.4,4.1399999999999997]
["LWZ 404 flex",5,2.82,3.46,4.1900000000000004]
["LWZ smart",5,2.82,3.46,4.1900000000000004]
["LWA 403",5,2.7,3.1,3.7]
["LWZ 504 mit WRG ",5,3.09,4.4000000000000004,5.21]
["LWZ 304 SOL mit WRG ",5,4.0599999999999996,4.1399999999999997,4.38]
["LWZ 404 SOL mit WRG ",5,3.74,3.98,4.3600000000000003]
["LWZ 304 Trend mit WRG ",5,4.0599999999999996,4.1399999999999997,4.38]
["LWZ 404 Trend mit WRG ",5,3.74,3.98,4.3600000000000003]
["LWZ 304 Flex mit WRG ",5,4.0599999999999996,4.1399999999999997,4.38]
["LWZ 404 Flex mit WRG ",5,3.74,3.98,4.3600000000000003]
["LWA 403 mit Abluft",5,2.8,3.2,3.7]
["WPL 33",5,2.6,3.26,4.0999999999999996]
[null,null,null,null,null,null,null,null,null,null,null,null,"LWZ 304 Trend mit WRG ",5,4.0599999999999996,4.1399999999999997,4.38]
[null,null,null,null,null,null,null,null,null,null,null,null,"LWZ 404 Trend mit WRG ",5,3.74,3.98,4.3600000000000003]
[null,null,null,null,null,null,null,null,null,null,null,null,"LWA 403 mit Abluft",5,2.8,3.2,3.7]
[]
[]
[]
[]
[]
[]
[]
[]
[]
[]
[]
[]
[]
[]
[]
[]
[]
[]
[]
[]
[]
[]
[]
[]
[]
[]
[]
[]
[]
[]
[]
[]
[]
[]
[]
[]
[]
[]
[]
[]
[]
[]
[]
[]
["beim Hinzufügen neuer Maschinen ListFillrange (Eingabewerte>>Comboboxen WP>>ListFillRange WP) entsprechend anpassen & bei Leistungskurven Tabelle mit Heizleistungen an entsprechender Stelle einfügen"]
[]
["Sole-Wasser-Wärmepumpen (Achtung bei neuen Sole-Wasser-WP Blatt Solepumpe anpassen !!!)"]
["WP-Typ","DT","Leistungszahl","Leistungsaufnahme","Heizleistung"]
[null,"Prüfstand","B0/W35","Bo/W35","B10/W35"]
[{"$f":"Translation!A56","v":"Sole-Wasser-WP (Manuell)"},{"$f":"'Manuelle Eingabe'!D16","v":5},{"$f":"'Manuelle Eingabe'!D18","v":4.5},{"$f":"'Manuelle Eingabe'!D20","v":4},{"$f":"'Manuelle Eingabe'!D22","v":20}]
["WPC 04",5,4.5199999999999996,1.056,6.22]
["WPC 05",5,4.79,1.214,7.26]
["WPC 07",5,4.8499999999999996,1.5449999999999999,9.67]
["WPC 10",5,5.0199999999999996,2.0550000000000002,13.12]
["WPC 13",5,4.83,2.7360000000000002,16.899999999999999]
["WPC 04 cool",5,4.5199999999999996,1.056,6.22]
["WPC 05 cool",5,4.79,1.214,7.26]
["WPC 07 cool",5,4.8499999999999996,1.5449999999999999,9.67]
["WPC 10 cool",5,5.0199999999999996,2.0550000000000002,13.12]
["WPC 13 cool",5,4.83,2.7360000000000002,16.899999999999999]
["WPF 04",5,4.5199999999999996,1.056,6.22]
["WPF 05",5,4.79,1.214,7.26]
["WPF 07",5,4.8499999999999996,1.5449999999999999,9.67]
["WPF 10",5,5.0199999999999996,2.0550000000000002,13.12]
["WPF 13",5,4.83,2.7360000000000002,16.899999999999999]
["WPF 16",5,4.54,3.7480000000000002,21.68]
["WPF 04 cool",5,4.5199999999999996,1.056,6.22]
["WPF 05 cool",5,4.79,1.214,7.26]
["WPF 07 cool",5,4.8499999999999996,1.5449999999999999,9.67]
["WPF 10 cool",5,5.0199999999999996,2.0550000000000002,13.12]
["WPF 13 cool",5,4.83,2.7360000000000002,16.899999999999999]
["WPF 16 cool",5,4.54,3.7480000000000002,21.68]
["WPF 5 basic",5,4.33,1.36,7.2]
["WPF 7 basic",5,4.5,1.7,10]
["WPF 10 basic",5,4.37,2.2200000000000002,12.5]
["WPF 13 basic",5,4.42,2.85,17.100000000000001]
["WPF 16 basic",5,4.16,4,20.9]
["WPF 10 M",5,4.49,2.2200000000000002,12.5]
["WPF 13 M",5,4.57,2.82,17.100000000000001]
["WPF 16 M",5,4.3499999999999996,3.5,21.7]
["WPF 20",5,4.66,4.5,27.9]
["WPF 27",5,4.8499999999999996,6.1,37.83]
["WPF 27 HT",5,4.34,6.1,35.299999999999997]
["WPF 35",5,4.72,7.98,49.03]
["WPF 40",5,4.67,9.1,55.3]
["WPF 52",5,4.8099999999999996,11.6,71.569999999999993]
["WPF 66",5,4.5599999999999996,14.2,86.7]
["WPF 20 SET",5,4.49,4.4400000000000004,25]
["WPF 23 SET",5,4.53,5.04,29.6]
["WPF 26 SET",5,4.57,5.64,34.200000000000003]
["WPF 29 SET",5,4.46,6.32,38.799999999999997]
["WPF 32 SET",5,4.3499999999999996,7,43.4]
[]
[]
[]
[]
[]
[]
[]
[]
[]
[]
[]
[]
[]
[]
[]
[]
[]
[]
[]
[]
[]
[]
[]
[]
[]
[]
[]
[]
[]
[]
[]
[]
[]
[]
[]
[]
[]
[]
[]
[]
[]
[]
[]
[]
[]
[]
[]
[]
[]
[]
[]
[]
["beim Hinzufügen neuer Maschinen ListFillrange (Eingabewerte>>Comboboxen WP>>ListFillRange WP) entsprechend anpassen & bei Leistungskurven Tabelle mit Heizleistungen an entsprechender Stelle einfügen"]
[]
["Wasser-Wasser-Wärmepumpen"]
["WP-Typ","DT","Leistungszahl","Leistungsaufnahme","Heizleistung"]
[null,"Prüfstand","W10/W35","W10/W35","W10/W35 [KW]"]
[{"$f":"Translation!A54","v":"Wasser-Wasser-WP (Manuell)"},{"$f":"'Manuelle Eingabe'!D26","v":5},{"$f":"'Manuelle Eingabe'!D28","v":5},{"$f":"'Manuelle Eingabe'!D30","v":3},{"$f":"'Manuelle Eingabe'!D32","v":15}]
[]
[]
[]
[]
[]
[]
[]
[]
[]
[]
[]
[]
[]
[]
[]
[]
[]
[]
[]
[]
[]
[]
[]
[]
[]
[]
[]
[]
[]
[]
[]
[]
[]
[]
[]
[]
[]
[]
[]
[]
[]
[]
[]
[]
["beim Hinzufügen neuer Maschinen ListFillrange (Eingabewerte>>Comboboxen WP>>ListFillRange WP) entsprechend anpassen & bei Leistungskurven Tabelle mit Heizleistungen an entsprechender Stelle einfügen"]
[]
["Warmwasser-Wärmepumpen"]
["WP-Typ","Leistungszahl","Temperatur","Faktor","Faktor F2"]
[null,"W15/W50","Prüfstand","F1","Kellerluft=0,9; Abluft = 1"]
[{"$f":"Translation!A57","v":"Warmwasser-WP (Manuell)"},{"$f":"'Manuelle Eingabe'!D36","v":5},{"$f":"'Manuelle Eingabe'!D38","v":55},{"$f":"IF(C256=\"\",\"\",0.01*C256+0.5)","v":1.05},{"$f":"IF('Manuelle Eingabe'!D40='Manuelle Eingabe'!J38,0.9,1)","v":0.9}]
["WWK 220 electronic",3.42,55,{"$f":"IF(C257=\"\",\"\",0.01*C257+0.5)","v":1.05},0.9]
["WWK 300 electronic",3.82,55,1.05,0.9]
["WWK 300 electronic SOL",3.82,55,1.05,0.9]
["WWK 221 electronic",3.4,55,1.05,0.9]
["WWK 301 electronic",3.8,55,1.05,0.9]
["WWK 301 electronic SOL",3.8,55,1.05,0.9]
["WWS 20",3.8,55,1.05,0.9]
["LWA 252",4.2,55,1.05,1]
["LWA 100",2.8,55,1.05,1]

{"sheet":"Klimadaten","index":4,"n_rows":8032,"n_cols":7,"rows_kept":8032,"cut":false,"hidden":true,"merged":[[1,0,1,2],[1,4,1,6]]}
[]
["Norm-Außentemperaturen Deutschland",null,null,null,"Norm-Außentemperaturen Österreich"]
[72280,"Aach","-16 °C","die eine",9913,"Abfaltersbach","-17 °C"]
[78267,"Aach/Hegau","-14 °C","Stadt bei",3462,"Absdorf","-13 °C"]
["520xx","Aachen","-12 °C","Aktualisierung",5441,"Abtenau","-16 °C"]
["7343x","Aalen / Württ.","-16 °C","manuell",5122,"Ach","-15 °C"]
[65326,"Aarbergen","-14 °C","hinzufügen!!",2481,"Achau","-13 °C"]
[19322,"Abbendorf","-14 °C",null,6215,"Achenkirch","-17 °C"]
[30900,"Abbensen","-14 °C",null,4541,"Adlwang","-14 °C"]
[31234,"Abbensen","-14 °C",null,8911,"Admont","-17 °C"]
[93326,"Abensberg","-18 °C",null,5421,"Adnet","-15 °C"]
[8485,"Abhorn","-16 °C",null,8623,"Aflenz Kurort","-15 °C"]
[37290,"Abterode","-16 °C",null,9542,"Afritz","-15 °C"]
[4347,"Abtnaundorf","-14 °C",null,3642,"Aggsbach Dorf","-13 °C"]
[94261,"Abtschlag","-18 °C",null,3641,"Aggsbach Markt","-13 °C"]
[73453,"Abtsgmünd","-16 °C",null,8966,"Aich (im Ennstal)","-15 °C"]
[69518,"Abtsteinach","-12 °C",null,3814,"Aigen (Waldviertel)","-16 °C"]
[83101,"Achenmühle","-18 °C",null,8943,"Aigen im Ennstal","-16 °C"]
[77855,"Achern","-12 °C",null,4160,"Aigen im Mühlkreis","-14 °C"]
[28832,"Achim","-12 °C",null,5351,"Aigen-Voglhub","-14 °C"]
[82547,"Achmühle","-16 °C",null,9951,"Ainet","-16 °C"]
[88480,"Achstetten","-16 °C",null,4676,"Aistersheim","-15 °C"]
[47626,"Achterhoek","-10 °C",null,4211,"Alberndorf in der Riedmark","-14 °C"]
[25917,"Achtrup","-10 °C",null,6861,"Alberschwende","-15 °C"]
[37581,"Ackenhausen","-16 °C",null,3613,"Albrechtsberg an der Großen Krems","-17 °C"]
[73099,"Adelberg","-16 °C",null,6071,"Aldrans","-15 °C"]
[37139,"Adelebsen","-14 °C",null,4072,"Alkoven","-14 °C"]
[79618,"Adelhausen","-12 °C",null,2534,"Alland","-14 °C"]
[73486,"Adelmannsfelden","-16 °C",null,2535,"Alland Heilstätte","-15 °C"]
[79669,"Adelsberg","-16 °C",null,3804,"Allentsteig","-17 °C"]
[97737,"Adelsberg","-14 °C",null,8412,"Allerheiligen bei Wildon","-14 °C"]
[85111,"Adelschlag","-16 °C",null,8643,"Allerheiligen im Mürztal","-14 °C"]
[74740,"Adelsheim","-14 °C",null,4511,"Allhaming","-14 °C"]
[86477,"Adelsried","-16 °C",null,5761,"Alm","-17 °C"]
[4886,"Adelwitz","-16 °C",null,6236,"Alpach","-17 °C"]
[21365,"Adendorf","-12 °C",null,8671,"Alpl","-16 °C"]
[31171,"Adensen","-14 °C",null,6844,"Altach","-13 °C"]
[31079,"Adenstedt","-16 °C",null,8992,"Altaussee","-15 °C"]
[84166,"Adlkofen","-16 °C",null,4203,"Altenberg bei Linz","-14 °C"]
[8626,"Adorf/Vogtland","-18 °C",null,3591,"Altenburg","-15 °C"]
[31855,"Aerzen","-14 °C",null,4121,"Altenfelden","-15 °C"]
[71563,"Affalterbach","-14 °C",null,4674,"Altenhof am Hausruck","-15 °C"]
[74182,"Affaltrach","-14 °C",null,8934,"Altenmarkt bei Sankt Gallen","-15 °C"]
[86444,"Affing","-16 °C",null,5541,"Altenmarkt im Pongau","-17 °C"]
[71083,"Affstätt","-16 °C",null,2571,"Altenmarkt-Thenneberg","-15 °C"]
[74858,"Aglasterhausen","-12 °C",null,3474,"Altenwörth","-13 °C"]
[48683,"Ahaus","-10 °C",null,4950,"Altheim","-15 °C"]
[88697,"Ahausen","-12 °C",null,9333,"Althofen","-15 °C"]
[72160,"Ahldorf","-16 °C",null,3033,"Altlengbach","-14 °C"]
["5922x","Ahlen/Westf.","-12 °C",null,2144,"Altlichtenwarth","-14 °C"]
[6313,"Ahlsdorf","-14 °C",null,4813,"Altmünster","-14 °C"]
[32609,"Ahlsen","-12 °C",null,4721,"Altschwendt","-16 °C"]
[34292,"Ahnatal","-14 °C",null,2141,"Ameis","-14 °C"]
[29353,"Ahnsbeck","-14 °C",null,4843,"Ampflwang","-16 °C"]
[94527,"Aholming","-18 °C",null,3300,"Amstetten","-13 °C"]
[74744,"Ahorn","-16 °C",null,7163,"Andau","-14 °C"]
[96482,"Ahorn","-16 °C",null,6866,"Andelsbuch","-15 °C"]
[95491,"Ahorntal","-16 °C",null,4770,"Andorf","-15 °C"]
[38707,"Ahrensberg","-12 °C",null,4754,"Andrichsfurt","-15 °C"]
[22926,"Ahrensburg","-12 °C",null,8184,"Anger","-14 °C"]
[16356,"Ahrensfelde","-14 °C",null,2261,"Angern an der March","-14 °C"]
[18320,"Ahrenshagen","-10 °C",null,5081,"Anif","-15 °C"]
[53945,"Ahrhütte","-14 °C",null,3222,"Annaberg","-15 °C"]
[86551,"Aichach","-16 °C",null,5524,"Annaberg im Lammertal","-15 °C"]
[92262,"Aichach","-16 °C",null,4052,"Ansfelden","-13 °C"]
[72539,"Aichelau","-16 °C",null,5102,"Anthering","-15 °C"]
[73101,"Aichelberg","-16 °C",null,4980,"Antiesenhofen","-15 °C"]
[75323,"Aichelberg","-16 °C",null,7143,"Apetlon","-14 °C"]
[78733,"Aichhalden","-16 °C",null,3925,"Arbesbach","-18 °C"]
[88317,"Aichstetten","-16 °C",null,4341,"Arbing","-14 °C"]
[72631,"Aichtal","-14 °C",null,3321,"Ardagger Markt","-13 °C"]
[73773,"Aichwald","-14 °C",null,8904,"Ardning","-17 °C"]
[84539,"Aidenbach","-16 °C",null,8454,"Arnfels","-14 °C"]
[94501,"Aidenbach","-16 °C",null,9601,"Arnoldstein","-16 °C"]
[97491,"Aidhausen","-16 °C",null,4122,"Arnreit","-14 °C"]
[71134,"Aidlingen","-16 °C",null,9543,"Arriach","-15 °C"]
[88448,"Aigendorf","-16 °C",null,3661,"Artstetten","-15 °C"]
[88048,"Ailingen","-12 °C",null,6471,"Arzl im Pitztal","-16 °C"]
[86447,"Aindling","-16 °C",null,4082,"Aschach an der Donau","-14 °C"]
[83404,"Ainring","-16 °C",null,4421,"Aschach an der Steyr","-14 °C"]
[83026,"Aising","-18 °C",null,6274,"Aschau (Zillertal)","-15 °C"]
[89344,"Aislingen","-16 °C",null,3361,"Aschbach Markt","-14 °C"]
[94330,"Aiterhofen","-18 °C",null,5252,"Aspach","-15 °C"]
[88319,"Aitrach","-16 °C",null,2870,"Aspang Markt","-14 °C"]
[78554,"Aixheim","-18 °C",null,2151,"Asparn an der Zaya","-14 °C"]
[37671,"Albaxen","-12 °C",null,3041,"Asperhofen","-14 °C"]
[79774,"Albbruck","-12 °C",null,8966,"Assach","-15 °C"]
[8280,"Albernau    ","-16 °C",null,9911,"Assling","-16 °C"]
[8280,"Alberoda","-16 °C",null,4481,"Asten","-13 °C"]
[4420,"Albersdorf","-14 °C",null,4864,"Attersee","-15 °C"]
[73095,"Albershausen","-16 °C",null,4800,"Attnang","-15 °C"]
[76857,"Albersweiler","-12 °C",null,4904,"Atzbach","-15 °C"]
[88433,"Alberweiler","-16 °C",null,3452,"Atzenbrugg","-13 °C"]
[72458,"Albstadt","-18 °C",null,4332,"Au an der Donau","-13 °C"]
[72461,"Albstadt","-18 °C",null,8624,"Au bei Aflenz","-16 °C"]
[57258,"Alchen","-12 °C",null,2214,"Auersthal","-14 °C"]
[52457,"Aldenhoven","-12 °C",null,6313,"Auffach","-18 °C"]
[94501,"Aldersbach","-16 °C",null,4971,"Aurolzmünster","-15 °C"]
[78554,"Aldingen","-18 °C",null,9831,"Außerfragant","-15 °C"]
[86733,"Alerheim","-16 °C",null,9931,"Außervillgraten","-17 °C"]
[91793,"Alesheim","-16 °C",null,6094,"Axams","-15 °C"]
[73553,"Alfdorf","-16 °C",null,6653,"Bach (Lechtal)","-17 °C"]
[31061,"Alfeld","-16 °C",null,4672,"Bachmanning","-15 °C"]
[91236,"Alfeld","-16 °C",null,8990,"Bad Aussee","-14 °C"]
[91177,"Alfershausen","-16 °C",null,9530,"Bad Bleiberg","-17 °C"]
[49594,"Alfhausen","-12 °C",null,2405,"Bad Deutsch-Altenburg","-14 °C"]
[53347,"Alfter","-12 °C",null,2721,"Bad Fischau","-14 °C"]
[99310,"Alkersleben","-14 °C",null,8524,"Bad Gams","-14 °C"]
[59846,"Allendorf","-14 °C",null,8344,"Bad Gleichenberg","-13 °C"]
[35108,"Allendorf/Eder","-14 °C",null,4822,"Bad Goisern","-14 °C"]
[90584,"Allersberg","-16 °C",null,4540,"Bad Hall","-14 °C"]
[88422,"Alleshausen","-16 °C",null,6323,"Bad Häring","-17 °C"]
[82239,"Alling","-16 °C",null,5630,"Bad Hofgastein","-16 °C"]
[78464,"Allmannsdorf","-12 °C",null,4820,"Bad Ischl","-14 °C"]
[77963,"Allmannsweier","-12 °C",null,9546,"Bad Kleinkirchheim","-16 °C"]
[89604,"Allmendingen","-14 °C",null,4362,"Bad Kreuzen","-14 °C"]
[71573,"Allmersbach im Tal","-14 °C",null,4190,"Bad Leonfelden","-16 °C"]
[6507,"Allrode / Harz","-16 °C",null,8983,"Bad Mitterndorf","-16 °C"]
[6542,"Allstedt","-14 °C",null,9462,"Bad Sankt Leonhard im Lavanttal","-14 °C"]
[31079,"Almstedt","-16 °C",null,4701,"Bad Schallerbach","-16 °C"]
[46519,"Alpen","-10 °C",null,2853,"Bad Schönau","-13 °C"]
[46519,"Alpen-Bönninghardt","-10 °C",null,7431,"Bad Tatzmannsdorf","-13 °C"]
[99195,"Alperstedt","-14 °C",null,2540,"Bad Vöslau","-13 °C"]
[72275,"Alpirsbach","-16 °C",null,4654,"Bad Wimsbach-Neydharting","-15 °C"]
[52477,"Alsdorf/Rheinl.","-12 °C",null,4283,"Bad Zell","-14 °C"]
[67722,"Alsenbrück","-12 °C",null,2500,"Baden","-13 °C"]
[36304,"Alsfeld","-14 °C",null,5640,"Badgastein","-15 °C"]
[67577,"Alsheim","-12 °C",null,9805,"Baldramsdorf","-14 °C"]
[57515,"Alsting (Frankreich)","-12 °C",null,8572,"Bärnbach","-14 °C"]
[19303,"Alt Jabel","-12 °C",null,4342,"Baumgartenberg","-14 °C"]
[18236,"Alt Karin","-10 °C",null,6121,"Baumkirchen","-15 °C"]
[75365,"Altburg","-16 °C",null,4441,"Behamberg","-15 °C"]
[75365,"Altburg ","-16 °C",null,2413,"Berg (bei Kittsee)","-14 °C"]
[3229,"Altdöbern","-16 °C",null,9771,"Berg (im Drautal)","-16 °C"]
[71155,"Altdorf","-16 °C",null,5101,"Bergheim","-15 °C"]
[72655,"Altdorf","-16 °C",null,2560,"Berndorf (an der Triesting)","-14 °C"]
[77955,"Altdorf","-12 °C",null,5165,"Berndorf bei Salzburg","-15 °C"]
[84032,"Altdorf","-16 °C",null,2275,"Bernhardsthal","-14 °C"]
[90518,"Altdorf","-16 °C",null,7434,"Bernstein","-13 °C"]
[83549,"Alteiselfing","-16 °C",null,6622,"Berwang","-18 °C"]
[58762,"Altena / Westf.","-12 °C",null,6870,"Bezau","-17 °C"]
[53505,"Altenahr","-14 °C",null,6633,"Biberwier","-18 °C"]
[38707,"Altenau","-16 °C",null,6621,"Bichlbach","-18 °C"]
[4828,"Altenbach","-14 °C",null,2362,"Biedermannsdorf","-13 °C"]
[33184,"Altenbeken","-14 °C",null,8190,"Birkfeld","-15 °C"]
[1773,"Altenberg","-16 °C",null,9652,"Birnbaum","-14 °C"]
[49733,"Altenberge","-10 °C",null,2102,"Bisamberg","-13 °C"]
[48341,"Altenbergen","-12 °C",null,8731,"Bischoffeld","-15 °C"]
[34587,"Altenbrunslar","-14 °C",null,5500,"Bischofshofen","-16 °C"]
[4600,"Altenburg","-14 °C",null,3232,"Bischofstetten","-14 °C"]
[34587,"Altenburg","-14 °C",null,6874,"Bizau","-17 °C"]
[29574,"Altenebstorf","-14 °C",null,9150,"Bleiburg","-16 °C"]
[45329,"Altenessen","-10 °C",null,3372,"Blindenmarkt","-13 °C"]
[98701,"Altenfeld","-16 °C",null,6700,"Bludenz","-15 °C"]
[66885,"Altenglau","-14 °C",null,2602,"Blumau bei Felixdorf","-13 °C"]
[36391,"Altengronau","-14 °C",null,8283,"Blumau in der Steiermark","-13 °C"]
[31558,"Altenhagen","-14 °C",null,2213,"Bockfließ","-14 °C"]
[33729,"Altenhagen","-12 °C",null,5645,"Böckstein","-15 °C"]
[85356,"Altenhausen","-16 °C",null,9551,"Bodensdorf","-15 °C"]
[77743,"Altenheim","-12 °C",null,3071,"Böheimkirchen","-14 °C"]
[16244,"Altenhof","-14 °C",null,3333,"Böhlerwerk","-14 °C"]
[96479,"Altenhof","-16 °C",null,5733,"Bramberg am Wildkogel","-18 °C"]
[57368,"Altenhundem","-14 °C",null,6708,"Brand","-17 °C"]
[57610,"Altenkirchen","-14 °C",null,3873,"Brand (Waldviertel)","-17 °C"]
[66903,"Altenkirchen","-12 °C",null,6234,"Brandenberg","-17 °C"]
[23730,"Altenkrempe","-10 °C",null,5280,"Braunau am Inn","-15 °C"]
[83352,"Altenmarkt","-16 °C",null,6751,"Braz","-16 °C"]
[29575,"Altenmedingen","-12 °C",null,6900,"Bregenz","-11 °C"]
[26169,"Altenoythe","-12 °C",null,6904,"Bregenz-Rieden","-12 °C"]
[95500,"Altenplos","-16 °C",null,6903,"Bregenz-Vorkloster","-11 °C"]
[72657,"Altenriet","-16 °C",null,4075,"Breitenaich","-15 °C"]
[6642,"Altenrode","-14 °C",null,2624,"Breitenau (Steinfeld)","-14 °C"]
[89281,"Altenstadt","-16 °C",null,7091,"Breitenbrunn","-13 °C"]
[92665,"Altenstadt","-16 °C",null,8313,"Breitenfeld an der Rittschein","-13 °C"]
[72213,"Altensteig","-16 °C",null,2384,"Breitenfurt bei Wien","-14 °C"]
[17087,"Altentreptow","-14 °C",null,4691,"Breitenschützing","-15 °C"]
[97327,"Altertheim","-14 °C",null,2673,"Breitenstein","-16 °C"]
[66802,"Altforweiler","-12 °C",null,2041,"Breitenwaida","-14 °C"]
[1462,"Altfranken","-14 °C",null,6364,"Brixen im Thale","-18 °C"]
[84169,"Altfraunhofen","-16 °C",null,6230,"Brixlegg","-15 °C"]
[9326,"Altgeringswalde","-14 °C",null,2833,"Bromberg","-14 °C"]
[72160,"Altheim","-16 °C",null,5671,"Bruck an der Großglocknerstraße","-18 °C"]
[74731,"Altheim","-16 °C",null,8251,"Bruck an der Lafnitz","-14 °C"]
[77743,"Altheim","-12 °C",null,2460,"Bruck an der Leitha","-14 °C"]
[88433,"Altheim","-16 °C",null,8600,"Bruck an der Mur","-14 °C"]
[89174,"Altheim","-16 °C",null,9371,"Brückl","-15 °C"]
[89195,"Altheim","-16 °C",null,2345,"Brunn am Gebirge","-13 °C"]
[89605,"Altheim","-14 °C",null,3595,"Brunn an der Wild","-16 °C"]
[88499,"Altheim   ( b Riedlingen,Württ )","-14 °C",null,8481,"Brunnsee","-13 °C"]
[4451,"Althen","-14 °C",null,8274,"Buch bei Hartberg","-12 °C"]
[75382,"Althengstett","-14 °C",null,4611,"Buchkirchen","-14 °C"]
[71566,"Althütte","-14 °C",null,8291,"Burgau","-12 °C"]
[72119,"Altingen","-16 °C",null,5274,"Burgkirchen","-15 °C"]
[82054,"Altkirchen","-16 °C",null,5111,"Bürmoos","-15 °C"]
[19288,"Alt-Krenzlin","-14 °C",null,6752,"Dalaas","-17 °C"]
[68804,"Altlußheim","-12 °C",null,6884,"Damüls","-16 °C"]
[73479,"Altmannsrot","-16 °C",null,8241,"Dechantskirchen","-13 °C"]
[93336,"Altmannstein","-16 °C",null,9635,"Dellach (im Gailtal)","-15 °C"]
[84453,"Altmühldorf","-16 °C",null,9772,"Dellach im Drautal","-16 °C"]
[85250,"Altomünster","-16 °C",null,4693,"Desselbrunn","-15 °C"]
[77815,"Altschweier","-14 °C",null,2443,"Deutsch Brodersdorf","-13 °C"]
[17214,"Alt-Schwerin","-12 °C",null,8483,"Deutsch Goritz","-13 °C"]
[79263,"Altsimonswald","-16 °C",null,2423,"Deutsch Jahrndorf","-14 °C"]
[89584,"Altsteußlingen","-14 °C",null,7572,"Deutsch Kaltenbrunn","-13 °C"]
[56858,"Altstrimmig","-12 °C",null,7474,"Deutsch Schützen","-13 °C"]
[88364,"Alttann","-16 °C",null,8121,"Deutschfeistritz","-14 °C"]
[17375,"Altwarp","-12 °C",null,9572,"Deutsch-Griffen","-17 °C"]
[63755,"Alzenau","-12 °C",null,7301,"Deutschkreutz","-13 °C"]
[53783,"Alzenbach","-12 °C",null,8530,"Deutschlandsberg","-13 °C"]
[75365,"Alzenberg","-16 °C",null,2232,"Deutsch-Wagram","-14 °C"]
[55232,"Alzey","-12 °C",null,5652,"Dienten am Hochkönig","-16 °C"]
[56727,"Alzheim","-14 °C",null,3813,"Dietmanns","-17 °C"]
[86676,"Ambach","-16 °C",null,9103,"Diex","-16 °C"]
[86854,"Amberg","-16 °C",null,4371,"Dimbach","-16 °C"]
[92224,"Amberg / Oberpf.","-16 °C",null,2181,"Dobermannsdorf","-14 °C"]
[48165,"Amelsbüren","-12 °C",null,3843,"Dobersberg","-16 °C"]
[37688,"Amelunxen","-14 °C",null,7564,"Dobersdorf","-14 °C"]
[83123,"Amerang","-16 °C",null,8143,"Dobl","-14 °C"]
[4683,"Ammelshain","-14 °C",null,8143,"Dobldorf","-14 °C"]
[7407,"Ammelstädt","-14 °C",null,9873,"Döbriach","-15 °C"]
[72119,"Ammerbuch","-16 °C",null,9843,"Döllach","-15 °C"]
[35287,"Amöneburg","-12 °C",null,9991,"Dölsach","-16 °C"]
[85241,"Ampermoching","-16 °C",null,8704,"Donawitz","-14 °C"]
[88436,"Ampfelbronn","-16 °C",null,8953,"Donnersbach","-15 °C"]
[33803,"Amshausen","-14 °C",null,7082,"Donnerskirchen","-13 °C"]
[73340,"Amstetten","-16 °C",null,6933,"Doren","-15 °C"]
[9439,"Amtsberg","-14 °C",null,4751,"Dorf an der Pram","-15 °C"]
[1855,"Amtshainersdorf","-16 °C",null,8663,"Dorf Veitsch","-15 °C"]
[84098,"Andermannsdorf","-18 °C",null,5632,"Dorfgastein","-17 °C"]
[56626,"Andernach","-12 °C",null,4392,"Dorfstetten","-17 °C"]
[99189,"Andisleben","-14 °C",null,6850,"Dornbirn","-12 °C"]
[29413,"Andorf","-14 °C",null,2165,"Drasenhofen","-14 °C"]
[74918,"Angelbachtal","-12 °C",null,7021,"Draßburg","-13 °C"]
[35719,"Angelburg","-14 °C",null,7372,"Draßmarkt","-13 °C"]
[48143,"Angelmodde","-12 °C",null,9580,"Drobollach am Faakersee","-16 °C"]
[99338,"Angelroda","-16 °C",null,2095,"Drosendorf Stadt","-16 °C"]
[40489,"Angermund","-10 °C",null,2265,"Drösing","-14 °C"]
[16278,"Angermünde","-14 °C",null,2263,"Dürnkrut","-14 °C"]
[56584,"Anhausen","-14 °C",null,3601,"Dürnstein","-12 °C"]
[72534,"Anhausen","-16 °C",null,5422,"Dürrnberg","-15 °C"]
[86420,"Anhausen","-16 °C",null,6341,"Ebbs","-15 °C"]
[17389,"Anklam","-12 °C",null,5531,"Eben im Pongau","-17 °C"]
[49577,"Ankum","-12 °C",null,5323,"Ebenau","-16 °C"]
[9456,"Annaberg-Buchholz","-16 °C",null,9565,"Ebene Reichenau","-16 °C"]
[33129,"Anreppen","-12 °C",null,2490,"Ebenfurth","-13 °C"]
[91522,"Ansbach / Mittelfr.","-16 °C",null,4802,"Ebensee","-13 °C"]
[9517,"Ansprung","-16 °C",null,9065,"Ebenthal","-16 °C"]
[82387,"Antdorf","-18 °C",null,2251,"Ebenthal (Weinviertel)","-14 °C"]
[84371,"Anzenkirchen","-16 °C",null,7521,"Eberau","-14 °C"]
[85646,"Anzing","-16 °C",null,2435,"Ebergassing","-13 °C"]
[31552,"Apelern","-14 °C",null,9141,"Eberndorf","-16 °C"]
[86974,"Apfeldorf","-16 °C",null,4906,"Eberschwang","-16 °C"]
[72525,"Apfelstetten","-16 °C",null,8273,"Ebersdorf","-12 °C"]
[88437,"Äpfingen","-16 °C",null,4653,"Eberstallzell","-14 °C"]
[99510,"Apolda","-14 °C",null,9372,"Eberstein","-16 °C"]
[48301,"Appelhülsen","-12 °C",null,2483,"Ebreichsdorf","-13 °C"]
[27616,"Appeln","-12 °C",null,3903,"Echsenbach","-17 °C"]
[71297,"Appenberg","-14 °C",null,2305,"Eckartsau","-14 °C"]
[55437,"Appenheim","-12 °C",null,8332,"Edelsbach bei Feldbach","-13 °C"]
[77767,"Appenweier","-12 °C",null,8583,"Edelschrott","-14 °C"]
[17291,"Arendsee","-14 °C",null,2842,"Edlitz Markt","-14 °C"]
[39619,"Arendsee","-14 °C",null,4070,"Eferding","-15 °C"]
[23617,"Arfrade","-12 °C",null,6863,"Egg","-14 °C"]
[88260,"Argenbühl","-16 °C",null,9624,"Egg (bei Hermagor)","-15 °C"]
[55288,"Armsheim","-12 °C",null,5142,"Eggelsberg","-15 °C"]
[75305,"Arnbach","-14 °C",null,3730,"Eggenburg","-15 °C"]
[39596,"Arneburg","-14 °C",null,2492,"Eggendorf (im Steinfeld)","-13 °C"]
[89134,"Arnegg","-14 °C",null,2031,"Eggendorf im Thale","-14 °C"]
[39596,"Arnim","-14 °C",null,4622,"Eggendorf im Traunkreis","-14 °C"]
["59xxx","Arnsberg","-12 °C",null,4773,"Eggerding","-15 °C"]
[93473,"Arnschwang","-18 °C",null,3861,"Eggern","-17 °C"]
[94424,"Arnsdorf","-16 °C",null,8063,"Eggersdorf bei Graz","-13 °C"]
[99310,"Arnstadt","-14 °C",null,8461,"Ehrenhausen","-14 °C"]
[94424,"Arnstorf","-16 °C",null,6632,"Ehrwald","-17 °C"]
[30966,"Arnum","-14 °C",null,8552,"Eibiswald","-14 °C"]
[31275,"Arpke","-14 °C",null,3032,"Eichgraben","-14 °C"]
[93474,"Arrach","-18 °C",null,9541,"Einöde bei Villach","-15 °C"]
[9326,"Arras","-14 °C",null,8790,"Eisenerz","-14 °C"]
[91247,"Artelshofen","-16 °C",null,9135,"Eisenkappel","-15 °C"]
[6556,"Artern","-14 °C",null,7000,"Eisenstadt","-12 °C"]
[84095,"Arth","-16 °C",null,9861,"Eisentratten","-15 °C"]
[56337,"Arzbach","-12 °C",null,3862,"Eisgarn","-17 °C"]
[4886,"Arzberg","-16 °C",null,9421,"Eitweg","-15 °C"]
[95659,"Arzberg","-18 °C",null,6652,"Elbigenalp","-17 °C"]
[53343,"Arzdorf","-14 °C",null,6352,"Ellmau","-18 °C"]
[54687,"Arzfeld","-14 °C",null,6644,"Elmen","-17 °C"]
[76829,"Arzheim","-12 °C",null,5061,"Elsbethen","-15 °C"]
[53567,"Asbach","-12 °C",null,7562,"Eltendorf","-14 °C"]
[55758,"Asbach","-14 °C",null,3644,"Emmersdorf an der Donau","-13 °C"]
[86502,"Asbach","-16 °C",null,2292,"Engelhartstetten","-14 °C"]
[94094,"Asbach","-16 °C",null,4090,"Engelhartszell","-15 °C"]
[97708,"Aschach","-14 °C",null,4470,"Enns","-13 °C"]
["63xxx","Aschaffenburg","-12 °C",null,4482,"Ennsdorf bei Enns","-13 °C"]
[67753,"Aschbach","-12 °C",null,4761,"Enzenkirchen","-15 °C"]
[96132,"Aschbach","-16 °C",null,2032,"Enzersdorf im Thale","-14 °C"]
[59387,"Ascheberg","-12 °C",null,2202,"Enzersfeld","-14 °C"]
[98634,"Aschenhausen","-16 °C",null,2551,"Enzesfeld","-14 °C"]
[6449,"Aschersleben","-14 °C",null,6343,"Erl","-15 °C"]
[85609,"Aschheim","-16 °C",null,2822,"Erlach","-14 °C"]
[49577,"Aslage","-12 °C",null,3253,"Erlauf","-14 °C"]
[71546,"Aspach","-14 °C",null,2115,"Ernstbrunn","-14 °C"]
[71679,"Asperg","-12 °C",null,4432,"Ernsthofen","-14 °C"]
[55459,"Aspisheim","-12 °C",null,6383,"Erpfendorf","-16 °C"]
[97959,"Assamstadt","-16 °C",null,3153,"Eschenau","-14 °C"]
[67126,"Assenheim","-12 °C",null,4092,"Esternberg","-15 °C"]
[35614,"Asslar - Bechlingen","-12 °C",null,8622,"Etmißl","-15 °C"]
[88433,"Aßmannshardt","-16 °C",null,3492,"Etsdorf am Kamp","-13 °C"]
[38685,"Astfeld","-14 °C",null,9472,"Ettendorf","-15 °C"]
[57439,"Attendorn","-14 °C",null,5301,"Eugendorf","-16 °C"]
[88448,"Attenweiler","-16 °C",null,3324,"Euratsfeld","-13 °C"]
[79280,"Au","-14 °C",null,9583,"Faak am See","-16 °C"]
[76474,"Au am Rhein","-12 °C",null,5324,"Faistenau","-16 °C"]
[97239,"Aub","-16 °C",null,2162,"Falkenstein","-15 °C"]
[81245,"Aubing","-16 °C",null,8350,"Fehring","-13 °C"]
[81249,"Aubing","-16 °C",null,6524,"Feichten","-17 °C"]
[4838,"Audenhain","-14 °C",null,2873,"Feistritz am Wechsel","-15 °C"]
[8280,"Aue","-16 °C",null,9710,"Feistritz an der Drau","-14 °C"]
[33034,"Auenhausen","-14 °C",null,9613,"Feistritz an der Gail","-16 °C"]
[8066,"Auerbach","-14 °C",null,9181,"Feistritz im Rosental","-16 °C"]
[64625,"Auerbach","-10 °C",null,9544,"Feld am See","-15 °C"]
[74834,"Auerbach","-14 °C",null,8330,"Feldbach","-13 °C"]
[8209,"Auerbach / Vogtl.","-16 °C",null,6800,"Feldkirch","-13 °C"]
[8209,"Auerbach / Vogtland","-16 °C",null,4101,"Feldkirchen an der Donau","-14 °C"]
[9238,"Auerswalde","-14 °C",null,8073,"Feldkirchen bei Graz","-15 °C"]
[31749,"Auetal","-14 °C",null,5143,"Feldkirchen bei Mattighofen","-15 °C"]
[73312,"Aufhausen","-16 °C",null,9560,"Feldkirchen in Kärnten","-15 °C"]
[93089,"Aufhausen","-18 °C",null,2603,"Felixdorf","-13 °C"]
[91347,"Aufseß","-16 °C",null,3481,"Fels am Wagram","-13 °C"]
[79424,"Auggen","-12 °C",null,9170,"Ferlach","-16 °C"]
["86xxx","Augsburg","-14 °C",null,9702,"Ferndorf","-14 °C"]
[6308,"Augsdorf","-14 °C",null,8072,"Fernitz","-14 °C"]
[32832,"Augustdorf","-12 °C",null,3325,"Ferschnitz","-13 °C"]
[72525,"Auingen","-16 °C",null,3483,"Feuersbrunn","-13 °C"]
[24613,"Aukrug","-12 °C",null,6391,"Fieberbrunn","-17 °C"]
[88326,"Aulendorf / Württ.","-16 °C",null,5532,"Filzmoos","-17 °C"]
[65606,"Aumenau","-12 °C",null,6292,"Finkenberg","-14 °C"]
[94474,"Aunkirchen","-16 °C",null,9584,"Finkenstein","-16 °C"]
[91589,"Aurach","-16 °C",null,2401,"Fischamend Markt","-13 °C"]
["2660x","Aurich","-10 °C",null,8654,"Fischbach","-16 °C"]
[89335,"Autenried","-16 °C",null,5542,"Flachau","-17 °C"]
[4849,"Authausen","-14 °C",null,8163,"Fladnitz an der Teichalpe","-15 °C"]
[27729,"Axstedt","-12 °C",null,9831,"Flattach","-14 °C"]
[18586,"Baabe","-10 °C",null,6403,"Flaurling","-15 °C"]
[41836,"Baal","-12 °C",null,6521,"Fließ","-16 °C"]
[4457,"Baalsdorf","-14 °C",null,6572,"Flirsch","-17 °C"]
[56729,"Baar","-14 °C",null,8183,"Floing","-13 °C"]
[86672,"Baar","-16 °C",null,9241,"Föderlach","-16 °C"]
[85107,"Baar-Ebenhausen","-18 °C",null,8753,"Fohnsdorf","-16 °C"]
[14482,"Babelsberg","-14 °C",null,6733,"Fontanella","-17 °C"]
[64832,"Babenhausen","-12 °C",null,7212,"Forchtenstein","-14 °C"]
[87727,"Babenhausen","-16 °C",null,4892,"Fornach","-18 °C"]
[83547,"Babensham","-16 °C",null,4873,"Frankenburg","-17 °C"]
[84149,"Babing","-16 °C",null,3213,"Frankenfels","-15 °C"]
[93090,"Bach","-18 °C",null,4890,"Frankenmarkt","-18 °C"]
[50226,"Bachem","-12 °C",null,5131,"Franking","-15 °C"]
[74831,"Bachenau","-12 °C",null,3594,"Franzen","-17 °C"]
[86316,"Bacherer","-16 °C",null,6820,"Frastanz","-14 °C"]
[82266,"Bachern   am Wörthsee","-16 °C",null,2132,"Frättingsdorf","-14 °C"]
[96528,"Bachfeld","-16 °C",null,7132,"Frauenkirchen","-14 °C"]
[89429,"Bachhagel","-16 °C",null,8523,"Frauental an der Laßnitz","-13 °C"]
[82335,"Bachhausen","-16 °C",null,3183,"Freiland","-14 °C"]
[83549,"Bachmehring","-16 °C",null,8694,"Frein an der Mürz","-16 °C"]
[89431,"Bäckingen","-16 °C",null,4240,"Freistadt","-15 °C"]
[71522,"Backnang","-12 °C",null,9712,"Fresach","-15 °C"]
[83043,"Bad Aibling","-16 °C",null,8441,"Fresing","-14 °C"]
[34454,"Bad Arolsen","-14 °C",null,8240,"Friedberg","-14 °C"]
[79415,"Bad Bellingen","-12 °C",null,5211,"Friedburg","-16 °C"]
[48455,"Bad Bentheim","-10 °C",null,3533,"Friedersbach","-17 °C"]
[76887,"Bad Bergzaben","-12 °C",null,9360,"Friesach","-15 °C"]
[99438,"Bad Berka","-14 °C",null,6122,"Fritzens","-15 °C"]
[84364,"Bad Birnbach","-16 °C",null,8130,"Frohnleiten","-14 °C"]
[7422,"Bad Blankenburg","-14 °C",null,8841,"Frojach","-15 °C"]
[97708,"Bad Bocklet","-14 °C",null,6263,"Fügen","-15 °C"]
[73087,"Bad Boll","-16 °C",null,6166,"Fulpmes","-15 °C"]
[24576,"Bad Bramstedt","-12 °C",null,9586,"Fürnitz","-16 °C"]
[53498,"Bad Breisig","-12 °C",null,8280,"Fürstenfeld","-13 °C"]
[88422,"Bad Buchau","-16 °C",null,3511,"Furth bei Göttweig","-12 °C"]
[65520,"Bad Camberg","-14 °C",null,5672,"Fusch an der Großglocknerstraße","-18 °C"]
[70372,"Bad Cannstatt","-12 °C",null,5330,"Fuschl am See","-15 °C"]
[73342,"Bad Ditzenbach","-18 °C",null,6972,"Fußach","-12 °C"]
[18209,"Bad Doberan","-10 °C",null,2531,"Gaaden","-13 °C"]
[33014,"Bad Driburg","-14 °C",null,8424,"Gabersdorf","-14 °C"]
[4849,"Bad Düben","-14 °C",null,3003,"Gablitz","-14 °C"]
[67098,"Bad Dürkheim","-12 °C",null,3334,"Gaflenz","-14 °C"]
[6231,"Bad Dürrenberg","-14 °C",null,8783,"Gaishorn","-15 °C"]
[78073,"Bad Dürrheim","-18 °C",null,6974,"Gaißau","-12 °C"]
[31703,"Bad Eilsen","-14 °C",null,9132,"Gallizien","-16 °C"]
[8645,"Bad Elster","-18 °C",null,4210,"Gallneukirchen","-13 °C"]
[56130,"Bad Ems","-12 °C",null,4713,"Gallspach","-15 °C"]
[34308,"Bad Emstal","-14 °C",null,3292,"Gaming","-16 °C"]
[35080,"Bad Endbach","-14 °C",null,8462,"Gamlitz","-14 °C"]
[83093,"Bad Endorf","-16 °C",null,4851,"Gampern","-16 °C"]
[49152,"Bad Essen","-12 °C",null,8922,"Gams bei Hieflau","-15 °C"]
[83075,"Bad Feilnbach","-18 °C",null,3122,"Gansbach","-15 °C"]
[74177,"Bad Friedrichshall","-12 °C",null,2230,"Gänserndorf","-14 °C"]
[37581,"Bad Gandersheim","-16 °C",null,6787,"Gargellen","-18 °C"]
["53xxx","Bad Godesberg","-10 °C",null,3571,"Gars am Kamp","-14 °C"]
[94086,"Bad Griesbach","-16 °C",null,4451,"Garsten","-14 °C"]
[87730,"Bad Grönenbach","-16 °C",null,5083,"Gartenau-Sankt Leonhard","-15 °C"]
[38667,"Bad Harzburg","-14 °C",null,6793,"Gaschurn","-17 °C"]
[83670,"Bad Heilbrunn","-18 °C",null,8616,"Gasen","-15 °C"]
[76332,"Bad Herrenalb","-14 °C",null,4673,"Gaspoltshofen","-15 °C"]
[36251,"Bad Hersfeld","-14 °C",null,3852,"Gastern","-16 °C"]
[37412,"Bad Herzberg","-16 °C",null,2474,"Gattendorf","-14 °C"]
["613xx","Bad Homburg","-14 °C",null,2191,"Gaweinstal","-14 °C"]
[53604,"Bad Honnef","-12 °C",null,4682,"Geboltskirchen","-15 °C"]
[53557,"Bad Hönningen","-12 °C",null,3494,"Gedersdorf","-13 °C"]
[49186,"Bad Iburg","-12 °C",null,4922,"Geiersberg","-15 °C"]
[34385,"Bad Karlshafen","-12 °C",null,4943,"Geinberg","-15 °C"]
[97688,"Bad Kissingen","-14 °C",null,8153,"Geistthal","-14 °C"]
[23996,"Bad Kleinen","-10 °C",null,2093,"Geras","-16 °C"]
[82433,"Bad Kohlgrub","-16 °C",null,2201,"Gerasdorf","-13 °C"]
["555xx","Bad Kreuznach","-12 °C",null,7542,"Gerersdorf bei Güssing","-14 °C"]
[79189,"Bad Krozingen","-14 °C",null,5132,"Geretsberg","-15 °C"]
[57334,"Bad Laasphe","-14 °C",null,6281,"Gerlos","-16 °C"]
[49196,"Bad Laer","-12 °C",null,3131,"Getzersdorf bei Traismauer","-13 °C"]
[76669,"Bad Langenbrück","-12 °C",null,3542,"Gföhl","-16 °C"]
[99947,"Bad Langensalza","-14 °C",null,2372,"Gießhübl","-14 °C"]
[4651,"Bad Lausick","-14 °C",null,5133,"Gilgenberg am Weilhart","-15 °C"]
[37431,"Bad Lauterberg","-16 °C",null,6295,"Ginzling","-15 °C"]
[4924,"Bad Liebenwerda","-16 °C",null,9555,"Glanegg","-16 °C"]
[75378,"Bad Liebenzell","-14 °C",null,5061,"Glasenbach","-15 °C"]
[33175,"Bad Lippspringe","-12 °C",null,3704,"Glaubendorf","-14 °C"]
[7356,"Bad Lobenstein","-18 °C",null,8443,"Gleinstätten","-14 °C"]
[97980,"Bad Mergentheim","-16 °C",null,8200,"Gleisdorf","-14 °C"]
[31848,"Bad Münder ","-14 °C",null,9142,"Globasnitz","-16 °C"]
[53902,"Bad Münstereifel","-14 °C",null,9346,"Glödnitz","-17 °C"]
[2953,"Bad Muskau","-16 °C",null,2640,"Gloggnitz","-14 °C"]
[61231,"Bad Nauheim","-14 °C",null,3950,"Gmünd","-17 °C"]
[31542,"Bad Nenndorf","-14 °C",null,9853,"Gmünd","-15 °C"]
[53474,"Bad Neuenahr-Ahrweiler","-14 °C",null,4810,"Gmunden","-14 °C"]
[72108,"Bad Niedernau","-16 °C",null,2152,"Gnadendorf","-14 °C"]
["325xx","Bad Oeynhausen","-12 °C",null,8342,"Gnas","-13 °C"]
[23843,"Bad Oldesloe","-12 °C",null,9563,"Gnesau","-16 °C"]
[77740,"Bad Peterstal","-16 °C",null,9585,"Gödersdorf","-16 °C"]
[31812,"Bad Pyrmont","-14 °C",null,6811,"Göfis","-14 °C"]
[74906,"Bad Rappenau","-12 °C",null,6353,"Going","-18 °C"]
[83435,"Bad Reichenhall","-16 °C",null,5622,"Goldegg","-17 °C"]
[76571,"Bad Rotenfels","-14 °C",null,2013,"Göllersdorf","-14 °C"]
[37441,"Bad Sachsa","-16 °C",null,5440,"Golling an der Salzach","-14 °C"]
[79713,"Bad Säckingen","-12 °C",null,8635,"Gollrad","-16 °C"]
[31162,"Bad Salzdetfurth","-14 °C",null,7122,"Gols","-13 °C"]
[36364,"Bad Salzschlirf","-14 °C",null,3800,"Göpfritz an der Wild","-17 °C"]
["3210x","Bad Salzuflen","-12 °C",null,9615,"Görtschach","-15 °C"]
[36433,"Bad Salzungen ","-16 °C",null,4824,"Gosau","-15 °C"]
[59505,"Bad Sassendorf","-12 °C",null,4825,"Gosauschmied","-14 °C"]
[88348,"Bad Saulgau","-14 °C",null,8482,"Gosdorf","-13 °C"]
[1814,"Bad Schandau","-14 °C",null,3482,"Gösing","-14 °C"]
[6905,"Bad Schmiedeberg","-14 °C",null,3221,"Gösing an der Mariazeller Bahn","-16 °C"]
[76669,"Bad Schönborn","-12 °C",null,8707,"Göß","-14 °C"]
[88427,"Bad Schussenried","-16 °C",null,3345,"Göstling an der Ybbs","-16 °C"]
[65307,"Bad Schwalbach","-14 °C",null,2464,"Göttlesbrunn","-14 °C"]
[23611,"Bad Schwartau","-10 °C",null,2245,"Götzendorf","-14 °C"]
[23795,"Bad Segeberg","-10 °C",null,2434,"Götzendorf an der Leitha","-14 °C"]
[55566,"Bad Sobernheim","-12 °C",null,6091,"Götzens","-15 °C"]
[65812,"Bad Soden am Taunus","-14 °C",null,6840,"Götzis","-13 °C"]
[63628,"Bad Soden Salmünster","-14 °C",null,8593,"Graden","-14 °C"]
[6507,"Bad Suderode","-14 °C",null,9362,"Grades","-15 °C"]
[75385,"Bad Teinach","-16 °C",null,8232,"Grafendorf bei Hartberg","-13 °C"]
[99955,"Bad Tennstedt","-14 °C",null,3912,"Grafenschlag","-18 °C"]
[83646,"Bad Tölz","-18 °C",null,9131,"Grafenstein","-16 °C"]
[72574,"Bad Urach","-16 °C",null,3484,"Grafenwörth","-13 °C"]
[61118,"Bad Vilbel","-12 °C",null,3524,"Grainbrunn","-18 °C"]
[88339,"Bad Waldsee","-16 °C",null,4201,"Gramastetten","-14 °C"]
[59597,"Bad Westernkotten","-12 °C",null,2440,"Gramatneusiedl","-13 °C"]
[83707,"Bad Wiessee","-18 °C",null,8101,"Gratkorn","-13 °C"]
[75323,"Bad Wildbad","-16 °C",null,8112,"Gratwein","-13 °C"]
[19336,"Bad Wilsnack","-14 °C",null,8010,"Graz","-12 °C"]
[74206,"Bad Wimpfen","-12 °C",null,8045,"Graz-Andritz","-12 °C"]
[91438,"Bad Windsheim","-16 °C",null,8041,"Graz-Liebenau","-13 °C"]
[86825,"Bad Wörishofen","-16 °C",null,8044,"Graz-Maria Trost","-12 °C"]
[33181,"Bad Wünnenberg","-14 °C",null,8055,"Graz-Puntigam","-14 °C"]
[88410,"Bad Wurzach","-16 °C",null,8036,"Graz-Sankt Leonhard","-12 °C"]
[26160,"Bad Zwischenahn","-12 °C",null,8054,"Graz-Straßgang","-14 °C"]
[49635,"Badbergen","-12 °C",null,8012,"Graz-Wagram","-14 °C"]
[38271,"Baddeckenstedt","-14 °C",null,8052,"Graz-Wetzelsdorf","-13 °C"]
[6493,"Badeborn","-14 °C",null,9761,"Greifenburg","-15 °C"]
[79227,"Baden","-14 °C",null,3422,"Greifenstein","-13 °C"]
["765xx","Baden-Baden","-12 °C",null,4360,"Grein","-13 °C"]
[79410,"Badenweiler","-14 °C",null,3264,"Gresten","-15 °C"]
[4720,"Baderitz","-14 °C",null,6156,"Gries am Brenner","-15 °C"]
[4769,"Baderitz","-14 °C",null,5662,"Gries im Pinzgau","-17 °C"]
[52499,"Baesweiler","-12 °C",null,6182,"Gries im Sellrain","-17 °C"]
[3130,"Bagenz","-16 °C",null,4710,"Grieskirchen","-15 °C"]
[79353,"Bahlingen","-12 °C",null,9112,"Griffen","-16 °C"]
[4895,"Bahnsdorf","-16 °C",null,2840,"Grimmenstein","-14 °C"]
[27245,"Bahrenborstel","-12 °C",null,6591,"Grins","-15 °C"]
[88255,"Baienfurt","-14 °C",null,8962,"Gröbming","-15 °C"]
[72270,"Baiersbronn","-16 °C",null,5082,"Grödig","-15 °C"]
[91083,"Baiersdorf","-16 °C",null,8522,"Groß Sankt Florian","-13 °C"]
[88255,"Baindt - Schachen","-14 °C",null,3384,"Groß Sierning","-14 °C"]
[72108,"Baisingen","-16 °C",null,5611,"Großarl","-16 °C"]
[87650,"Baisweil","-16 °C",null,3824,"Großau","-16 °C"]
[14806,"Baitz","-14 °C",null,2203,"Großebersdorf","-14 °C"]
[73441,"Baldern","-16 °C",null,2212,"Groß-Engersdorf","-14 °C"]
[85598,"Baldham","-16 °C",null,2301,"Groß-Enzersdorf","-14 °C"]
[76532,"Balg","-14 °C",null,3920,"Groß-Gerungs","-18 °C"]
[31609,"Balge","-12 °C",null,5084,"Großgmain","-15 °C"]
[78582,"Balgheim","-18 °C",null,3913,"Großgöttfritz","-18 °C"]
[86753,"Balgheim","-16 °C",null,2034,"Großharras","-14 °C"]
[34308,"Balhorn","-14 °C",null,3611,"Großheinrichschlag","-17 °C"]
[72336,"Balingen","-18 °C",null,7051,"Großhöflein","-12 °C"]
[89177,"Ballendorf","-16 °C",null,8452,"Großklein","-14 °C"]
[6493,"Ballenstedt","-14 °C",null,2143,"Großkrut","-14 °C"]
[89561,"Ballmertshofen","-16 °C",null,8734,"Großlobming","-16 °C"]
[79282,"Ballrechten-Dottingen","-14 °C",null,3711,"Großmeiseldorf","-14 °C"]
[99869,"Ballstädt","-14 °C",null,2002,"Großmugl","-14 °C"]
[73666,"Baltmannsweiler","-14 °C",null,3972,"Großpertholz","-18 °C"]
[88487,"Baltringen","-16 °C",null,8211,"Großpesendorf","-14 °C"]
["960xx","Bamberg","-16 °C",null,7503,"Großpetersdorf","-13 °C"]
[79415,"Bamlach","-12 °C",null,4463,"Großraming","-15 °C"]
[69245,"Bammental","-12 °C",null,8931,"Großreifling","-14 °C"]
[17506,"Bandelin","-12 °C",null,3471,"Großriedenthal","-14 °C"]
[17449,"Bannemin","-12 °C",null,2114,"Großrußbach","-14 °C"]
[1728,"Bannewitz","-14 °C",null,3922,"Großschönau","-18 °C"]
[17429,"Bansin","-12 °C",null,2221,"Großschweinbarth","-14 °C"]
[31029,"Banteln","-14 °C",null,3812,"Groß-Siegharts","-16 °C"]
[16868,"Bantikow","-14 °C",null,8265,"Großsteinbach","-13 °C"]
[19246,"Bantin","-12 °C",null,8664,"Großveitsch","-15 °C"]
[30890,"Bantorf","-14 °C",null,7304,"Großwarasdorf","-13 °C"]
[19079,"Banzkow","-12 °C",null,3701,"Großweikersdorf","-14 °C"]
[93092,"Barbing","-16 °C",null,8263,"Großwilfersdorf","-13 °C"]
[39249,"Barby","-14 °C",null,4645,"Grünau im Almtal","-15 °C"]
[27809,"Bardewisch","-12 °C",null,4264,"Grünbach","-16 °C"]
[21357,"Bardowick","-12 °C",null,2733,"Grünbach am Schneeberg","-15 °C"]
[27245,"Barenburg","-12 °C",null,4594,"Grünburg","-14 °C"]
[1768,"Bärenstein/Erzgebirge","-16 °C",null,8993,"Grundlsee","-15 °C"]
[8147,"Bärenwalde","-16 °C",null,4816,"Gschwandt","-15 °C"]
[73529,"Bargau","-16 °C",null,8913,"Gstatterboden","-15 °C"]
[74921,"Bargen","-12 °C",null,9722,"Gummern","-16 °C"]
[18211,"Bargeshagen","-10 °C",null,2352,"Gumpoldskirchen","-13 °C"]
[22941,"Bargteheide","-12 °C",null,9634,"Gundersheim","-15 °C"]
[39179,"Barleben","-14 °C",null,2525,"Günselsdorf","-13 °C"]
[46399,"Barlo","-10 °C",null,4623,"Gunskirchen","-14 °C"]
[23968,"Barnekow","-10 °C",null,2042,"Guntersdorf","-14 °C"]
[19089,"Barnin","-12 °C",null,2353,"Guntramsdorf","-13 °C"]
[6268,"Barnstädt","-14 °C",null,9342,"Gurk","-16 °C"]
[38446,"Barnstorf","-14 °C",null,4942,"Gurten","-15 °C"]
[49406,"Barnstorf","-12 °C",null,7540,"Güssing","-14 °C"]
[31171,"Barnten","-14 °C",null,8632,"Gußwerk","-15 °C"]
[32683,"Barntrup","-14 °C",null,4293,"Gutau","-15 °C"]
[41515,"Barrenstein","-10 °C",null,3665,"Gutenbrunn","-17 °C"]
[30890,"Barrigsen","-14 °C",null,2770,"Gutenstein","-15 °C"]
[30890,"Barsinghausen","-14 °C",null,9334,"Guttaring","-15 °C"]
[21354,"Barskamp","-12 °C",null,3350,"Haag","-14 °C"]
[71560,"Bartenbach","-14 °C",null,4680,"Haag am Hausruck","-15 °C"]
[73035,"Bartenbach","-16 °C",null,3493,"Hadersdorf am Kamp","-13 °C"]
[18356,"Barth","-10 °C",null,2061,"Hadres","-14 °C"]
[73566,"Bartholomä","-16 °C",null,4232,"Hagenberg im Mühlkreis","-14 °C"]
[18516,"Bartmannshagen","-12 °C",null,4785,"Haibach bei Schärding","-15 °C"]
[54578,"Basberg","-14 °C",null,4083,"Haibach ob der Donau","-16 °C"]
[56220,"Bassenheim","-14 °C",null,4053,"Haid","-14 °C"]
[27211,"Bassum","-12 °C",null,4431,"Haidershofen","-14 °C"]
[97654,"Bastheim","-16 °C",null,9111,"Haimburg","-16 °C"]
[35088,"Battenberg","-14 °C",null,6425,"Haiming","-16 °C"]
[86368,"Batzenhofen","-16 °C",null,2410,"Hainburg an der Donau","-14 °C"]
[1561,"Bauda","-16 °C",null,8264,"Hainersdorf","-13 °C"]
[75015,"Bauerbach ( Bretten )","-12 °C",null,3170,"Hainfeld","-14 °C"]
[86663,"Bäumenheim","-16 °C",null,3485,"Haitzendorf","-13 °C"]
[75245,"Bauschlott","-14 °C",null,8492,"Halbenrain","-13 °C"]
[58730,"Bausenhagen","-12 °C",null,7131,"Halbturn","-14 °C"]
[54636,"Baustert","-14 °C",null,6060,"Hall in Tirol","-14 °C"]
[88471,"Baustetten","-16 °C",null,5400,"Hallein","-15 °C"]
[2625,"Bautzen","-16 °C",null,4830,"Hallstatt","-11 °C"]
[84092,"Bayerbach","-18 °C",null,5144,"Handenberg","-15 °C"]
[86641,"Bayerdilling","-16 °C",null,7473,"Hannersdorf","-13 °C"]
["954xx","Bayreuth","-16 °C",null,6971,"Hard","-12 °C"]
[99976,"Beberstedt","-16 °C",null,2082,"Hardegg","-15 °C"]
[39343,"Bebertal","-14 °C",null,4483,"Hargelsberg","-14 °C"]
[36179,"Bebra-Solz","-14 °C",null,2286,"Haringsee","-14 °C"]
[51515,"Bechen","-12 °C",null,3104,"Harland","-14 °C"]
[55608,"Becherbach","-12 °C",null,2111,"Harmannsdorf","-13 °C"]
[91572,"Bechhofen","-16 °C",null,3713,"Harmannsdorf","-15 °C"]
[88499,"Bechingen","-14 °C",null,8230,"Hartberg","-12 °C"]
[88453,"Bechtenrot","-16 °C",null,4081,"Hartkirchen","-15 °C"]
[72379,"Bechtholdsweiler","-16 °C",null,6651,"Häselgehr","-17 °C"]
[72379,"Bechtoldsweiler","-16 °C",null,4170,"Haslach an der Mühl","-14 °C"]
[38527,"Bechtsbüttel","-14 °C",null,8361,"Hatzendorf","-13 °C"]
[21643,"Beckdorf","-12 °C",null,2054,"Haugsdorf","-14 °C"]
[23968,"Beckerwitz","-10 °C",null,8967,"Haus","-15 °C"]
[66701,"Beckingen","-12 °C",null,2145,"Hausbrunn","-14 °C"]
[59269,"Beckum / Westf.","-12 °C",null,2184,"Hauskirchen","-14 °C"]
[4889,"Beckwitz","-16 °C",null,3464,"Hausleiten","-13 °C"]
[50181,"Bedburg","-12 °C",null,8071,"Hausmannstätten","-14 °C"]
[47551,"Bedburg-Hau","-10 °C",null,3363,"Hausmening","-13 °C"]
[9306,"Beedeln","-14 °C",null,3860,"Heidenreichstein","-17 °C"]
[48361,"Beelen","-12 °C",null,8172,"Heilbrunn","-16 °C"]
[36251,"Beenhausen","-14 °C",null,9844,"Heiligenblut","-14 °C"]
[17291,"Beenz","-14 °C",null,2532,"Heiligenkreuz","-14 °C"]
[64743,"Beerfelden / Odenw.","-14 °C",null,8081,"Heiligenkreuz am Waasen","-13 °C"]
[6198,"Beesendorf","-14 °C",null,7561,"Heiligenkreuz im Lafnitztal","-14 °C"]
[49832,"Beesten","-12 °C",null,8451,"Heimschuh","-14 °C"]
[52499,"Beggendorf","-12 °C",null,3962,"Heinrichs bei Weitra","-17 °C"]
[39356,"Behnsdorf","-14 °C",null,4184,"Helfenberg","-14 °C"]
[17498,"Behrenhoff","-12 °C",null,4202,"Hellmonsödt","-16 °C"]
[37130,"Beienrode","-16 °C",null,8411,"Hengsberg","-14 °C"]
[1561,"Beiersdorf","-16 °C",null,5302,"Henndorf am Wallersee","-16 °C"]
[4924,"Beiersdorf","-16 °C",null,2332,"Hennersdorf bei Wien","-13 °C"]
[96450,"Beiersdorf","-16 °C",null,9620,"Hermagor","-15 °C"]
[72221,"Beihingen","-16 °C",null,2171,"Herrnbaumgarten","-15 °C"]
[92339,"Beilngries","-16 °C",null,3130,"Herzogenburg","-13 °C"]
[4886,"Beilrode","-16 °C",null,4175,"Herzogsdorf","-15 °C"]
[35753,"Beilstein","-14 °C",null,8920,"Hieflau","-15 °C"]
[71717,"Beilstein","-14 °C",null,2325,"Himberg","-13 °C"]
[89179,"Beimerstetten","-16 °C",null,9562,"Himmelberg","-16 °C"]
[75378,"Beinberg","-16 °C",null,2371,"Hinterbrühl","-13 °C"]
[89143,"Beiningen","-16 °C",null,5754,"Hinterglemm","-18 °C"]
[71334,"Beinstein","-14 °C",null,3413,"Hintersdorf","-14 °C"]
[54340,"Bekond","-12 °C",null,4573,"Hinterstoder","-15 °C"]
[53539,"Belcherath","-14 °C",null,6294,"Hintertux","-17 °C"]
[4874,"Belgern","-16 °C",null,6283,"Hippach","-14 °C"]
[88416,"Bellamont","-16 °C",null,7024,"Hirm","-13 °C"]
[89287,"Bellenberg","-16 °C",null,8221,"Hirnsdorf","-13 °C"]
[33034,"Beller","-14 °C",null,3942,"Hirschbach","-17 °C"]
[33034,"Bellersen","-14 °C",null,4242,"Hirschbach im Mühlkreis","-15 °C"]
[72379,"Belsen","-16 °C",null,6992,"Hirschegg","-18 °C"]
[56290,"Beltheim","-14 °C",null,8584,"Hirschegg Rein","-14 °C"]
[14806,"Belzig","-14 °C",null,2552,"Hirtenberg","-14 °C"]
[72658,"Bempflingen","-16 °C",null,6952,"Hittisau","-17 °C"]
[83671,"Benediktbeuren","-18 °C",null,8151,"Hitzendorf","-13 °C"]
[18258,"Benitz","-12 °C",null,6395,"Hochfilzen","-18 °C"]
[6308,"Benndorf","-14 °C",null,2852,"Hochneukirchen","-14 °C"]
[4828,"Bennewitz","-14 °C",null,6973,"Höchst","-12 °C"]
[71726,"Benningen","-12 °C",null,2802,"Hochwolkersdorf","-15 °C"]
[51429,"Bensberg","-12 °C",null,2451,"Hof am Leithaberge","-13 °C"]
[64625,"Bensheim (Bensh.-Auerbach)","-10 °C",null,5322,"Hof bei Salzburg","-16 °C"]
[31020,"Benstorf","-14 °C",null,4716,"Hofkirchen an der Trattnach","-15 °C"]
[37547,"Bentierode","-16 °C",null,4142,"Hofkirchen im Mühlkreis","-16 °C"]
[18182,"Bentwisch","-10 °C",null,4492,"Hofkirchen im Traunkreis","-14 °C"]
[79777,"Berau","-14 °C",null,2465,"Höflein","-14 °C"]
[92334,"Berching","-16 °C",null,3421,"Höflein an der Donau","-13 °C"]
[83471,"Berchtesgaden","-16 °C",null,3202,"Hofstetten","-14 °C"]
[24881,"Berend","-10 °C",null,2724,"Hohe Wand-Stollhof","-14 °C"]
[52385,"Berg","-14 °C",null,2273,"Hohenau an der March","-14 °C"]
[53505,"Berg","-14 °C",null,3192,"Hohenberg","-15 °C"]
[82386,"Berg","-16 °C",null,3945,"Hoheneich","-17 °C"]
[88276,"Berg","-14 °C",null,6845,"Hohenems","-13 °C"]
[92348,"Berg","-16 °C",null,2223,"Hohenruppersdorf","-14 °C"]
[82335,"Berg - Bachhausen","-16 °C",null,3472,"Hohenwarth","-14 °C"]
[83546,"Berg bei Au","-16 °C",null,6914,"Hohenweiler","-12 °C"]
[56357,"Berg/Taunus","-12 °C",null,4921,"Hohenzell","-15 °C"]
[6536,"Berga","-14 °C",null,5251,"Höhnhart","-16 °C"]
[7980,"Berga","-14 °C",null,2020,"Hollabrunn","-13 °C"]
[88368,"Bergatreute","-16 °C",null,3132,"Hollenburg","-13 °C"]
[49626,"Berge","-12 °C",null,3343,"Hollenstein an der Ybbs","-15 °C"]
[2979,"Bergen","-16 °C",null,2812,"Hollenthon","-14 °C"]
[83346,"Bergen","-18 °C",null,5731,"Hollersbach im Pinzgau","-18 °C"]
[18528,"Bergen / Rügen","-10 °C",null,6654,"Holzgau","-17 °C"]
[60388,"Bergen-Enkheim","-12 °C",null,6361,"Hopfgarten im Brixental","-17 °C"]
[72172,"Bergfelden","-16 °C",null,9961,"Hopfgarten in Defereggen","-16 °C"]
[77791,"Berghaupten","-12 °C",null,6912,"Hörbranz","-12 °C"]
["5164x","Berghausen","-12 °C",null,7312,"Horitschon","-13 °C"]
[32839,"Bergheim","-14 °C",null,3580,"Horn","-15 °C"]
["501xx","Bergheim","-12 °C",null,7053,"Hornstein","-13 °C"]
[97493,"Bergheinfeld","-14 °C",null,4063,"Hörsching","-14 °C"]
[16306,"Bergholz","-16 °C",null,3753,"Hötzelsdorf","-16 °C"]
[14558,"Bergholz - Rehbrücke","-14 °C",null,9953,"Huben","-16 °C"]
[89180,"Berghülen","-16 °C",null,3383,"Hürm","-14 °C"]
["514xx","Bergisch-Gladbach","-12 °C",null,5511,"Hüttau","-17 °C"]
[51381,"Bergisch-Neukirchen","-10 °C",null,9375,"Hüttenberg","-14 °C"]
[59192,"Bergkamen","-12 °C",null,5612,"Hüttschlag","-16 °C"]
[85232,"Bergkirchen","-16 °C",null,3544,"Idolsberg","-16 °C"]
[73663,"Berglen","-14 °C",null,6080,"Igls","-15 °C"]
[85459,"Berglern","-16 °C",null,7142,"Illmitz","-14 °C"]
[54426,"Berglicht","-14 °C",null,8262,"Ilz","-13 °C"]
[97241,"Bergtheim","-14 °C",null,2022,"Immendorf","-14 °C"]
[39307,"Bergzow","-14 °C",null,6460,"Imst","-16 °C"]
[39624,"Berkau","-14 °C",null,3052,"Innermanzing","-14 °C"]
[73734,"Berkheim","-14 °C",null,9932,"Innervillgraten","-17 °C"]
[88450,"Berkheim","-16 °C",null,6020,"Innsbruck","-14 °C"]
["1xxxx","Berlin","-14 °C",null,6080,"Innsbruck-Igls","-15 °C"]
["1xxxx","Berlin","-14 °C",null,6025,"Innsbruck-Mühlau","-14 °C"]
[99439,"Berlstedt","-14 °C",null,6040,"Innsbruck-Neuarzl","-14 °C"]
[89134,"Bermaringen","-16 °C",null,6401,"Inzing","-15 °C"]
[88697,"Bermatingen","-14 °C",null,8952,"Irdning","-15 °C"]
[77723,"Bermersbach","-12 °C",null,3754,"Irnfritz","-17 °C"]
[79872,"Bernau","-18 °C",null,9773,"Irschen","-15 °C"]
[83233,"Bernau a. Chiemsee","-16 °C",null,3923,"Jagenbach","-17 °C"]
[16321,"Bernau b. Berlin","-14 °C",null,8091,"Jagerberg","-13 °C"]
[76332,"Bernbach","-12 °C",null,3763,"Japons","-16 °C"]
[6406,"Bernburg / Saale","-14 °C",null,2264,"Jedenspeigen","-14 °C"]
[27804,"Berne","-10 °C",null,6200,"Jenbach","-15 °C"]
[72213,"Berneck","-16 °C",null,8380,"Jennersdorf","-13 °C"]
[73312,"Berneck","-16 °C",null,2053,"Jetzelsdorf","-14 °C"]
[92361,"Berngau","-16 °C",null,6373,"Jochberg","-18 °C"]
[54470,"Bernkastel-Kues","-10 °C",null,8912,"Johnsbach","-16 °C"]
[16515,"Bernöwe","-14 °C",null,7093,"Jois","-13 °C"]
[82347,"Bernried","-16 °C",null,3441,"Judenau","-13 °C"]
[92444,"Bernried","-18 °C",null,8750,"Judenburg","-15 °C"]
[94505,"Bernried","-18 °C",null,8111,"Judendorf","-12 °C"]
[8315,"Bernsbach","-16 °C",null,4162,"Julbach","-15 °C"]
[2994,"Bernsdorf","-16 °C",null,8573,"Kainach bei Voitsberg","-14 °C"]
[7952,"Bernsgrün","-16 °C",null,8224,"Kaindorf","-13 °C"]
[89182,"Bernstadt","-16 °C",null,8984,"Kainisch","-15 °C"]
[2748,"Bernstadt auf dem Eigen","-16 °C",null,7342,"Kaisersdorf","-13 °C"]
[74744,"Berolzheim","-16 °C",null,9981,"Kals am Großglockner","-16 °C"]
[49593,"Bersenbrück","-12 °C",null,8401,"Kalsdorf bei Graz","-15 °C"]
[61200,"Berstadt","-12 °C",null,6272,"Kaltenbach","-15 °C"]
[2747,"Berthelsdorf","-16 °C",null,2391,"Kaltenleutgeben","-14 °C"]
[9600,"Berthelsdorf","-16 °C",null,8775,"Kalwang","-16 °C"]
[66802,"Berus , Überherrn","-12 °C",null,8773,"Kammern im Liesingtal","-15 °C"]
[65614,"Beselich","-14 °C",null,2033,"Kammersdorf","-14 °C"]
[74354,"Besigheim","-12 °C",null,8691,"Kapellen","-16 °C"]
[54309,"Beßlich","-14 °C",null,3141,"Kapelln","-14 °C"]
[31032,"Betheln","-14 °C",null,8605,"Kapfenberg","-14 °C"]
[72160,"Betra","-16 °C",null,8353,"Kapfenstein","-13 °C"]
[56355,"Bettendorf","-14 °C",null,9321,"Kappel am Krappfeld","-16 °C"]
[41470,"Bettikum","-10 °C",null,6555,"Kappl","-18 °C"]
[87764,"Bettrichs","-16 °C",null,5710,"Kaprun","-18 °C"]
[57518,"Betzdorf","-12 °C",null,3822,"Karlstein","-16 °C"]
[88422,"Betzenweiler","-14 °C",null,3121,"Karlstetten","-14 °C"]
[72291,"Betzweiler","-16 °C",null,3973,"Karlstift","-18 °C"]
[4824,"Beucha","-14 °C",null,2113,"Karnabrunn","-14 °C"]
[4519,"Beuden","-14 °C",null,9941,"Kartitsch","-17 °C"]
[82547,"Beuerberg","-18 °C",null,3072,"Kasten bei Böheimkirchen","-14 °C"]
[72226,"Beuren","-16 °C",null,8842,"Katsch an der Mur","-15 °C"]
[72660,"Beuren","-16 °C",null,4223,"Katsdorf","-13 °C"]
[88316,"Beuren","-16 °C",null,2801,"Katzelsdorf (im Steinfeld)","-13 °C"]
[71384,"Beutelsbach","-14 °C",null,2572,"Kaumberg","-15 °C"]
[94501,"Beutelsbach","-16 °C",null,2134,"Kautendorf","-15 °C"]
[4924,"Beutersitz","-16 °C",null,3851,"Kautzen","-16 °C"]
[9366,"Beutha","-16 °C",null,4292,"Kefermarkt","-15 °C"]
[37639,"Bevern","-12 °C",null,3331,"Kematen","-13 °C"]
[37688,"Beverungen","-12 °C",null,4633,"Kematen am Innbach","-15 °C"]
[66450,"Bexbach","-12 °C",null,4531,"Kematen an der Krems","-14 °C"]
[6528,"Beyernaumburg","-14 °C",null,6175,"Kematen in Tirol","-15 °C"]
[83104,"Beyharting","-16 °C",null,7531,"Kemeten","-12 °C"]
[77781,"Biberach","-14 °C",null,3373,"Kemmelbach","-13 °C"]
[88400,"Biberach/Riß","-16 °C",null,6921,"Kennelbach","-12 °C"]
[86485,"Biberbach","-16 °C",null,3195,"Kernhof","-15 °C"]
[68647,"Biblis","-12 °C",null,2192,"Kettlasbrunn","-14 °C"]
[93354,"Biburg","-18 °C",null,9074,"Keutschach","-15 °C"]
[83673,"Bichl","-18 °C",null,3291,"Kienberg","-16 °C"]
[72348,"Bickelsberg","-16 °C",null,3233,"Kilb","-14 °C"]
[87651,"Bidingen","-16 °C",null,8650,"Kindberg","-15 °C"]
[97243,"Bieberehren","-16 °C",null,8652,"Kindberg-Aumühl","-14 °C"]
[56370,"Biebrich","-14 °C",null,9632,"Kirchbach","-15 °C"]
[56370,"Biebrich","-14 °C",null,8082,"Kirchbach in Steiermark","-13 °C"]
[35216,"Biedenkopf","-12 °C",null,3470,"Kirchberg am Wagram","-13 °C"]
[79215,"Biederbach","-14 °C",null,3932,"Kirchberg am Walde","-17 °C"]
[39175,"Biederitz","-14 °C",null,2880,"Kirchberg am Wechsel Markt","-15 °C"]
[2923,"Biehain","-16 °C",null,3204,"Kirchberg an der Pielach","-14 °C"]
[1920,"Biehla","-16 °C",null,8324,"Kirchberg an der Raab","-13 °C"]
[1824,"Bielatal","-16 °C",null,3811,"Kirchberg an der Wild","-17 °C"]
["33xxx","Bielefeld","-12 °C",null,5232,"Kirchberg bei Mattighofen","-16 °C"]
[49808,"Biene","-10 °C",null,6365,"Kirchberg in Tirol","-18 °C"]
[79189,"Biengen","-14 °C",null,6322,"Kirchbichl","-16 °C"]
[38110,"Bienrode","-14 °C",null,4560,"Kirchdorf an der Krems","-14 °C"]
[99100,"Bienstädt","-14 °C",null,6382,"Kirchdorf in Tirol","-16 °C"]
[72108,"Bieringen","-16 °C",null,4656,"Kirchham","-15 °C"]
[74214,"Bieringen","-14 °C",null,4932,"Kirchheim im Innkreis","-15 °C"]
[72181,"Bierlingen","-16 °C",null,2860,"Kirchschlag in der Buckligen Welt","-13 °C"]
[88348,"Bierstetten","-16 °C",null,3062,"Kirchstetten","-14 °C"]
[75328,"Bieselsberg","-16 °C",null,3241,"Kirnberg an der Mank","-14 °C"]
[16359,"Biesenthal","-14 °C",null,2421,"Kittsee","-14 °C"]
[87640,"Biessenhofen","-16 °C",null,6370,"Kitzbühel","-18 °C"]
[72414,"Bietenhausen","-16 °C",null,8442,"Kitzeck im Sausal","-14 °C"]
[76467,"Bietigheim","-12 °C",null,4163,"Klaffer","-15 °C"]
[74321,"Bietigheim - Bissingen","-12 °C",null,9020,"Klagenfurt","-16 °C"]
[17291,"Bietikow","-14 °C",null,9027,"Klagenfurt-Annabichl","-16 °C"]
[78224,"Bietingen","-12 °C",null,9073,"Klagenfurt-Viktring","-16 °C"]
[87544,"Bihlerdorf","-18 °C",null,9061,"Klagenfurt-Wölfnitz","-16 °C"]
[72160,"Bildechingen","-16 °C",null,4352,"Klam","-14 °C"]
[75236,"Bilfingen","-14 °C",null,6833,"Klaus","-13 °C"]
[18184,"Billenhagen","-12 °C",null,4564,"Klaus an der Pyhrnbahn","-14 °C"]
[48727,"Billerbeck","-10 °C",null,2533,"Klausen-Leopoldsdorf","-14 °C"]
[74842,"Billigheim","-12 °C",null,9752,"Kleblach","-15 °C"]
[31319,"Bilm","-14 °C",null,9373,"Klein Sankt Paul","-16 °C"]
[37434,"Bilshausen","-16 °C",null,9345,"Kleinglödnitz","-17 °C"]
[99092,"Bindersleben","-14 °C",null,2431,"Kleinneusiedl","-13 °C"]
[39590,"Bindfelde","-14 °C",null,3660,"Kleinpöchlarn","-14 °C"]
[95463,"Bindlach","-16 °C",null,4442,"Kleinraming","-14 °C"]
[72511,"Bingen","-14 °C",null,4464,"Kleinreifling","-14 °C"]
[55411,"Bingen/Rhein","-12 °C",null,3171,"Kleinzell","-14 °C"]
[56754,"Binningen","-14 °C",null,4115,"Kleinzell im Mühlkreis","-15 °C"]
[78247,"Binningen","-12 °C",null,7013,"Klingenbach","-13 °C"]
[72351,"Binsdorf","-16 °C",null,8493,"Klöch","-13 °C"]
[54587,"Birgel","-14 °C",null,6754,"Klösterle","-17 °C"]
[41849,"Birgelen","-10 °C",null,3400,"Klosterneuburg","-13 °C"]
[92262,"Birgland","-16 °C",null,9376,"Knappenberg","-15 °C"]
[69488,"Birkenau","-12 °C",null,8720,"Knittelfeld","-16 °C"]
[69498,"Birkenau - Hornbach","-12 °C",null,7332,"Kobersdorf","-13 °C"]
[79777,"Birkendorf","-14 °C",null,6842,"Koblach","-13 °C"]
[75217,"Birkenfeld","-14 °C",null,8580,"Köflach","-14 °C"]
[97834,"Birkenfeld","-14 °C",null,8581,"Köflach-Pichling","-14 °C"]
[55765,"Birkenfeld / Nahe","-14 °C",null,8191,"Koglhof","-15 °C"]
[16928,"Birkenfelde","-14 °C",null,7512,"Kohfidisch","-13 °C"]
[15913,"Birkenhainchen","-16 °C",null,9815,"Kolbnitz an der Tauernbahn","-15 °C"]
[88447,"Birkenhard","-16 °C",null,4154,"Kollerschlag","-15 °C"]
[16547,"Birkenwerder","-14 °C",null,6114,"Kolsass","-15 °C"]
[16515,"Birkhorst","-14 °C",null,3465,"Königsbrunn am Wagram","-13 °C"]
[92262,"Birkland","-16 °C",null,7563,"Königsdorf","-14 °C"]
[79774,"Birndorf","-12 °C",null,3433,"Königstetten","-13 °C"]
[2708,"Bischdorf","-16 °C",null,4280,"Königswiesen","-16 °C"]
[3205,"Bischdorf","-16 °C",null,4794,"Kopfing im Innkreis","-16 °C"]
[37284,"Bischhausen Kr. Eschwege","-14 °C",null,2100,"Korneuburg","-13 °C"]
[37130,"Bischhausen Kr. Göttingen","-16 °C",null,6345,"Kössen","-16 °C"]
[1920,"Bischheim","-16 °C",null,9231,"Köstenberg","-15 °C"]
[99094,"Bischleben","-14 °C",null,5203,"Köstendorf","-16 °C"]
[35649,"Bischoffen","-14 °C",null,9640,"Kötschach","-15 °C"]
[37345,"Bischofferode","-16 °C",null,3623,"Kottes","-17 °C"]
[79235,"Bischoffingen","-12 °C",null,2542,"Kottingbrunn","-13 °C"]
[97653,"Bischofsheim","-16 °C",null,9071,"Köttmannsdorf","-16 °C"]
[94253,"Bischofsmais","-18 °C",null,9311,"Kraig","-16 °C"]
[1877,"Bischofswerda","-16 °C",null,8854,"Krakaudorf","-17 °C"]
[16559,"Bischofswerder","-14 °C",null,6233,"Kramsach","-15 °C"]
[83483,"Bischofswiesen","-18 °C",null,8714,"Kraubath an der Mur","-14 °C"]
[72406,"Bisingen","-18 °C",null,3500,"Krems an der Donau","-12 °C"]
[39629,"Bismark","-14 °C",null,9862,"Kremsbrücke","-17 °C"]
[29646,"Bispingen","-14 °C",null,4550,"Kremsmünster","-14 °C"]
[30900,"Bissendorf","-14 °C",null,4631,"Krenglbach","-15 °C"]
[86657,"Bissingen","-16 °C",null,7031,"Krensdorf","-13 °C"]
[74321,"Bissingen (Bietigheim)","-12 °C",null,9531,"Kreuth bei Bleiberg","-17 °C"]
[73266,"Bissingen an der Teck","-16 °C",null,4362,"Kreuzen","-14 °C"]
[54634,"Bitburg","-14 °C",null,8670,"Krieglach","-15 °C"]
[54634,"Bitburg","-14 °C",null,5743,"Krimml","-16 °C"]
[72160,"Bittelbronn","-16 °C",null,3420,"Kritzendorf","-13 °C"]
[72401,"Bittelbronn","-16 °C",null,4484,"Kronstorf","-14 °C"]
[72505,"Bittelschieß","-14 °C",null,8564,"Krottendorf bei Ligist","-14 °C"]
[71336,"Bittenfeld","-12 °C",null,3543,"Krumau am Kamp","-15 °C"]
[6749,"Bitterfeld","-14 °C",null,2851,"Krumbach","-14 °C"]
[72475,"Bitz","-18 °C",null,6942,"Krumbach","-16 °C"]
[57539,"Bitzen","-12 °C",null,3375,"Krummnußbaum","-14 °C"]
[88094,"Bitzenhofen","-14 °C",null,9201,"Krumpendorf","-16 °C"]
[74626,"Bitzfeld","-14 °C",null,2671,"Küb","-14 °C"]
[93476,"Blaibach","-18 °C",null,5431,"Kuchl","-14 °C"]
[38889,"Blankenburg/Harz","-14 °C",null,6330,"Kufstein","-16 °C"]
[15827,"Blankenfelde","-14 °C",null,9125,"Kühnsdorf","-16 °C"]
[99444,"Blankenhain","-14 °C",null,7543,"Kukmirn","-14 °C"]
[53945,"Blankenheim","-14 °C",null,8062,"Kumberg","-13 °C"]
[53945,"Blankenheimerdorf","-14 °C",null,6250,"Kundl","-16 °C"]
[56865,"Blankenrath","-14 °C",null,2136,"Laa an der Thaya","-14 °C"]
[45527,"Blankenstein","-12 °C",null,2381,"Laab im Walde","-14 °C"]
[79588,"Blansingen","-12 °C",null,3053,"Laaben","-14 °C"]
[79859,"Blasiwald","-16 °C",null,4663,"Laakirchen","-14 °C"]
[89143,"Blaubeuren","-16 °C",null,7322,"Lackenbach","-13 °C"]
[74572,"Blaufelden","-16 °C",null,7321,"Lackendorf","-13 °C"]
[89134,"Blaustein","-14 °C",null,3295,"Lackenhof","-18 °C"]
[79261,"Bleibach","-16 °C",null,2126,"Ladendorf","-14 °C"]
[53894,"Bleibuir","-14 °C",null,8233,"Lafnitz","-13 °C"]
[99752,"Bleicherode","-14 °C",null,3663,"Laimbach am Ostrong","-16 °C"]
[72813,"Bleichstetten","-18 °C",null,8921,"Lainbach","-14 °C"]
[65232,"Bleidenstadt","-14 °C",null,4650,"Lambach","-15 °C"]
[24327,"Blekendorf","-10 °C",null,4772,"Lambrechten","-15 °C"]
[27337,"Blender","-12 °C",null,5112,"Lamprechtshausen Kirchendorf","-15 °C"]
[35796,"Blessenbach","-14 °C",null,6500,"Landeck","-14 °C"]
[21640,"Bliedersdorf","-12 °C",null,9523,"Landskron","-16 °C"]
[66440,"Blieskastel","-12 °C",null,6293,"Lanersbach","-16 °C"]
[89434,"Blindheim","-16 °C",null,2091,"Langau","-16 °C"]
[88273,"Blitzenreute","-14 °C",null,3294,"Langau bei Gaming","-17 °C"]
[88512,"Blochingen","-14 °C",null,3872,"Langegg","-17 °C"]
[1561,"Blochwitz","-16 °C",null,6932,"Langen","-14 °C"]
[32825,"Blomberg","-14 °C",null,6761,"Langen am Arlberg","-16 °C"]
[4886,"Blumberg","-16 °C",null,6941,"Langenegg","-15 °C"]
[78176,"Blumberg","-16 °C",null,6444,"Längenfeld","-18 °C"]
[31515,"Blumenau","-14 °C",null,3425,"Langenlebarn","-13 °C"]
[2979,"Bluno","-16 °C",null,3550,"Langenlois","-13 °C"]
[76891,"Bobenthal","-12 °C",null,3442,"Langenrohr","-13 °C"]
[86399,"Bobingen","-16 °C",null,8665,"Langenwang","-16 °C"]
[73560,"Böbingen","-16 °C",null,2103,"Langenzersdorf","-13 °C"]
["7103x","Böblingen","-14 °C",null,3921,"Langschlag","-18 °C"]
[3222,"Boblitz","-16 °C",null,8502,"Lannach","-14 °C"]
[78727,"Bochingen","-16 °C",null,6072,"Lans","-15 °C"]
["463xx","Bocholt","-10 °C",null,2821,"Lanzenkirchen","-14 °C"]
[14913,"Bochow","-14 °C",null,4291,"Lasberg","-15 °C"]
["44xxx","Bochum","-10 °C",null,2291,"Lassee","-14 °C"]
[44879,"Bochum - Linden","-12 °C",null,8903,"Lassing-Kirchdorf","-16 °C"]
[8324,"Bockau","-16 °C",null,8301,"Laßnitzhöhe","-13 °C"]
[4703,"Bockelwitz","-14 °C",null,9582,"Latschach ober dem Faakersee","-16 °C"]
[31167,"Bockenem","-14 °C",null,4821,"Lauffen","-14 °C"]
[26345,"Bockhorn","-12 °C",null,9314,"Launsdorf","-15 °C"]
["590xx","Bockum-Hövel","-12 °C",null,4461,"Laussa","-15 °C"]
[57392,"Bödefeld","-16 °C",null,6923,"Lauterach","-12 °C"]
[72411,"Bodelshausen","-16 °C",null,9473,"Lavamünd","-16 °C"]
[53539,"Bodenbach","-14 °C",null,2361,"Laxenburg","-13 °C"]
[55294,"Bodenheim","-12 °C",null,8403,"Lebring","-14 °C"]
[84155,"Bodenkirchen","-16 °C",null,6764,"Lech","-17 °C"]
[94249,"Bodenmais","-18 °C",null,9581,"Ledenitzen","-16 °C"]
[37308,"Bodenrode","-16 °C",null,3652,"Leiben","-14 °C"]
[37619,"Bodenwerder","-12 °C",null,8430,"Leibnitz","-14 °C"]
[92439,"Bodenwöhr","-16 °C",null,2003,"Leitzersdorf","-14 °C"]
[77694,"Bodersweier","-12 °C",null,4132,"Lembach im Mühlkreis","-15 °C"]
[37671,"Bödexen","-14 °C",null,5651,"Lend","-17 °C"]
[78351,"Bodman","-12 °C",null,9811,"Lendorf","-14 °C"]
[88285,"Bodnegg","-14 °C",null,3552,"Lengenfeld","-13 °C"]
[88131,"Bodolz","-12 °C",null,4860,"Lenzing","-16 °C"]
[37691,"Boffzen","-14 °C",null,8700,"Leoben","-14 °C"]
[4564,"Böhlen","-14 °C",null,2544,"Leobersdorf","-13 °C"]
[4808,"Böhlitz","-14 °C",null,5771,"Leogang","-17 °C"]
[89558,"Böhmenkirch","-16 °C",null,4060,"Leonding","-12 °C"]
[16348,"Böhmerheide","-14 °C",null,4592,"Leonstein","-14 °C"]
[72587,"Böhringen","-18 °C",null,4262,"Leopoldschlag Markt","-16 °C"]
[3130,"Bohsdorf","-16 °C",null,2333,"Leopoldsdorf bei Wien","-13 °C"]
[17268,"Boitzenburg","-12 °C",null,2285,"Leopoldsdorf im Marchfelde","-14 °C"]
[19258,"Boizenburg","-12 °C",null,6631,"Lermoos","-18 °C"]
[33034,"Bökendorf","-14 °C",null,6105,"Leutasch","-17 °C"]
[2627,"Bolbritz","-16 °C",null,8463,"Leutschach","-14 °C"]
[19077,"Boldela","-12 °C",null,3522,"Lichtenau","-17 °C"]
[89542,"Bolheim","-16 °C",null,2813,"Lichtenegg (Dorf)","-15 °C"]
[72379,"Boll","-16 °C",null,2493,"Lichtenwörth","-13 °C"]
[73087,"Boll","-16 °C",null,4252,"Liebenau","-18 °C"]
[89160,"Bollingen","-16 °C",null,9556,"Liebenfels","-16 °C"]
[39517,"Bölsdorf","-14 °C",null,8501,"Lieboch","-14 °C"]
[23946,"Boltenhagen","-10 °C",null,9900,"Lienz","-16 °C"]
[79341,"Bombach","-12 °C",null,9851,"Lieserbrücke","-14 °C"]
[4938,"Bomsdorf","-16 °C",null,9653,"Liesing","-14 °C"]
[71149,"Bondorf","-16 °C",null,8940,"Liezen","-16 °C"]
[56579,"Bonefeld","-14 °C",null,8563,"Ligist","-14 °C"]
[59199,"Bönen","-12 °C",null,3180,"Lilienfeld","-14 °C"]
[74906,"Bonfeld","-12 °C",null,3721,"Limberg","-14 °C"]
["53xxx","Bonn","-10 °C",null,9753,"Lind im Drautal","-15 °C"]
["53xxx","Bonn - Beuel","-10 °C",null,6951,"Lingenau","-16 °C"]
[53123,"Bonn - Duisdorf","-12 °C",null,4020,"Linz","-12 °C"]
[53175,"Bonn - Friesdorf","-12 °C",null,4033,"Linz-Ebelsberg","-12 °C"]
["53xxx","Bonn - Hoholz","-12 °C",null,4044,"Linz-Gründberg","-13 °C"]
[53229,"Bonn - Holzlar","-12 °C",null,4032,"Linz-Kleinmünchen","-12 °C"]
[79848,"Bonndorf","-16 °C",null,4034,"Linz-Neue Heimat","-13 °C"]
[1796,"Bonnewitz","-14 °C",null,4043,"Linz-Pöstlingberg","-14 °C"]
[1827,"Bonnewitz","-14 °C",null,4040,"Linz-Urfahr","-12 °C"]
[46519,"Bönninghardt","-10 °C",null,3874,"Litschau","-17 °C"]
[25474,"Bönningstedt","-12 °C",null,7532,"Litzelsdorf","-12 °C"]
[61194,"Bönstadt","-12 °C",null,6911,"Lochau","-12 °C"]
[73441,"Bopfingen","-16 °C",null,5221,"Lochen","-16 °C"]
[56154,"Boppard","-14 °C",null,7442,"Lockenhaus","-13 °C"]
[45355,"Borbeck","-10 °C",null,8334,"Lödersdorf","-13 °C"]
[33178,"Borchen","-14 °C",null,5090,"Lofer","-15 °C"]
[31535,"Bordenau","-14 °C",null,4923,"Lohnsburg","-16 °C"]
[34434,"Borgentreich","-14 °C",null,5311,"Loibichl","-15 °C"]
[48565,"Borghorst","-12 °C",null,3211,"Loich","-15 °C"]
[16556,"Borgsdorf","-14 °C",null,8282,"Loipersdorf bei Fürstenfeld","-14 °C"]
[24857,"Borgwedel","-10 °C",null,9335,"Lölling","-15 °C"]
[59379,"Bork","-14 °C",null,3382,"Loosdorf","-13 °C"]
[46325,"Borken","-10 °C",null,2133,"Loosdorf (Bez. Mistelbach)","-14 °C"]
[14822,"Borkheide","-14 °C",null,4460,"Losenstein","-14 °C"]
[26757,"Borkum","-10 °C",null,6713,"Ludesch","-15 °C"]
[14822,"Borkwalde","-14 °C",null,9072,"Ludmannsdorf","-16 °C"]
[41379,"Born","-10 °C",null,3762,"Ludweis","-16 °C"]
[18375,"Born(Darß)","-10 °C",null,5523,"Lungötz","-16 °C"]
[4758,"Borna","-14 °C",null,3293,"Lunz am See","-17 °C"]
[9114,"Borna","-14 °C",null,6890,"Lustenau","-12 °C"]
[4552,"Borna, b. Leipzig","-14 °C",null,7361,"Lutzmannsburg","-13 °C"]
[53332,"Bornheim","-12 °C",null,6841,"Mäder","-13 °C"]
[76879,"Bornheim","-12 °C",null,2024,"Mailberg","-14 °C"]
[6295,"Bornstedt","-14 °C",null,5751,"Maishofen","-17 °C"]
[4451,"Borsdorf","-14 °C",null,3712,"Maissau","-14 °C"]
[31749,"Borstel","-14 °C",null,9822,"Mallnitz","-15 °C"]
[9579,"Borstendorf","-16 °C",null,9854,"Malta","-15 °C"]
[73104,"Börtlingen","-16 °C",null,8974,"Mandling","-16 °C"]
[39359,"Bösdorf","-14 °C",null,3240,"Mank","-14 °C"]
[72285,"Bösingen","-16 °C",null,2452,"Mannersdorf am Leithagebirge","-13 °C"]
[37671,"Bosseborn","-14 °C",null,7444,"Mannersdorf an der Rabnitz","-13 °C"]
[74336,"Botenheim","-14 °C",null,2323,"Mannswörth","-13 °C"]
[77704,"Bottenau","-14 °C",null,3671,"Marbach an der Donau","-14 °C"]
[91637,"Bottenweiler","-16 °C",null,2294,"Marchegg Bahnhof","-14 °C"]
[6571,"Bottenweiler,Post Zumhaus ","-16 °C",null,2293,"Marchegg Stadt","-14 °C"]
["462xx","Bottrop","-10 °C",null,4614,"Marchtrenk","-14 °C"]
[79268,"Bötzingen","-12 °C",null,2433,"Margarethen am Moos","-13 °C"]
[16727,"Bötzow","-14 °C",null,5761,"Maria Alm am Steinernen Meer","-17 °C"]
[37120,"Bovenden","-16 °C",null,9182,"Maria Elend","-16 °C"]
[44388,"Bövinghausen","-12 °C",null,2402,"Maria Ellend","-14 °C"]
[2943,"Boxberg","-16 °C",null,2344,"Maria Enzersdorf am Gebirge","-13 °C"]
[97944,"Boxberg","-16 °C",null,3643,"Maria Laach am Jauerling","-16 °C"]
[74336,"Brackenheim","-12 °C",null,8591,"Maria Lankowitz","-14 °C"]
[74336,"Brackenheim - Meimsheim ","-12 °C",null,9655,"Maria Luggau","-15 °C"]
[74336,"Brackenheim - Stockheim","-12 °C",null,4443,"Maria Neustift","-16 °C"]
["33xxx","Brackwede","-12 °C",null,9161,"Maria Rain","-16 °C"]
[73574,"Brainkofen","-16 °C",null,9422,"Maria Rojach","-15 °C"]
[26919,"Brake","-10 °C",null,9063,"Maria Saal","-16 °C"]
[33729,"Brake","-12 °C",null,5241,"Maria Schmolln","-16 °C"]
[33034,"Brakel","-14 °C",null,2642,"Maria Schutz","-15 °C"]
[32816,"Brakelsiek (Schieder-Schwalenbg.)","-14 °C",null,3672,"Maria Taferl","-15 °C"]
[27211,"Bramstedt","-12 °C",null,9082,"Maria Wörth","-16 °C"]
[27628,"Bramstedt","-12 °C",null,3034,"Maria-Anzbach","-14 °C"]
[8060,"Brand","-14 °C",null,8812,"Mariahof","-15 °C"]
[52078,"Brand","-12 °C",null,2326,"Maria-Lanzendorf","-13 °C"]
[95682,"Brand","-18 °C",null,7433,"Mariasdorf","-13 °C"]
["1477x","Brandenburg/Havel","-14 °C",null,8630,"Mariazell","-16 °C"]
[9614,"Brand-Erbisdorf","-16 °C",null,2282,"Markgrafneusiedl","-14 °C"]
[6785,"Brandhorst","-14 °C",null,7411,"Markt Allhau","-12 °C"]
[4821,"Brandis","-14 °C",null,8311,"Markt Hartmannsdorf","-13 °C"]
[35647,"Brandoberndorf","-14 °C",null,7464,"Markt Neuhodis","-13 °C"]
[83098,"Brannenburg","-18 °C",null,3664,"Martinsberg","-18 °C"]
[1920,"Brauna","-16 °C",null,7221,"Marz","-13 °C"]
[95186,"Braunersgrün","-18 °C",null,6143,"Matrei am Brenner","-15 °C"]
[35619,"Braunfels","-12 °C",null,9971,"Matrei in Osttirol","-16 °C"]
[35619,"Braunfels - Tiefenbach","-12 °C",null,7210,"Mattersburg","-13 °C"]
[38700,"Braunlage","-16 °C",null,5230,"Mattighofen","-16 °C"]
["381xx","Braunschweig","-14 °C",null,5163,"Mattsee","-15 °C"]
[9577,"Braunsdorf","-14 °C",null,2243,"Matzen","-14 °C"]
[9603,"Bräunsdorf","-16 °C",null,3393,"Matzleinsdorf bei Melk","-14 °C"]
[52538,"Breberen","-10 °C",null,3001,"Mauerbach","-14 °C"]
[58339,"Breckerfeld","-12 °C",null,5270,"Mauerkirchen","-15 °C"]
[30974,"Bredenbeck","-14 °C",null,3362,"Mauer-Öhling","-13 °C"]
[37697,"Bredenborn","-14 °C",null,6212,"Maurach","-17 °C"]
[25821,"Bredstedt","-10 °C",null,3512,"Mautern","-12 °C"]
[29451,"Breese in der Marsch","-12 °C",null,8774,"Mautern in Steiermark","-15 °C"]
[37339,"Brehme","-16 °C",null,4310,"Mauthausen","-13 °C"]
[6796,"Brehna","-14 °C",null,6290,"Mayrhofen","-14 °C"]
[53797,"Breidt","-12 °C",null,4714,"Meggenhofen","-15 °C"]
[79206,"Breisach","-12 °C",null,4941,"Mehrnbach","-15 °C"]
[82211,"Breitbrunn","-16 °C",null,6812,"Meiningen","-13 °C"]
[83254,"Breitbrunn","-16 °C",null,9312,"Meiselding","-15 °C"]
[66916,"Breitenbach","-12 °C",null,3390,"Melk","-13 °C"]
[75389,"Breitenberg","-16 °C",null,6881,"Mellau","-17 °C"]
[63584,"Breitenborn","-14 °C",null,3761,"Messern","-16 °C"]
[63599,"Breitenborn","-14 °C",null,9363,"Metnitz","-15 °C"]
[91238,"Breitenbrunn","-16 °C",null,8092,"Mettersdorf am Saßbach","-13 °C"]
[72119,"Breitenholz","-16 °C",null,4931,"Mettmach","-16 °C"]
[37619,"Breitenkamp","-14 °C",null,5152,"Michaelbeuern","-15 °C"]
[6547,"Breitenstein","-16 °C",null,4712,"Michaelnbach","-16 °C"]
[89183,"Breitingen","-16 °C",null,3074,"Michelbach Markt","-14 °C"]
[35767,"Breitscheid","-14 °C",null,9322,"Micheldorf","-15 °C"]
[98597,"Breitungen","-16 °C",null,4563,"Micheldorf in Oberösterreich","-14 °C"]
[72525,"Bremelau","-16 °C",null,3451,"Michelhausen","-14 °C"]
[59469,"Bremen","-12 °C",null,6142,"Mieders","-15 °C"]
["28xxx","Bremen","-12 °C",null,6414,"Mieming","-16 °C"]
["275xx","Bremerhaven","-10 °C",null,2761,"Miesenbach","-14 °C"]
[27432,"Bremervörde","-12 °C",null,9133,"Miklauzhof","-16 °C"]
[65817,"Bremsthal","-14 °C",null,9872,"Millstatt","-14 °C"]
[53332,"Brenig","-12 °C",null,8384,"Minihof-Liebau","-13 °C"]
[37671,"Brenkhausen","-14 °C",null,4962,"Mining","-15 °C"]
[93179,"Brennberg","-18 °C",null,7511,"Mischendorf","-13 °C"]
[64395,"Brensbach","-14 °C",null,2130,"Mistelbach an der Zaya","-14 °C"]
[19294,"Bresegard","-14 °C",null,4613,"Mistelbach bei Wels","-14 °C"]
[1900,"Bretnig","-16 °C",null,6993,"Mittelberg","-17 °C"]
[74243,"Brettach","-14 °C",null,3621,"Mitterarnsdorf","-13 °C"]
[75015,"Bretten","-12 °C",null,3224,"Mitterbach","-15 °C"]
[39307,"Brettin","-14 °C",null,5503,"Mitterberghütten","-16 °C"]
[55128,"Bretzenheim","-12 °C",null,8662,"Mitterdorf im Mürztal","-15 °C"]
[74626,"Bretzfeld","-14 °C",null,4343,"Mitterkirchen","-14 °C"]
[14778,"Brielow","-14 °C",null,2441,"Mitterndorf an der Fischa","-14 °C"]
[14656,"Brieselang","-14 °C",null,5730,"Mittersill","-18 °C"]
[1968,"Brieske","-16 °C",null,9102,"Mittertrixen","-16 °C"]
[78086,"Brigachtal","-18 °C",null,9912,"Mittewald an der Drau","-16 °C"]
[59929,"Brilon","-14 °C",null,8131,"Mixnitz","-14 °C"]
[18055,"Brinckmansdorf","-10 °C",null,8763,"Möderbrugg","-15 °C"]
[4509,"Brinnis","-14 °C",null,2340,"Mödling","-13 °C"]
[79379,"Britzingen","-14 °C",null,8382,"Mogersdorf","-14 °C"]
[37115,"Brochthausen","-16 °C",null,9813,"Möllbrücke","-14 °C"]
[27386,"Brockel, Kr. Rotenburg","-16 °C",null,2513,"Möllersdorf","-13 °C"]
[null,"Brocken","-16 °C",null,4591,"Molln","-14 °C"]
[59510,"Brockhausen","-12 °C",null,4281,"Mönchdorf","-16 °C"]
[17034,"Broda","-14 °C",null,7123,"Mönchhof","-14 °C"]
[4509,"Brodau","-14 °C",null,5310,"Mondsee","-15 °C"]
[16230,"Brodowin","-14 °C",null,2872,"Mönichkirchen","-15 °C"]
[91522,"Brodswinden","-16 °C",null,8252,"Mönichwald","-14 °C"]
[56656,"Brohl - Lützing","-12 °C",null,5271,"Moosbach","-15 °C"]
[14822,"Brokheide","-14 °C",null,9062,"Moosburg","-16 °C"]
[64753,"Brombachtal","-14 °C",null,5141,"Moosdorf","-15 °C"]
[59969,"Bromskirchen","-16 °C",null,8562,"Mooskirchen","-14 °C"]
[91257,"Bronn","-16 °C",null,7072,"Mörbisch am See","-13 °C"]
[88480,"Bronnen","-16 °C",null,9842,"Mörtschach","-15 °C"]
[72770,"Bronnweiler","-16 °C",null,6423,"Mötz","-16 °C"]
[98599,"Brotterode","-16 °C",null,5732,"Mühlbach","-18 °C"]
[57539,"Bruchertseifen","-12 °C",null,5505,"Mühlbach am Hochkönig","-16 °C"]
[27305,"Bruchhausen-Vilsen","-12 °C",null,3473,"Mühlbach am Manhartsberg","-14 °C"]
[66424,"Bruchhof","-12 °C",null,3622,"Mühldorf","-14 °C"]
[63486,"Bruchköbel","-12 °C",null,9814,"Mühldorf","-14 °C"]
[76646,"Bruchsal","-12 °C",null,8822,"Mühlen","-15 °C"]
[14822,"Brück","-14 °C",null,4961,"Mühlheim am Inn","-15 °C"]
[84079,"Bruckberg","-16 °C",null,5583,"Muhr","-18 °C"]
[46569,"Bruckhausen","-10 °C",null,7052,"Müllendorf","-13 °C"]
[83052,"Bruckmühl","-16 °C",null,2482,"Münchendorf","-13 °C"]
[9548,"Brüderwiese","-16 °C",null,5222,"Munderfing","-16 °C"]
[52525,"Brüggelchen","-10 °C",null,3662,"Münichreith","-16 °C"]
[31033,"Brüggen","-14 °C",null,6232,"Münster","-15 °C"]
[41379,"Brüggen","-10 °C",null,4323,"Münzbach","-14 °C"]
[50169,"Brüggen","-12 °C",null,4792,"Münzkirchen","-16 °C"]
[50321,"Brühl , Rheinl.","-10 °C",null,8850,"Murau","-15 °C"]
[46499,"Brünen","-10 °C",null,8644,"Mürzhofen","-14 °C"]
[17039,"Brunn","-14 °C",null,8693,"Mürzsteg","-16 °C"]
[31863,"Brünnighausen","-14 °C",null,8680,"Mürzzuschlag","-16 °C"]
[23883,"Brunsmark","-12 °C",null,8682,"Mürzzuschlag-Hönigsberg","-16 °C"]
[17509,"Brünzow","-12 °C",null,2723,"Muthmannsdorf","-14 °C"]
[19209,"Brüsewitz","-12 °C",null,6162,"Mutters","-15 °C"]
[17326,"Brüssow","-14 °C",null,4331,"Naarn im Machlande","-14 °C"]
[91088,"Bubenreuth","-16 °C",null,3871,"Nagelberg","-17 °C"]
[67742,"Buborn","-14 °C",null,2023,"Nappersdorf","-14 °C"]
[73492,"Buch","-16 °C",null,6465,"Nassereith","-17 °C"]
[79774,"Buch","-12 °C",null,2661,"Naßwald","-15 °C"]
[89171,"Buch","-16 °C",null,4723,"Natternbach","-16 °C"]
[89290,"Buch","-16 °C",null,6161,"Natters","-15 °C"]
[85656,"Buch am Buchrain","-16 °C",null,6543,"Nauders","-18 °C"]
[84172,"Buch am Erlbach","-16 °C",null,7311,"Neckenmarkt","-13 °C"]
[91592,"Buch am Wald","-16 °C",null,6710,"Nenzing","-15 °C"]
[7334,"Bucha","-14 °C",null,6672,"Nesselwängle","-18 °C"]
[56823,"Büchel","-14 °C",null,8302,"Nestelbach bei Graz","-13 °C"]
[74722,"Buchen, Odenw.","-14 °C",null,2125,"Neubau","-14 °C"]
[76646,"Büchenau","-12 °C",null,8692,"Neuberg an der Mürz","-16 °C"]
[79256,"Buchenbach","-18 °C",null,3381,"Neuda","-14 °C"]
[75180,"Büchenbronn","-14 °C",null,8292,"Neudau","-12 °C"]
[79232,"Buchheim","-12 °C",null,2475,"Neudorf bei Parndorf","-14 °C"]
[88637,"Buchheim","-16 °C",null,2135,"Neudorf bei Staatz","-14 °C"]
[31710,"Buchholz","-14 °C",null,7201,"Neudörfl","-13 °C"]
[53567,"Buchholz","-12 °C",null,2491,"Neufeld an der Leitha","-13 °C"]
[21244,"Buchholz in der Nordheide","-12 °C",null,4120,"Neufelden","-14 °C"]
[94124,"Büchlberg","-16 °C",null,2565,"Neuhaus","-15 °C"]
[86807,"Buchloe","-16 °C",null,8385,"Neuhaus am Klausenbach","-13 °C"]
[90574,"Buchschwabach","-16 °C",null,4114,"Neuhaus an der Donau","-15 °C"]
[75175,"Buckenberg","-14 °C",null,4501,"Neuhofen an der Krems","-14 °C"]
[3205,"Buckow","-16 °C",null,3364,"Neuhofen an der Ybbs","-13 °C"]
[55257,"Budenheim","-12 °C",null,4814,"Neukirchen","-15 °C"]
[46487,"Büderich","-10 °C",null,5741,"Neukirchen am Großvenediger","-17 °C"]
[61137,"Büdesheim","-12 °C",null,4724,"Neukirchen am Walde","-16 °C"]
[63654,"Büdingen","-14 °C",null,5145,"Neukirchen an der Enknach","-15 °C"]
[99869,"Bufleben","-14 °C",null,4872,"Neukirchen an der Vöckla","-17 °C"]
[86657,"Buggenhofen","-16 °C",null,4671,"Neukirchen bei Lambach","-15 °C"]
[79426,"Buggingen","-14 °C",null,3040,"Neulengbach","-14 °C"]
[77815,"Bühl","-12 °C",null,5202,"Neumarkt am Wallersee","-16 °C"]
[89346,"Bühl","-16 °C",null,3371,"Neumarkt an der Ybbs","-13 °C"]
[77830,"Bühlertal","-14 °C",null,4720,"Neumarkt im Hausruckkreis","-15 °C"]
[74424,"Bühlertann","-16 °C",null,4212,"Neumarkt im Mühlkreis","-15 °C"]
[50170,"Buir","-12 °C",null,8820,"Neumarkt in Steiermark","-15 °C"]
[21782,"Bülkau","-10 °C",null,2620,"Neunkirchen","-14 °C"]
[56859,"Bullay","-12 °C",null,3593,"Neupölla","-16 °C"]
[1936,"Bulleritz","-16 °C",null,7100,"Neusiedl am See","-13 °C"]
[null,"Büllingen ( Belgien )  ","-14 °C",null,2183,"Neusiedl an der Zaya","-14 °C"]
[18276,"Bülower Burg b. Güstrow","-12 °C",null,3323,"Neustadtl-Markt","-14 °C"]
[32257,"Bünde","-12 °C",null,4143,"Neustift","-15 °C"]
[24613,"Bünzen","-12 °C",null,6167,"Neustift im Stubaital","-15 °C"]
[33142,"Büren","-14 °C",null,7343,"Neutal","-13 °C"]
[3096,"Burg","-16 °C",null,4523,"Neuzeug","-14 °C"]
[91320,"Burg - Gaillenreuth","-16 °C",null,4654,"Neydharting","-15 °C"]
[39288,"Burg b. Magdeburg","-14 °C",null,2425,"Nickelsdorf","-14 °C"]
[17094,"Burg Stargard","-14 °C",null,2272,"Niederabsdorf","-14 °C"]
[45289,"Burgaltendorf","-10 °C",null,6314,"Niederau","-18 °C"]
[89331,"Burgau","-16 °C",null,2081,"Niederfladnitz","-15 °C"]
[78126,"Burgberg","-16 °C",null,2004,"Niederhollabrunn","-14 °C"]
[91593,"Burgbernheim","-16 °C",null,4133,"Niederkappel","-15 °C"]
[31303,"Burgdorf","-14 °C",null,2124,"Niederkreuzstetten","-14 °C"]
[89429,"Burghagel","-16 °C",null,2116,"Niederleis","-14 °C"]
[96152,"Burghaslach","-16 °C",null,6342,"Niederndorf","-16 °C"]
[76327,"Burghausen","-12 °C",null,4491,"Niederneukirchen","-14 °C"]
[86666,"Burgheim","-16 °C",null,5521,"Niedernfritz","-17 °C"]
[93133,"Burglengenfeld","-16 °C",null,3531,"Niedernondorf","-17 °C"]
[97496,"Burgpreppach","-16 °C",null,5722,"Niedernsill","-18 °C"]
[88483,"Burgrieden","-16 °C",null,3702,"Niederrußbach","-14 °C"]
[6295,"Burgsdorf","-14 °C",null,4692,"Niederthalheim","-15 °C"]
[35606,"Burgsolms","-12 °C",null,4174,"Niederwaldkirchen","-15 °C"]
[9217,"Burgstädt","-14 °C",null,8831,"Niederwölz","-15 °C"]
[31171,"Burgstemmen","-14 °C",null,7302,"Nikitsch","-13 °C"]
[71576,"Burgstetten","-14 °C",null,8712,"Niklasdorf","-14 °C"]
[90559,"Burgthann","-16 °C",null,9782,"Nikolsdorf","-16 °C"]
[37318,"Burgwalde","-16 °C",null,3691,"Nöchling","-15 °C"]
[30938,"Burgwedel","-14 °C",null,9611,"Nötsch","-16 °C"]
[96154,"Burgwindheim","-16 °C",null,4542,"Nußbach","-14 °C"]
[26969,"Burhave","-10 °C",null,4865,"Nußdorf am Attersee","-15 °C"]
[97705,"Burkardroth","-16 °C",null,5151,"Nußdorf am Haunsberg","-15 °C"]
[4603,"Burkersdorf","-14 °C",null,6714,"Nüziders","-15 °C"]
[63679,"Burkhards","-14 °C",null,8742,"Obdach","-15 °C"]
[9235,"Burkhardtsdorf","-14 °C",null,5411,"Oberalm Markt","-15 °C"]
[8318,"Burkhardtsgrün","-16 °C",null,6311,"Oberau","-18 °C"]
[72393,"Burladingen","-18 °C",null,9781,"Oberdrauburg","-15 °C"]
[17089,"Burow","-14 °C",null,3200,"Ober-Grafendorf","-14 °C"]
[51399,"Burscheid","-12 °C",null,4593,"Obergrünburg","-14 °C"]
[68642,"Bürstadt","-12 °C",null,8455,"Oberhaag","-14 °C"]
[89349,"Burtenbach","-16 °C",null,4894,"Oberhofen am Irrsee","-16 °C"]
[53913,"Buschhoven","-14 °C",null,4144,"Oberkappel","-15 °C"]
[50129,"Büsdorf","-12 °C",null,7451,"Oberloisdorf","-13 °C"]
[35418,"Buseck","-12 °C",null,3521,"Ober-Meisling","-14 °C"]
[76337,"Busenbach","-14 °C",null,4131,"Obermühl an der Donau","-15 °C"]
[76891,"Busenberg","-12 °C",null,4982,"Obernberg am Inn","-15 °C"]
[25719,"Busenwurth","-10 °C",null,3281,"Oberndorf an der Melk","-14 °C"]
[78266,"Büsingen","-12 °C",null,5110,"Oberndorf bei Salzburg","-15 °C"]
[99198,"Büßleben","-14 °C",null,6372,"Oberndorf in Tirol","-17 °C"]
[26969,"Butjadingen","-10 °C",null,4181,"Oberneukirchen","-16 °C"]
[77764,"Butschbach","-14 °C",null,8612,"Oberort","-15 °C"]
[99439,"Buttelstedt","-14 °C",null,6173,"Oberperfuss","-15 °C"]
[96155,"Buttenheim","-16 °C",null,7350,"Oberpullendorf","-13 °C"]
[86647,"Buttenwiesen","-16 °C",null,2105,"Oberrohrbach","-13 °C"]
[86647,"Buttenwiesen-Frauenstetten","-16 °C",null,7432,"Oberschützen","-13 °C"]
[41564,"Büttgen","-10 °C",null,2283,"Obersiebenbrunn","-14 °C"]
[35510,"Butzbach","-14 °C",null,2224,"Obersulz","-14 °C"]
[21683,"Bützfleth","-10 °C",null,9942,"Obertilliach","-17 °C"]
[54309,"Butzweiler","-14 °C",null,4831,"Obertraun","-12 °C"]
[87700,"Buxach","-16 °C",null,5162,"Obertrum","-15 °C"]
[21614,"Buxtehude","-12 °C",null,9821,"Obervellach","-13 °C"]
[90556,"Cadolzburg","-16 °C",null,2522,"Oberwaltersdorf","-13 °C"]
[39240,"Calbe","-14 °C",null,4882,"Oberwang","-15 °C"]
[38547,"Calberlah","-14 °C",null,7400,"Oberwart","-13 °C"]
[75323,"Calmbach","-16 °C",null,2295,"Oberweiden","-14 °C"]
[75365,"Calw      (wie mit Willi abgesprochen)","-14 °C",null,4664,"Oberweis","-14 °C"]
[19246,"Camin","-12 °C",null,3124,"Oberwölbling","-14 °C"]
[17094,"Cammin","-14 °C",null,8832,"Oberwölz Stadt","-15 °C"]
[4685,"Cannewitz","-14 °C",null,8762,"Oberzeiring","-15 °C"]
[59379,"Cappenberg","-12 °C",null,8960,"Öblarn","-15 °C"]
[59379,"Cappenberg","-12 °C",null,3123,"Obritzberg","-14 °C"]
[14548,"Caputh","-14 °C",null,6416,"Obsteig","-17 °C"]
[67316,"Carlsberg","-12 °C",null,2755,"Oed","-14 °C"]
[2708,"Carlsbrunn","-16 °C",null,3312,"Oed","-15 °C"]
[95138,"Carlsgrün","-18 °C",null,6433,"Oetz","-16 °C"]
[17291,"Carmzow","-14 °C",null,4625,"Offenhausen","-15 °C"]
[17219,"Carolinenhof","-14 °C",null,4064,"Oftering","-14 °C"]
[2699,"Caßlau","-16 °C",null,7063,"Oggau","-13 °C"]
["445xx","Castrop-Rauxel","-10 °C",null,4694,"Ohlsdorf","-15 °C"]
[4758,"Cavertitz","-16 °C",null,7534,"Olbendorf","-12 °C"]
["292xx","Celle","-12 °C",null,3061,"Ollersbach","-14 °C"]
[93413,"Cham","-18 °C",null,2252,"Ollersdorf","-14 °C"]
[93466,"Chamerau","-18 °C",null,7533,"Ollersdorf im Burgenland","-12 °C"]
[56379,"Charlottenberg","-12 °C",null,3342,"Opponitz","-15 °C"]
["0911x","Chemnitz","-14 °C",null,4974,"Ort im Innkreis","-15 °C"]
[83339,"Chieming","-16 °C",null,2304,"Orth an der Donau","-14 °C"]
[4720,"Choren","-14 °C",null,9570,"Ossiach","-15 °C"]
[16230,"Chorin","-14 °C",null,5121,"Ostermiething","-15 °C"]
[9236,"Claußnitz","-14 °C",null,8312,"Ottendorf bei Gleisdorf","-13 °C"]
[38678,"Clausthal-Zellerfeld","-14 °C",null,3631,"Ottenschlag","-18 °C"]
[74196,"Cleversulzbach","-14 °C",null,4100,"Ottensheim","-14 °C"]
[99718,"Clingen","-14 °C",null,2163,"Ottenthal","-14 °C"]
[49661,"Cloppenburg","-12 °C",null,4901,"Ottnang am Hausruck","-15 °C"]
[96450,"Coburg","-14 °C",null,6430,"Ötztal Bahnhof","-16 °C"]
[56812,"Cochem","-10 °C",null,4363,"Pabneukirchen","-15 °C"]
[6449,"Cochstedt","-14 °C",null,8341,"Paldau","-13 °C"]
[48653,"Coesfeld","-10 °C",null,8923,"Palfau","-15 °C"]
[4680,"Colditz","-14 °C",null,2182,"Palterndorf","-14 °C"]
[91598,"Colmberg","-16 °C",null,2422,"Pama","-14 °C"]
[1738,"Colmnitz","-16 °C",null,7152,"Pamhagen","-14 °C"]
[4680,"Commichau","-14 °C",null,7111,"Parndorf","-14 °C"]
[9633,"Conradsdorf","-16 °C",null,6794,"Partenen","-17 °C"]
[75334,"Conweiler","-14 °C",null,4061,"Pasching","-14 °C"]
[31863,"Coppenbrügge","-14 °C",null,8162,"Passail","-14 °C"]
[1640,"Coswig","-14 °C",null,9564,"Patergassen","-16 °C"]
[6869,"Coswig","-14 °C",null,9711,"Paternion","-14 °C"]
[1796,"Cotta B","-14 °C",null,6082,"Patsch","-16 °C"]
["030xx","Cottbus","-16 °C",null,2650,"Payerbach","-14 °C"]
[74564,"Crailsheim","-16 °C",null,8120,"Peggau","-14 °C"]
[65558,"Cramberg","-12 °C",null,4153,"Peilstein im Mühlviertel","-14 °C"]
[8340,"Crandorf","-16 °C",null,9816,"Penk","-14 °C"]
[9465,"Cranzahl","-16 °C",null,4624,"Pennewang","-15 °C"]
[38162,"Cremlingen","-14 °C",null,2380,"Perchtoldsdorf","-13 °C"]
[72178,"Cresbach","-16 °C",null,4320,"Perg","-13 °C"]
[16306,"Criewen","-16 °C",null,8132,"Pernegg an der Mur","-14 °C"]
[8451,"Crimmitschau","-14 °C",null,2052,"Pernersdorf","-14 °C"]
[19089,"Crivitz","-12 °C",null,2763,"Pernitz","-15 °C"]
[19089,"Crivitz","-12 °C",null,3142,"Perschling","-14 °C"]
[8129,"Crossen","-14 °C",null,3680,"Persenbeug","-13 °C"]
[9306,"Crossen","-14 °C",null,6213,"Pertisau","-17 °C"]
[2681,"Crostau","-16 °C",null,4743,"Peterskirchen","-15 °C"]
[9474,"Crottendorf","-16 °C",null,2404,"Petronell","-14 °C"]
[19322,"Cumlosen","-14 °C",null,4643,"Pettenbach","-14 °C"]
[9456,"Cunersdorf","-16 °C",null,6574,"Pettneu am Arlberg","-18 °C"]
[2733,"Cunewalde","-16 °C",null,3252,"Petzenkirchen","-14 °C"]
[1824,"Cunnersdorf b. Königstein","-16 °C",null,4722,"Peuerbach","-16 °C"]
["274xx","Cuxhaven","-10 °C",null,6405,"Pfaffenhofen","-15 °C"]
[85221,"Dachau","-16 °C",null,3834,"Pfaffenschlag bei Waidhofen an der Thaya","-17 °C"]
[91462,"Dachsbach","-16 °C",null,2511,"Pfaffstätten","-13 °C"]
[79875,"Dachsberg","-16 °C",null,4141,"Pfarrkirchen im Mühlkreis","-16 °C"]
[71134,"Dachtel","-16 °C",null,5452,"Pfarrwerfen","-16 °C"]
[99100,"Dachwig","-14 °C",null,6542,"Pfunds Dorf","-16 °C"]
[33100,"Dahl","-14 °C",null,6551,"Pians","-15 °C"]
[53949,"Dahlem","-14 °C",null,8973,"Pichl","-16 °C"]
[39326,"Dahlenwarsleben","-14 °C",null,4632,"Pichl bei Wels","-15 °C"]
[42477,"Dahlerau","-12 °C",null,4282,"Pierbach","-15 °C"]
[15366,"Dahlwitz-Hoppegarten","-14 °C",null,5721,"Piesendorf","-18 °C"]
[66994,"Dahn","-12 °C",null,2753,"Piesting","-14 °C"]
[88718,"Daisendorf","-12 °C",null,7441,"Pilgersdorf","-13 °C"]
[19071,"Dalberg","-12 °C",null,2211,"Pillichsdorf","-14 °C"]
[73492,"Dalkingen","-16 °C",null,8243,"Pinggau","-14 °C"]
[74834,"Dallau","-14 °C",null,7423,"Pinkafeld","-13 °C"]
[14624,"Dallgow","-14 °C",null,4812,"Pinsdorf","-14 °C"]
[67592,"Dalsheim","-12 °C",null,2222,"Pirawarth","-14 °C"]
[23738,"Damlos","-10 °C",null,9064,"Pischeldorf","-16 °C"]
[17291,"Damme","-14 °C",null,5233,"Pischelsdorf am Engelbach","-15 °C"]
[24351,"Damp","-10 °C",null,8212,"Pischelsdorf in Steiermark","-14 °C"]
[15936,"Damsdorf","-14 °C",null,2823,"Pitten","-14 °C"]
[23948,"Damshagen","-10 °C",null,3564,"Plank am Kamp","-13 °C"]
[6493,"Dankerode","-16 °C",null,2083,"Pleißing","-15 °C"]
[38461,"Danndorf","-14 °C",null,3380,"Pöchlarn","-14 °C"]
[38524,"Dannenbüttel","-14 °C",null,7141,"Podersdorf am See","-14 °C"]
[67814,"Dannenfels","-12 °C",null,3650,"Pöggstall","-15 °C"]
[39245,"Dannigkow","-14 °C",null,8544,"Pölfing","-14 °C"]
[67661,"Dansenberg","-12 °C",null,8225,"Pöllau (Hartberg)","-13 °C"]
[38836,"Dardesheim","-14 °C",null,4951,"Polling im Innkreis","-15 °C"]
[17498,"Dargelin","-12 °C",null,8761,"Pöls ob Judenburg","-15 °C"]
[38871,"Darlingerode","-16 °C",null,4891,"Pöndorf","-18 °C"]
[71063,"Darmsheim","-16 °C",null,9210,"Pörtschach am Wörthersee","-16 °C"]
["642xx","Darmstadt","-12 °C",null,3140,"Pottenbrunn","-14 °C"]
[54552,"Darscheid","-14 °C",null,2486,"Pottendorf","-13 °C"]
[86453,"Dasing","-16 °C",null,2563,"Pottenstein","-14 °C"]
[37586,"Dassel","-14 °C",null,2633,"Pottschach","-14 °C"]
[37574,"Dassensen","-16 °C",null,7033,"Pöttsching","-13 °C"]
[92358,"Daßwangen","-16 °C",null,2473,"Potzneusiedl","-14 °C"]
[45711,"Datteln","-12 °C",null,2161,"Poysbrunn","-15 °C"]
[79379,"Dattingen","-14 °C",null,2170,"Poysdorf","-14 °C"]
[71120,"Dätzingen","-16 °C",null,9974,"Prägraten","-16 °C"]
[56412,"Daubach","-14 °C",null,4742,"Pram","-15 °C"]
[2906,"Dauban","-16 °C",null,4731,"Prambachkirchen","-16 °C"]
[54550,"Daun","-14 °C",null,4874,"Pramet","-16 °C"]
[91522,"Dautenwinden","-16 °C",null,9461,"Prebl","-14 °C"]
[4886,"Dautzschen","-16 °C",null,8504,"Preding","-14 °C"]
[76185,"Daxlanden","-12 °C",null,4230,"Pregarten","-14 °C"]
[27607,"Debstedt","-10 °C",null,2654,"Prein an der Rax","-15 °C"]
[18317,"Dechowshof","-10 °C",null,9451,"Preitenegg","-16 °C"]
[75392,"Deckenpfronn","-16 °C",null,2472,"Prellenkirchen","-14 °C"]
[30926,"Dedensen","-14 °C",null,3021,"Pressbaum","-14 °C"]
[37627,"Deensen","-14 °C",null,2185,"Prinzendorf an der Zaya","-14 °C"]
[88456,"Degernau","-16 °C",null,3385,"Prinzersdorf","-14 °C"]
[72762,"Degerschlacht","-16 °C",null,2242,"Prottes","-14 °C"]
[94469,"Deggenau","-18 °C",null,8965,"Pruggern","-14 °C"]
[94469,"Deggendorf","-18 °C",null,6522,"Prutz","-16 °C"]
[88693,"Deggenhausental","-14 °C",null,5412,"Puch bei Hallein","-15 °C"]
[73326,"Deggingen","-16 °C",null,8182,"Puch bei Weiz","-13 °C"]
[8538,"Dehles","-18 °C",null,2734,"Puchberg am Schneeberg","-15 °C"]
[67146,"Deidesheim","-12 °C",null,3214,"Puchenstuben","-16 °C"]
[78586,"Deilingen","-18 °C",null,3741,"Pulkau","-14 °C"]
[92364,"Deining","-16 °C",null,3944,"Pürbach","-17 °C"]
[86738,"Deiningen","-16 °C",null,7083,"Purbach am Neusiedlersee","-13 °C"]
[33129,"Delbrück","-12 °C",null,3251,"Purgstall","-14 °C"]
[4509,"Delitzsch","-14 °C",null,3002,"Purkersdorf","-14 °C"]
[31073,"Delligsen","-14 °C",null,9812,"Pusarnitz","-14 °C"]
[89155,"Dellmensingen","-14 °C",null,8764,"Pusterwald","-15 °C"]
["277xx","Delmenhorst","-12 °C",null,9104,"Pustritz","-15 °C"]
[19089,"Demen","-12 °C",null,4134,"Putzleinsdorf","-15 °C"]
[1877,"Demitz - Thumitz","-16 °C",null,3143,"Pyhra","-14 °C"]
[85098,"Demling","-18 °C",null,4760,"Raab","-15 °C"]
[17109,"Demmin","-12 °C",null,3820,"Raabs an der Thaya","-16 °C"]
[73770,"Denkendorf","-14 °C",null,2281,"Raasdorf","-14 °C"]
[88630,"Denkingen","-14 °C",null,2274,"Rabensburg","-14 °C"]
[14913,"Dennewitz","-14 °C",null,3203,"Rabenstein","-14 °C"]
[79207,"Denzlingen","-14 °C",null,9545,"Radenthein","-15 °C"]
[79211,"Denzlingen","-14 °C",null,8490,"Radkersburg","-13 °C"]
[39317,"Derben","-14 °C",null,8795,"Radmer","-15 °C"]
[38895,"Derenburg","-14 °C",null,5550,"Radstadt","-17 °C"]
[37691,"Derental","-14 °C",null,6741,"Raggal","-17 °C"]
[53507,"Dernau","-14 °C",null,2215,"Raggendorf","-14 °C"]
[56428,"Dernbach","-14 °C",null,4791,"Rainbach im Innkreis","-15 °C"]
[76857,"Dernbach","-12 °C",null,4261,"Rainbach im Mühlkreis","-16 °C"]
[31188,"Derneburg","-14 °C",null,3162,"Rainfeld","-14 °C"]
["0684x","Dessau","-14 °C",null,3172,"Ramsau","-15 °C"]
["327xx","Detmold","-12 °C",null,8972,"Ramsau","-16 °C"]
[72135,"Dettenhausen","-16 °C",null,3263,"Randegg","-14 °C"]
[76706,"Dettenheim","-12 °C",null,9833,"Rangersdorf","-15 °C"]
[86911,"Dettenschwang","-16 °C",null,6830,"Rankweil","-14 °C"]
[72108,"Dettingen","-16 °C",null,2324,"Rannersdorf bei Wien","-13 °C"]
[72160,"Dettingen","-16 °C",null,5282,"Ranshofen","-15 °C"]
[73265,"Dettingen","-16 °C",null,8853,"Ranten","-16 °C"]
[88451,"Dettingen","-16 °C",null,3911,"Rappottenstein","-17 °C"]
[89547,"Dettingen","-16 °C",null,3532,"Rastenfeld","-17 °C"]
[89584,"Dettingen","-14 °C",null,8673,"Ratten","-16 °C"]
[72581,"Dettingen an der Erms","-16 °C",null,6240,"Rattenberg","-15 °C"]
[18320,"Dettmannsdorf","-12 °C",null,9631,"Rattendorf","-15 °C"]
[71134,"Deufringen","-16 °C",null,7443,"Rattersdorf","-13 °C"]
[54411,"Deuselbach","-12 °C",null,5661,"Rauris","-17 °C"]
[84166,"Deutenkofen","-16 °C",null,3720,"Ravelsbach","-14 °C"]
[9548,"Deutscheinsiedel","-16 °C",null,3654,"Raxendorf","-15 °C"]
[9548,"Deutschkatharinenberg","-16 °C",null,7471,"Rechnitz","-13 °C"]
[9548,"Deutschneudorf","-16 °C",null,4844,"Regau","-15 °C"]
[78355,"Deutwang","-14 °C",null,2403,"Regelsbrunn","-14 °C"]
[4574,"Deutzen","-14 °C",null,2651,"Reichenau an der Rax","-14 °C"]
[18439,"Devin","-10 °C",null,4204,"Reichenau im Mühlkreis","-15 °C"]
[55278,"Dexheim","-12 °C",null,9463,"Reichenfels","-14 °C"]
[38530,"Didderse","-14 °C",null,4193,"Reichenthal","-16 °C"]
[91583,"Diebach","-16 °C",null,4981,"Reichersberg","-15 °C"]
[56332,"Dieblich","-12 °C",null,4462,"Reichraming","-15 °C"]
[64807,"Dieburg","-14 °C",null,3454,"Reidling","-13 °C"]
[75015,"Diedelsheim","-12 °C",null,9081,"Reifnitz","-16 °C"]
[67434,"Diedesfeld","-12 °C",null,8103,"Rein","-13 °C"]
[86420,"Diedorf","-16 °C",null,3863,"Reingers","-17 °C"]
[18119,"Diedrichshagen","-10 °C",null,2276,"Reinthal","-14 °C"]
[31199,"Diekholzen","-14 °C",null,9633,"Reisach","-15 °C"]
[69234,"Dielheim","-12 °C",null,6235,"Reith bei Brixlegg","-16 °C"]
[86657,"Diemantstein","-16 °C",null,6103,"Reith bei Seefeld","-17 °C"]
[34474,"Diemelstadt","-14 °C",null,3031,"Rekawinkel","-14 °C"]
[15864,"Diensdorf","-14 °C",null,8674,"Rettenegg","-16 °C"]
[97941,"Dienstadt","-14 °C",null,2070,"Retz","-14 °C"]
[31603,"Diepenau","-12 °C",null,3004,"Ried am Riederberg","-14 °C"]
[91227,"Diepersdorf","-16 °C",null,4910,"Ried im Innkreis","-15 °C"]
[1665,"Diera","-14 °C",null,6531,"Ried im Oberinntal","-16 °C"]
[77749,"Diersburg","-12 °C",null,4551,"Ried im Traunkreis","-14 °C"]
[77866,"Diersheim","-12 °C",null,4312,"Ried in der Riedmark","-13 °C"]
[6184,"Dieshau","-14 °C",null,4752,"Riedau","-15 °C"]
[91456,"Diespeck","-16 °C",null,7422,"Riedlingsdorf","-13 °C"]
[86911,"Dießen","-16 °C",null,6943,"Riefensberg","-16 °C"]
[89165,"Dietenheim","-16 °C",null,2092,"Riegersburg","-16 °C"]
[90599,"Dietenhofen","-16 °C",null,8333,"Riegersburg","-13 °C"]
[88524,"Dieterskirch","-14 °C",null,9587,"Riegersdorf","-16 °C"]
[75210,"Dietlingen","-14 °C",null,6421,"Rietz","-16 °C"]
[88410,"Dietmanns","-16 °C",null,6991,"Riezlern","-18 °C"]
[87463,"Dietmannsried","-16 °C",null,6074,"Rinn","-15 °C"]
[63128,"Dietzenbach","-12 °C",null,7323,"Ritzing","-13 °C"]
[35716,"Dietzhölztal","-14 °C",null,2663,"Rohr im Gebirge","-15 °C"]
[65582,"Diez","-12 °C",null,4532,"Rohr im Kremstal","-14 °C"]
[71034,"Diezenhalde","-14 °C",null,2471,"Rohrau","-14 °C"]
[35683,"Dillenburg","-12 °C",null,3163,"Rohrbach an der Gölsen","-14 °C"]
[89407,"Dillingen/Donau","-16 °C",null,8234,"Rohrbach an der Lafnitz","-13 °C"]
[66763,"Dillingen-Diefflen","-12 °C",null,7222,"Rohrbach bei Mattersburg","-13 °C"]
[46499,"Dingden","-10 °C",null,4150,"Rohrbach in Oberösterreich","-14 °C"]
[78465,"Dingelsdorf","-12 °C",null,3592,"Röhrenbach","-16 °C"]
[37351,"Dingelstädt","-16 °C",null,4661,"Roitham","-15 °C"]
[38838,"Dingelstedt","-14 °C",null,6426,"Roppen","-16 °C"]
[84130,"Dingolfing","-18 °C",null,3743,"Röschitz","-14 °C"]
[84130,"Dingolfingen","-16 °C",null,9232,"Rosegg","-16 °C"]
[91550,"Dinkelsbühl","-16 °C",null,3332,"Rosenau","-14 °C"]
[86424,"Dinkelscherben","-16 °C",null,4581,"Rosenau am Hengstpaß","-15 °C"]
[59514,"Dinker","-12 °C",null,3924,"Rosenau Schloß","-17 °C"]
[49413,"Dinklage","-12 °C",null,9183,"Rosenbach","-16 °C"]
["4653x","Dinslaken","-10 °C",null,3573,"Rosenburg","-14 °C"]
[1744,"Dippoldiswalde","-14 °C",null,8582,"Rosental an der Kainach","-14 °C"]
[27412,"Dipshorn","-12 °C",null,3602,"Rossatz","-13 °C"]
[87742,"Dirlewang","-16 °C",null,5273,"Roßbach","-15 °C"]
[89561,"Dischingen","-16 °C",null,4575,"Roßleithen","-14 °C"]
[49201,"Dissen","-12 °C",null,7501,"Rotenturm an der Pinka","-13 °C"]
[3052,"Dissenchen","-16 °C",null,9701,"Rothenthurn","-14 °C"]
[6484,"Ditfurt","-14 °C",null,6832,"Röthis","-14 °C"]
[67596,"Dittelsheim - Heßloch","-12 °C",null,4681,"Rottenbach","-15 °C"]
[91723,"Dittenheim","-16 °C",null,4112,"Rottenegg","-14 °C"]
[1768,"Dittersbach","-16 °C",null,8786,"Rottenmann","-16 °C"]
[9669,"Dittersbach","-16 °C",null,2111,"Rückersdorf-Harmannsdorf","-13 °C"]
[2748,"Dittersbach auf dem Eigen","-16 °C",null,9113,"Ruden","-16 °C"]
[9573,"Dittmannsdorf","-14 °C",null,7571,"Rudersdorf","-14 °C"]
[9629,"Dittmannsdorf","-14 °C",null,6064,"Rum","-14 °C"]
[71254,"Ditzingen","-14 °C",null,3244,"Ruprechtshofen","-14 °C"]
[75335,"Dobel","-16 °C",null,5442,"Rußbach am Paß Gschütt","-15 °C"]
[4720,"Döbeln","-14 °C",null,7071,"Rust","-13 °C"]
[4874,"Döbeltitz","-16 °C",null,4845,"Rutzenmoos","-15 °C"]
[3253,"Doberlug","-16 °C",null,5753,"Saalbach","-18 °C"]
[3159,"Döbern","-16 °C",null,5760,"Saalfelden am Steinernen Meer","-17 °C"]
[4860,"Döbern","-16 °C",null,9751,"Sachsenburg","-14 °C"]
[2699,"Doberschütz","-16 °C",null,8592,"Salla","-15 °C"]
[4838,"Doberschütz","-14 °C",null,3525,"Sallingberg","-18 °C"]
[4703,"Doberschwitz","-14 °C",null,5020,"Salzburg","-15 °C"]
[4626,"Dobitschen","-14 °C",null,5026,"Salzburg-Bahnhof Aigen","-15 °C"]
[6729,"Döbitzschen","-14 °C",null,5035,"Salzburg-Flughafen","-15 °C"]
[1561,"Dobra","-16 °C",null,5023,"Salzburg-Gnigl","-15 °C"]
[1833,"Dobra","-14 °C",null,5028,"Salzburg-Kasern","-15 °C"]
[4924,"Dobra","-16 °C",null,5013,"Salzburg-Liefering","-15 °C"]
[54552,"Dockweiler","-14 °C",null,5034,"Salzburg-Morzg","-15 °C"]
[54518,"Dodenburg","-14 °C",null,4251,"Sandl","-17 °C"]
[4509,"Doebernitz","-14 °C",null,4725,"Sankt Aegidi","-16 °C"]
[71120,"Döffingen","-16 °C",null,3193,"Sankt Aegyd am Neuwalde","-15 °C"]
[79804,"Dogern","-12 °C",null,4084,"Sankt Agatha","-17 °C"]
[95182,"Döhlau","-18 °C",null,9433,"Sankt Andrä","-15 °C"]
[1796,"Dohma","-14 °C",null,7161,"Sankt Andrä bei Frauenkirchen","-14 °C"]
[1809,"Dohna","-14 °C",null,8444,"Sankt Andrä im Sausal","-14 °C"]
[6120,"Dölau","-14 °C",null,3423,"Sankt Andrä-Wördern","-13 °C"]
[6184,"Dölbau","-14 °C",null,8354,"Sankt Anna am Aigen","-13 °C"]
[3238,"Dollenchen","-16 °C",null,6580,"Sankt Anton am Arlberg","-18 °C"]
[24989,"Dollerup","-10 °C",null,3283,"Sankt Anton an der Jeßnitz","-15 °C"]
[99100,"Döllstädt","-14 °C",null,6771,"Sankt Anton im Montafon","-16 °C"]
[92364,"Döllwang","-16 °C",null,3051,"Sankt Christophen","-14 °C"]
[19303,"Dömitz","-12 °C",null,9536,"Sankt Egyden","-16 °C"]
[4880,"Dommitsch","-16 °C",null,8615,"Sankt Erhard bei Mixnitz","-15 °C"]
[4880,"Dommitzsch","-16 °C",null,4490,"Sankt Florian bei Linz","-13 °C"]
[4924,"Domsdorf","-16 °C",null,8933,"Sankt Gallen","-15 °C"]
[19374,"Domsühl","-14 °C",null,6791,"Sankt Gallenkirch","-17 °C"]
[78166,"Donaueschingen","-18 °C",null,9313,"Sankt Georgen am Längsee","-16 °C"]
[86609,"Donauwörth","-16 °C",null,3344,"Sankt Georgen am Reith","-16 °C"]
[6571,"Donndorf","-14 °C",null,3151,"Sankt Georgen am Steinfelde","-14 °C"]
[27612,"Donnern","-12 °C",null,4372,"Sankt Georgen am Walde","-16 °C"]
[72587,"Donnstetten","-18 °C",null,4222,"Sankt Georgen an der Gusen","-13 °C"]
[73072,"Donzdorf","-16 °C",null,3282,"Sankt Georgen an der Leys","-15 °C"]
[54528,"Dörbach","-14 °C",null,8413,"Sankt Georgen an der Stiefing","-14 °C"]
[32694,"Dörentrup","-14 °C",null,4880,"Sankt Georgen im Attergau","-16 °C"]
[18311,"Dorf Körkwitz","-10 °C",null,9612,"Sankt Georgen im Gailtal","-16 °C"]
[23972,"Dorf Mecklenburg","-10 °C",null,9423,"Sankt Georgen im Lavanttal","-15 °C"]
[29683,"Dorfmark","-14 °C",null,8756,"Sankt Georgen ob Judenburg","-15 °C"]
[97904,"Dorfprozelten","-14 °C",null,8861,"Sankt Georgen ob Murau","-15 °C"]
[2979,"Dörgenhausen","-16 °C",null,9413,"Sankt Gertraud","-15 °C"]
[61169,"Dorheim","-12 °C",null,5340,"Sankt Gilgen","-14 °C"]
[77978,"Dörlinbach","-14 °C",null,8614,"Sankt Jakob bei Mixnitz","-14 °C"]
[41542,"Dormagen","-10 °C",null,9651,"Sankt Jakob im Lesachtal","-14 °C"]
[72358,"Dormettingen","-16 °C",null,9184,"Sankt Jakob im Rosental","-16 °C"]
[72124,"Dörnach","-16 °C",null,8255,"Sankt Jakob im Walde","-16 °C"]
[89186,"Dorndorf","-16 °C",null,9963,"Sankt Jakob in Defereggen","-17 °C"]
[67585,"Dorn-Dürkheim","-12 °C",null,6154,"Sankt Jodok am Brenner","-15 °C"]
[72175,"Dornhan","-16 °C",null,8765,"Sankt Johann am Tauern","-15 °C"]
[89160,"Dornstadt","-16 °C",null,5242,"Sankt Johann am Walde","-17 °C"]
[72280,"Dornstetten","-16 °C",null,4172,"Sankt Johann am Wimberg","-15 °C"]
[9509,"Dörnthal","-16 °C",null,8222,"Sankt Johann bei Herberstein","-13 °C"]
[56370,"Dörsdorf","-14 °C",null,5600,"Sankt Johann im Pongau","-15 °C"]
["4628x","Dorsten","-10 °C",null,8453,"Sankt Johann im Saggautal","-14 °C"]
["44xxx","Dortmund","-12 °C",null,8295,"Sankt Johann in der Haide","-12 °C"]
[44388,"Dortmund - Bövinghausen","-12 °C",null,6380,"Sankt Johann in Tirol","-16 °C"]
[44309,"Dortmund - Brackel","-12 °C",null,8565,"Sankt Johann ob Hohenburg","-14 °C"]
[44369,"Dortmund - Deusen","-12 °C",null,8503,"Sankt Josef (Weststeiermark)","-14 °C"]
[44329,"Dortmund - Grevel","-12 °C",null,9122,"Sankt Kanzian am Klopeiner See","-16 °C"]
[44263,"Dortmund - Hörde","-12 °C",null,8611,"Sankt Katharein an der Laming","-15 °C"]
[44149,"Dortmund - Kley","-12 °C",null,8672,"Sankt Kathrein am Hauenstein","-16 °C"]
[44229,"Dortmund - Lücklemberg","-12 °C",null,8171,"Sankt Kathrein am Offenegg","-15 °C"]
["44xxx","Dortmund - Oespel","-12 °C",null,5423,"Sankt Koloman","-15 °C"]
[44269,"Dortmund - Schüren","-12 °C",null,4817,"Sankt Konrad","-15 °C"]
[44265,"Dortmund - Wichlinghofen","-12 °C",null,8813,"Sankt Lambrecht","-14 °C"]
[27632,"Dorum","-10 °C",null,3243,"Sankt Leonhard am Forst","-14 °C"]
[74677,"Dörzbach","-14 °C",null,3572,"Sankt Leonhard am Hornerwald","-16 °C"]
[4720,"Döschütz","-14 °C",null,4294,"Sankt Leonhard bei Freistadt","-17 °C"]
[79739,"Dossenbach","-12 °C",null,8242,"Sankt Lorenzen am Wechsel","-15 °C"]
[69221,"Dossenheim","-12 °C",null,8715,"Sankt Lorenzen bei Knittelfeld","-15 °C"]
[72359,"Dotternhausen","-18 °C",null,9654,"Sankt Lorenzen im Lesachtal","-15 °C"]
[72525,"Dottingen","-18 °C",null,8642,"Sankt Lorenzen im Mürztal","-14 °C"]
[79282,"Dottingen","-14 °C",null,8323,"Sankt Marein bei Graz-Markt","-13 °C"]
[56729,"Döttingen","-14 °C",null,8733,"Sankt Marein bei Knittelfeld","-14 °C"]
[null,"Drachenbronn ( Frankreich )","-12 °C",null,8641,"Sankt Marein im Mürztal","-14 °C"]
[94256,"Drachselsried","-18 °C",null,9173,"Sankt Margareten im Rosental","-15 °C"]
[73345,"Drackenstein","-18 °C",null,8321,"Sankt Margarethen an der Raab","-14 °C"]
[55127,"Drais","-12 °C",null,3231,"Sankt Margarethen an der Sierning","-14 °C"]
[31623,"Drakenburg","-12 °C",null,7062,"Sankt Margarethen im Burgenland","-13 °C"]
[37127,"Dransfeld","-14 °C",null,9412,"Sankt Margarethen im Lavanttal","-15 °C"]
[4938,"Drasdo","-16 °C",null,4502,"Sankt Marien","-14 °C"]
[56330,"Dreckenach","-14 °C",null,4076,"Sankt Marienkirchen an der Polsenz","-16 °C"]
[53520,"Drees","-14 °C",null,4774,"Sankt Marienkirchen bei Schärding","-15 °C"]
[63303,"Dreieich","-12 °C",null,3971,"Sankt Martin","-17 °C"]
[54518,"Dreis","-14 °C",null,7341,"Sankt Martin (Bezirk Oberpullendorf)","-13 °C"]
[54552,"Dreis-Brück","-14 °C",null,8954,"Sankt Martin am Grimming","-15 °C"]
[48317,"Drensteinfurt","-12 °C",null,5522,"Sankt Martin am Tennengebirge","-17 °C"]
["010xx","Dresden","-14 °C",null,8383,"Sankt Martin an der Raab","-13 °C"]
[1108,"Dresden - Weixdorf","-14 °C",null,5092,"Sankt Martin bei Lofer","-16 °C"]
[33014,"Dringenberg","-14 °C",null,4973,"Sankt Martin im Innkreis","-15 °C"]
[19069,"Drispeth","-12 °C",null,4113,"Sankt Martin im Mühlkreis","-15 °C"]
[21706,"Drochtersen","-10 °C",null,8543,"Sankt Martin im Sulmtal","-14 °C"]
[8606,"Dröda","-18 °C",null,9143,"Sankt Michael","-16 °C"]
[21386,"Drögennindorf","-14 °C",null,7535,"Sankt Michael im Burgenland","-14 °C"]
[57489,"Drolshagen","-12 °C",null,9411,"Sankt Michael im Lavanttal","-15 °C"]
[91238,"Drosberg","-16 °C",null,8770,"Sankt Michael in Obersteiermark","-14 °C"]
[52372,"Drove","-14 °C",null,4381,"Sankt Nikola an der Donau","-13 °C"]
[6722,"Droyßig","-14 °C",null,8505,"Sankt Nikolai im Sausal","-14 °C"]
[55585,"Duchroth","-12 °C",null,8422,"Sankt Nikolai ob Draßling","-13 °C"]
["L-3431","Dudelange (Luxemburg)","-14 °C",null,3684,"Sankt Oswald","-16 °C"]
[63654,"Düdelsheim","-12 °C",null,4271,"Sankt Oswald bei Freistadt","-16 °C"]
[63110,"Dudenhofen","-12 °C",null,8113,"Sankt Oswald bei Plankenwarth","-13 °C"]
[37115,"Duderstadt","-16 °C",null,8553,"Sankt Oswald ob Eibiswald","-14 °C"]
[66125,"Dudweiler / Saar","-12 °C",null,4572,"Sankt Pankraz","-14 °C"]
[74889,"Dühren","-12 °C",null,4303,"Sankt Pantaleon","-13 °C"]
[31089,"Duingen","-14 °C",null,5120,"Sankt Pantaleon","-15 °C"]
["47xxx","Duisburg","-10 °C",null,9470,"Sankt Paul im Lavanttal","-15 °C"]
[41751,"Dülken","-10 °C",null,4963,"Sankt Peter am Hart","-15 °C"]
[48249,"Dülmen","-12 °C",null,8843,"Sankt Peter am Kammersberg","-15 °C"]
[19073,"Dümmer","-12 °C",null,8093,"Sankt Peter am Ottersbach","-13 °C"]
[19073,"Dümmerhütte","-12 °C",null,4171,"Sankt Peter am Wimberg","-15 °C"]
[19073,"Dümmerstück-Hof","-12 °C",null,8542,"Sankt Peter im Sulmtal","-14 °C"]
[53520,"Dümpelfeld","-14 °C",null,3352,"Sankt Peter in der Au Markt","-14 °C"]
[77743,"Dundenheim","-12 °C",null,8755,"Sankt Peter ob Judenburg","-15 °C"]
[31226,"Dungelbeck","-14 °C",null,8792,"Sankt Peter-Freienstein","-14 °C"]
[56761,"Düngenheim","-14 °C",null,3100,"Sankt Pölten","-14 °C"]
[78655,"Dunningen","-16 °C",null,9123,"Sankt Primus","-16 °C"]
[74582,"Dünsbach","-16 °C",null,8061,"Sankt Radegund bei Graz","-14 °C"]
[27243,"Dünsen","-14 °C",null,4793,"Sankt Roman bei Schärding","-16 °C"]
[54597,"Duppach","-14 °C",null,8181,"Sankt Ruprecht an der Raab","-14 °C"]
[77770,"Durbach","-12 °C",null,9361,"Sankt Salvator","-15 °C"]
[78589,"Dürbheim","-18 °C",null,9623,"Sankt Stefan an der Gail","-16 °C"]
["523xx","Düren","-12 °C",null,9431,"Sankt Stefan im Lavanttal","-15 °C"]
[73568,"Durlangen","-16 °C",null,8083,"Sankt Stefan im Rosental","-13 °C"]
[88525,"Dürmentingen","-14 °C",null,8713,"Sankt Stefan ob Leoben","-14 °C"]
[76448,"Durmersheim","-12 °C",null,8511,"Sankt Stefan ob Stainz","-14 °C"]
[73105,"Dürnau","-16 °C",null,4732,"Sankt Thomas","-16 °C"]
[88422,"Dürnau","-14 °C",null,4364,"Sankt Thomas am Blasenstein","-16 °C"]
[72172,"Dürrenmettstetten","-16 °C",null,6393,"Sankt Ulrich am Pillersee","-18 °C"]
[72525,"Dürrenstetten (Münsingen)","-16 °C",null,4300,"Sankt Valentin","-14 °C"]
[8396,"Dürrenuhlsdorf","-14 °C",null,8423,"Sankt Veit am Vogau","-13 °C"]
[2708,"Dürrhennersdorf","-16 °C",null,9300,"Sankt Veit an der Glan","-16 °C"]
[89350,"Dürrlauingen","-16 °C",null,3161,"Sankt Veit an der Gölsen","-14 °C"]
[75248,"Dürrn","-14 °C",null,4173,"Sankt Veit im Mühlkreis","-15 °C"]
[1833,"Dürröhrsdorf","-14 °C",null,5621,"Sankt Veit im Pongau","-15 °C"]
[72285,"Durrweiler","-16 °C",null,9962,"Sankt Veit in Defereggen","-17 °C"]
[4668,"Dürrweitzschen","-14 °C",null,4762,"Sankt Willibald","-16 °C"]
[4720,"Dürrweitzschen","-14 °C",null,5360,"Sankt Wolfgang im Salzkammergut","-13 °C"]
[51515,"Dürscheid","-12 °C",null,4152,"Sarleinsbach","-14 °C"]
[29664,"Düshorn","-12 °C",null,4382,"Sarmingstein","-13 °C"]
["40xxx","Düsseldorf","-10 °C",null,6822,"Satteins","-14 °C"]
[72144,"Dußlingen","-16 °C",null,9520,"Sattendorf","-15 °C"]
[19205,"Dutzow","-12 °C",null,4642,"Sattledt","-14 °C"]
[39179,"Ebendorf","-14 °C",null,7202,"Sauerbrunn","-13 °C"]
[87640,"Ebenhofen","-16 °C",null,3374,"Säusenstein","-14 °C"]
[96250,"Ebensfeld","-16 °C",null,6432,"Sautens","-16 °C"]
[88370,"Ebenweiler","-14 °C",null,4351,"Saxen","-14 °C"]
[69412,"Eberbach a.N.","-12 °C",null,7472,"Schachendorf","-13 °C"]
[71735,"Eberdingen","-14 °C",null,8244,"Schäffern","-14 °C"]
[88436,"Eberhardzell","-16 °C",null,4784,"Schardenberg","-16 °C"]
[31079,"Eberholzen","-14 °C",null,4780,"Schärding","-15 °C"]
[91320,"Ebermannstadt","-16 °C",null,6108,"Scharnitz","-16 °C"]
[1561,"Ebersbach","-16 °C",null,4644,"Scharnstein","-15 °C"]
[2730,"Ebersbach","-16 °C",null,4612,"Scharten","-15 °C"]
[4720,"Ebersbach","-14 °C",null,7022,"Schattendorf","-13 °C"]
[88371,"Ebersbach","-14 °C",null,6351,"Scheffau am Wilden Kaiser","-18 °C"]
[73061,"Ebersbach an der Fils","-16 °C",null,3270,"Scheibbs","-15 °C"]
[85560,"Ebersberg","-16 °C",null,8811,"Scheifling","-15 °C"]
[8144,"Ebersbrunn","-14 °C",null,4192,"Schenkenfelden","-16 °C"]
[2708,"Ebersdorf","-16 °C",null,4521,"Schiedlberg","-14 °C"]
[27432,"Ebersdorf","-12 °C",null,9535,"Schiefling","-15 °C"]
["091xx","Ebersdorf","-14 °C",null,3553,"Schiltern","-14 °C"]
[72224,"Ebershardt","-16 °C",null,8970,"Schladming","-16 °C"]
[74246,"Eberstadt","-14 °C",null,2123,"Schleinbach","-14 °C"]
[74653,"Eberstal","-14 °C",null,4553,"Schlierbach","-14 °C"]
[16227,"Eberswalde","-14 °C",null,6824,"Schlins","-15 °C"]
[16225,"Eberswalde / Finow","-14 °C",null,6262,"Schlitters","-15 °C"]
[67280,"Ebertsheim","-12 °C",null,5212,"Schneegattern","-17 °C"]
[72224,"Ebhausen","-16 °C",null,6882,"Schnepfau","-18 °C"]
[72458,"Ebingen (Albstadt)","-18 °C",null,8844,"Schöder","-15 °C"]
[8626,"Ebmath","-18 °C",null,4274,"Schönau im Mühlkreis","-16 °C"]
[79117,"Ebnet","-16 °C",null,3633,"Schönbach","-17 °C"]
[73667,"Ebni-Kaiserbach","-16 °C",null,3562,"Schönberg","-13 °C"]
[79285,"Ebringen","-14 °C",null,6141,"Schönberg im Stubaital","-16 °C"]
[89423,"Echenbrunn","-16 °C",null,3392,"Schönbühel an der Donau","-13 °C"]
[82279,"Eching am Ammersee","-16 °C",null,2241,"Schönkirchen","-14 °C"]
[77731,"Eckartsweier","-12 °C",null,6491,"Schönwies","-14 °C"]
[90542,"Eckental","-16 °C",null,4861,"Schörfling","-16 °C"]
[72108,"Eckenweiler","-16 °C",null,2641,"Schottwien","-15 °C"]
[24340,"Eckernförde","-10 °C",null,2172,"Schrattenberg","-14 °C"]
[37339,"Ecklingerode","-16 °C",null,2073,"Schrattenthal","-14 °C"]
[14913,"Eckmannsdorf","-14 °C",null,3943,"Schrems","-17 °C"]
[99195,"Eckstedt","-14 °C",null,6888,"Schröcken","-16 °C"]
[97215,"Eckwarhofen","-16 °C",null,6780,"Schruns","-16 °C"]
[29575,"Eddelstorf","-12 °C",null,7081,"Schützen am Gebirge","-13 °C"]
[6388,"Edderitz","-14 °C",null,2432,"Schwadorf","-13 °C"]
[88453,"Edelbeuren","-16 °C",null,8541,"Schwanberg","-14 °C"]
[72285,"Edelweiler","-16 °C",null,5134,"Schwand im Innkreis","-15 °C"]
[31234,"Edemissen","-14 °C",null,4690,"Schwanenstadt","-15 °C"]
[88416,"Edenbachen","-16 °C",null,6858,"Schwarzach","-12 °C"]
[67480,"Edenkoben","-12 °C",null,5620,"Schwarzach im Pongau","-17 °C"]
[34295,"Edermünde","-14 °C",null,2625,"Schwarzau am Steinfelde","-14 °C"]
[26188,"Edewecht","-12 °C",null,2662,"Schwarzau im Gebirge","-15 °C"]
[26169,"Edewechterdamm/Friesoythe","-12 °C",null,3900,"Schwarzenau","-17 °C"]
[6420,"Edlau","-14 °C",null,2803,"Schwarzenbach","-14 °C"]
[83533,"Edling","-16 °C",null,3212,"Schwarzenbach an der Pielach","-14 °C"]
[41849,"Effeld","-10 °C",null,6867,"Schwarzenberg","-15 °C"]
[50354,"Efferen","-12 °C",null,4164,"Schwarzenberg im Mühlkreis","-15 °C"]
[72218,"Effringen","-16 °C",null,6130,"Schwaz","-15 °C"]
[79588,"Efringen-Kirchen","-12 °C",null,2320,"Schwechat","-13 °C"]
[88048,"Efrizweiler","-12 °C",null,3931,"Schweiggers","-17 °C"]
[39435,"Egeln","-14 °C",null,4311,"Schwertberg","-13 °C"]
[63329,"Egelsbach","-12 °C",null,8272,"Sebersdorf","-12 °C"]
[72227,"Egenhausen","-16 °C",null,8732,"Seckau","-14 °C"]
[91238,"Egensbach","-16 °C",null,6553,"See","-16 °C"]
[78592,"Egesheim","-18 °C",null,2824,"Seebenstein","-14 °C"]
[31848,"Egestorf a. Süntel","-14 °C",null,9871,"Seeboden","-14 °C"]
[84307,"Eggenfelden","-16 °C",null,2062,"Seefeld","-14 °C"]
[73479,"Eggenrot","-16 °C",null,6100,"Seefeld in Tirol","-17 °C"]
[76344,"Eggenstein","-12 °C",null,5164,"Seeham","-15 °C"]
[49577,"Eggermühlen","-12 °C",null,5201,"Seekirchen Markt","-15 °C"]
[79805,"Eggingen","-14 °C",null,4863,"Seewalchen am Attersee","-16 °C"]
[89079,"Eggingen","-14 °C",null,8636,"Seewiesen","-17 °C"]
[84385,"Egglham","-16 °C",null,2444,"Seibersdorf","-13 °C"]
[88410,"Eggmannsried","-16 °C",null,3353,"Seitenstetten Markt","-14 °C"]
[91330,"Eggolsheim","-16 °C",null,6181,"Sellrain","-16 °C"]
[83125,"Eggstätt","-16 °C",null,8900,"Selzthal","-16 °C"]
[94535,"Eging a. See","-18 °C",null,2680,"Semmering Kurort","-16 °C"]
[86492,"Egling a.d. Paar","-16 °C",null,8102,"Semriach","-15 °C"]
[89561,"Eglingen","-16 °C",null,3541,"Senftenberg","-13 °C"]
[71634,"Eglosheim","-12 °C",null,6534,"Serfaus","-17 °C"]
[79588,"Egringen","-12 °C",null,2631,"Sieding","-14 °C"]
[86676,"Ehekirchen","-16 °C",null,7011,"Siegendorf im Burgenland","-13 °C"]
[72534,"Ehestetten","-16 °C",null,7223,"Sieggraben","-14 °C"]
[89584,"Ehingen","-14 °C",null,3443,"Sieghartskirchen","-13 °C"]
[91725,"Ehingen","-16 °C",null,2011,"Sierndorf","-14 °C"]
[31303,"Ehlershausen","-14 °C",null,4522,"Sierning","-14 °C"]
[71139,"Ehningen","-16 °C",null,4771,"Sigharting","-15 °C"]
[4430,"Ehrenberg","-14 °C",null,7032,"Sigleß","-13 °C"]
[4603,"Ehrenberg","-14 °C",null,3751,"Sigmundsherberg","-15 °C"]
[27248,"Ehrenburg","-12 °C",null,9920,"Sillian","-17 °C"]
[79238,"Ehrenkirchen","-14 °C",null,6424,"Silz","-16 °C"]
[35630,"Ehringhausen","-12 °C",null,8261,"Sinabelkirchen","-14 °C"]
[35630,"Ehringshausen","-12 °C",null,4621,"Sipbachzell","-14 °C"]
[2739,"Eibau","-16 °C",null,9571,"Sirnitz","-16 °C"]
[35713,"Eibelshausen","-14 °C",null,6073,"Sistrans","-15 °C"]
[8309,"Eibenstock","-16 °C",null,2393,"Sittendorf bei Wien","-14 °C"]
[67575,"Eich","-12 °C",null,3714,"Sitzendorf an der Schmida","-14 °C"]
[4720,"Eichardt","-14 °C",null,8554,"Soboth","-15 °C"]
[76684,"Eichelberg","-12 °C",null,8362,"Söchau","-13 °C"]
[57632,"Eichen","-14 °C",null,8561,"Söding","-14 °C"]
[82223,"Eichenau","-16 °C",null,6060,"Solbad Hall in Tirol","-14 °C"]
[39167,"Eichenbarleben","-14 °C",null,6450,"Sölden","-18 °C"]
[94428,"Eichendorf","-16 °C",null,6306,"Söll","-17 °C"]
[36148,"Eichenried","-14 °C",null,2601,"Sollenau","-13 °C"]
[36124,"Eichenzell","-14 °C",null,2453,"Sommerein","-14 °C"]
[85464,"Eicherloh","-16 °C",null,6731,"Sonntag","-18 °C"]
[52152,"Eicherscheid","-14 °C",null,2244,"Spannberg","-14 °C"]
[79618,"Eichsel","-12 °C",null,8471,"Spielfeld","-13 °C"]
[85072,"Eichstätt","-16 °C",null,2104,"Spillern","-13 °C"]
[39596,"Eichstedt","-14 °C",null,4582,"Spital am Pyhrn","-15 °C"]
[79356,"Eichstetten","-12 °C",null,8684,"Spital am Semmering","-16 °C"]
[15732,"Eichwalde","-14 °C",null,9800,"Spittal an der Drau","-14 °C"]
[39221,"Eickendorf","-14 °C",null,3620,"Spitz","-13 °C"]
[35713,"Eiershausen","-14 °C",null,4651,"Stadl-Paura","-15 °C"]
[4838,"Eilenburg","-14 °C",null,7461,"Stadtschlaining","-13 °C"]
[38838,"Eilenstedt","-14 °C",null,8950,"Stainach","-16 °C"]
[31535,"Eilvese","-14 °C",null,8510,"Stainz","-14 °C"]
[31036,"Eime","-14 °C",null,9832,"Stall","-15 °C"]
[79591,"Eimeldingen","-12 °C",null,8152,"Stallhofen","-14 °C"]
[37632,"Eimen","-14 °C",null,6422,"Stams","-16 °C"]
[39943,"Eimersleben","-14 °C",null,6135,"Stans","-15 °C"]
[37574,"Einbeck","-16 °C",null,8653,"Stanz im Mürztal","-15 °C"]
[88356,"Einhart","-14 °C",null,6642,"Stanzach","-18 °C"]
[64683,"Einhausen","-12 °C",null,3125,"Statzendorf","-13 °C"]
[66424,"Einöd","-12 °C",null,4823,"Steeg","-14 °C"]
[85254,"Einsbach","-16 °C",null,6655,"Steeg","-17 °C"]
[89079,"Einsingen","-14 °C",null,7551,"Stegersbach","-12 °C"]
[27337,"Einste","-12 °C",null,8961,"Stein an der Enns","-15 °C"]
[83549,"Eiselfing","-16 °C",null,2751,"Steinabrückl","-14 °C"]
[99817,"Eisenach","-16 °C",null,6150,"Steinach","-15 °C"]
[87637,"Eisenberg","-18 °C",null,3261,"Steinakirchen am Forst","-14 °C"]
[88260,"Eisenharz","-16 °C",null,4853,"Steinbach am Attersee","-14 °C"]
[97247,"Eisenheim","-14 °C",null,4562,"Steinbach am Ziehberg","-15 °C"]
[15890,"Eisenhüttenstadt","-16 °C",null,7453,"Steinberg","-13 °C"]
[77815,"Eisental","-12 °C",null,7035,"Steinbrunn","-13 °C"]
[98673,"Eisfeld","-16 °C",null,9552,"Steindorf","-15 °C"]
[75239,"Eisingen","-14 °C",null,4652,"Steinerkirchen an der Traun","-14 °C"]
[86447,"Eisingersdorf","-16 °C",null,9754,"Steinfeld","-15 °C"]
[6295,"Eisleben","-14 °C",null,4641,"Steinhaus","-13 °C"]
[73054,"Eislingen","-16 °C",null,8685,"Steinhaus am Semmering","-16 °C"]
[56337,"Eitelborn","-12 °C",null,3463,"Stetteldorf am Wagram","-13 °C"]
[85117,"Eitensheim","-16 °C",null,4400,"Steyr","-14 °C"]
[53783,"Eitorf","-12 °C",null,4221,"Steyregg","-12 °C"]
[85462,"Eitting","-16 °C",null,4662,"Steyrermühl","-14 °C"]
[31035,"Eitzum","-14 °C",null,4571,"Steyrling","-14 °C"]
[38170,"Eitzum","-14 °C",null,2262,"Stillfried","-14 °C"]
[57482,"Elben","-14 °C",null,7552,"Stinatz","-12 °C"]
[39326,"Elbeu","-14 °C",null,2463,"Stixneusiedl","-14 °C"]
[4651,"Elbisbach","-14 °C",null,9714,"Stockenboi","-15 °C"]
[76477,"Elchesheim","-12 °C",null,2000,"Stockerau","-13 °C"]
[19294,"Eldena","-14 °C",null,3744,"Stockern","-15 °C"]
[77656,"Elgersweier","-12 °C",null,8852,"Stolzalpe Landesheilanstalt","-14 °C"]
[59955,"Elkeringhausen","-16 °C",null,7344,"Stoob","-13 °C"]
[85567,"Elkofen","-16 °C",null,3073,"Stössing","-14 °C"]
[8236,"Ellefeld","-16 °C",null,8345,"Straden","-13 °C"]
[73488,"Ellenberg","-16 °C",null,8192,"Strallegg","-16 °C"]
[40625,"Eller","-10 °C",null,3722,"Straning","-14 °C"]
[25479,"Ellerau","-12 °C",null,4881,"Straß im Attergau","-16 °C"]
[35110,"Ellershausen","-14 °C",null,3491,"Straß im Straßertale","-13 °C"]
[86679,"Ellgau","-16 °C",null,6261,"Strass im Zillertal","-15 °C"]
[91792,"Ellingen","-16 °C",null,8472,"Straß in Steiermark","-13 °C"]
[75210,"Ellmendingen","-14 °C",null,9341,"Straßburg","-15 °C"]
[99755,"Ellrich","-16 °C",null,2231,"Strasshof an der Nordbahn","-14 °C"]
[88430,"Ellwangen","-16 °C",null,5204,"Straßwalchen","-16 °C"]
[73479,"Ellwangen / Jagst","-16 °C",null,7522,"Strem","-14 °C"]
[89352,"Ellzee","-16 °C",null,3314,"Strengberg","-15 °C"]
[18107,"Elmenhorst","-10 °C",null,6571,"Strengen","-16 °C"]
[41372,"Elmpt","-10 °C",null,5350,"Strobl","-13 °C"]
["2533x","Elmshorn","-12 °C",null,4074,"Stroheim","-16 °C"]
[67471,"Elmstein","-12 °C",null,2153,"Stronsdorf","-14 °C"]
[35041,"Elnhausen","-14 °C",null,6762,"Stuben","-17 °C"]
[97990,"Elpersheim","-16 °C",null,8223,"Stubenberg","-13 °C"]
[50189,"Elsdorf / Rheinl.","-12 °C",null,8114,"Stübing","-14 °C"]
[33106,"Elsen","-12 °C",null,8322,"Studenzen","-13 °C"]
[63820,"Elsenfeld","-12 °C",null,5724,"Stuhlfelden","-18 °C"]
[75031,"Elsenz","-14 °C",null,4975,"Suben","-15 °C"]
[26931,"Elsfleth","-10 °C",null,6832,"Sulz","-13 °C"]
[57368,"Elspe","-14 °C",null,2392,"Sulz im Wienerwald","-14 °C"]
[6918,"Elster","-14 °C",null,6934,"Sulzberg","-16 °C"]
[4910,"Elsterwerda","-16 °C",null,7162,"Tadten","-14 °C"]
[1920,"Elstra","-16 °C",null,9121,"Tainach","-16 °C"]
[46446,"Elten","-10 °C",null,4753,"Taiskirchen im Innkreis","-15 °C"]
[97483,"Eltmann","-16 °C",null,6464,"Tarrenz","-17 °C"]
[37269,"Eltmannshausen","-14 °C",null,2523,"Tattendorf","-13 °C"]
[65346,"Eltville","-12 °C",null,7421,"Tauchen-Schaueregg","-14 °C"]
[31311,"Eltze","-14 °C",null,4775,"Taufkirchen an der Pram","-15 °C"]
[65604,"Elz (Westerwald)","-14 °C",null,4715,"Taufkirchen an der Trattnach","-15 °C"]
[79215,"Elzach","-16 °C",null,8982,"Tauplitz","-16 °C"]
[79215,"Elzach-Yach","-16 °C",null,5660,"Taxenbach","-17 °C"]
[31008,"Elze","-14 °C",null,9762,"Techendorf","-17 °C"]
[74834,"Elztal","-14 °C",null,2524,"Teesdorf","-13 °C"]
[21409,"Embsen","-12 °C",null,6165,"Telfes im Stubai","-16 °C"]
["2672x","Emden","-10 °C",null,6410,"Telfs","-15 °C"]
[88499,"Emeringen","-16 °C",null,5451,"Tenneck","-15 °C"]
[86494,"Emersacker","-16 °C",null,6123,"Terfens","-15 °C"]
[72535,"Emmabäuren","-18 °C",null,4452,"Ternberg","-14 °C"]
[56281,"Emmelshausen","-14 °C",null,2630,"Ternitz","-14 °C"]
[79312,"Emmendingen","-14 °C",null,8833,"Teufenbach","-15 °C"]
[46446,"Emmerich","-10 °C",null,3242,"Texing","-15 °C"]
[31180,"Emmerke","-14 °C",null,9911,"Thal-Assling","-16 °C"]
[31860,"Emmern","-12 °C",null,5303,"Thalgau","-15 °C"]
[31860,"Emmerthal","-12 °C",null,8754,"Thalheim","-15 °C"]
[69126,"Emmertsgrund","-12 °C",null,6065,"Thaur","-14 °C"]
[72202,"Emmingen","-16 °C",null,3842,"Thaya","-16 °C"]
[78576,"Emmingen-Liptingen","-16 °C",null,4062,"Thening","-14 °C"]
[30952,"Empelde","-14 °C",null,3742,"Theras","-15 °C"]
[72186,"Empfingen","-16 °C",null,2604,"Theresienfeld","-13 °C"]
[72186,"Empfingen-Dommelsberg","-16 °C",null,2832,"Thernberg","-14 °C"]
[48488,"Emsbüren","-10 °C",null,6335,"Thiersee","-17 °C"]
[48282,"Emsdetten","-12 °C",null,4905,"Thomasroith","-15 °C"]
[91448,"Emskirchen","-16 °C",null,8621,"Thörl","-15 °C"]
[95233,"Enchenreuth","-18 °C",null,9602,"Thörl-Maglern","-16 °C"]
[71384,"Endersbach","-14 °C",null,6712,"Thüringen","-15 °C"]
[79346,"Endingen","-12 °C",null,6721,"Thüringerberg","-18 °C"]
[6333,"Endorf","-14 °C",null,8355,"Tieschen","-13 °C"]
[30855,"Engelbostel","-14 °C",null,4850,"Timelkam","-16 °C"]
[8606,"Engelhartsgrün","-18 °C",null,8772,"Timmersdorf","-14 °C"]
[27305,"Engeln","-12 °C",null,8144,"Tobelbad","-14 °C"]
[56729,"Engeln","-14 °C",null,6541,"Tösens","-15 °C"]
[75331,"Engelsbrand","-14 °C",null,4183,"Traberg","-16 °C"]
[4439,"Engelsdorf","-14 °C",null,8612,"Tragöß","-15 °C"]
[51766,"Engelskirchen","-10 °C",null,4284,"Tragwein","-14 °C"]
[55270,"Engelstadt","-12 °C",null,3160,"Traisen","-14 °C"]
[91238,"Engelthal","-16 °C",null,2514,"Traiskirchen","-13 °C"]
[65527,"Engenhahn","-14 °C",null,3133,"Traismauer","-13 °C"]
[30938,"Engensen","-14 °C",null,2881,"Trattenbach","-15 °C"]
[32130,"Enger","-12 °C",null,4453,"Trattenbach","-14 °C"]
[4618,"Engertsdorf","-14 °C",null,4050,"Traun","-14 °C"]
[94530,"Engolling","-18 °C",null,4801,"Traunkirchen","-13 °C"]
[72829,"Engstingen","-18 °C",null,3632,"Traunstein","-17 °C"]
[72339,"Engstlatt","-16 °C",null,7061,"Trausdorf an der Wulka","-12 °C"]
[72800,"Eningen","-16 °C",null,8951,"Trautenfels","-15 °C"]
[58256,"Ennepetal","-12 °C",null,2454,"Trautmannsdorf an der Leitha","-14 °C"]
[57439,"Ennest","-14 °C",null,8343,"Trautmannsdorf in Oststeiermark","-13 °C"]
[88512,"Ennetach","-14 °C",null,9852,"Trebesing","-15 °C"]
[59320,"Ennigerloh","-12 °C",null,9521,"Treffen","-15 °C"]
[66806,"Ensdorf","-12 °C",null,8782,"Treglwang","-15 °C"]
[59469,"Ense","-12 °C",null,9330,"Treibach","-14 °C"]
[55232,"Ensheim","-12 °C",null,5272,"Treubach","-15 °C"]
[71665,"Ensingen","-14 °C",null,2512,"Tribuswinkel","-13 °C"]
[72119,"Entringen","-16 °C",null,8784,"Trieben","-15 °C"]
[75417,"Enzberg","-14 °C",null,6152,"Trins","-15 °C"]
[75337,"Enzklösterle","-16 °C",null,8793,"Trofaiach","-14 °C"]
[71665,"Enzweihingen","-14 °C",null,2521,"Trumau","-13 °C"]
[86920,"Epfach","-16 °C",null,6774,"Tschagguns","-16 °C"]
[74925,"Epfenbach","-12 °C",null,3434,"Tulbing","-13 °C"]
[78736,"Epfendorf","-16 °C",null,3430,"Tulln","-13 °C"]
[66571,"Eppelborn","-12 °C",null,3013,"Tullnerbach","-14 °C"]
[69214,"Eppelheim","-12 °C",null,8625,"Turnau","-16 °C"]
[66957,"Eppenbrunn","-12 °C",null,3184,"Türnitz","-14 °C"]
[9575,"Eppendorf","-16 °C",null,9441,"Twimberg","-14 °C"]
[94536,"Eppenschlag","-18 °C",null,8124,"Übelbach","-14 °C"]
[75031,"Eppingen","-14 °C",null,6271,"Uderns","-15 °C"]
[65817,"Eppstein","-14 °C",null,3363,"Ulmerfeld","-13 °C"]
[64711,"Erbach","-14 °C",null,4161,"Ulrichsberg","-15 °C"]
[65346,"Erbach","-12 °C",null,2122,"Ulrichskirchen","-14 °C"]
[89155,"Erbach","-14 °C",null,6441,"Umhausen","-16 °C"]
[65205,"Erbenheim","-12 °C",null,4841,"Ungenach","-16 °C"]
[21365,"Erbstorf","-12 °C",null,5091,"Unken","-15 °C"]
[32689,"Erder","-12 °C",null,4866,"Unterach","-14 °C"]
[85435,"Erding","-16 °C",null,9163,"Unterbergen im Rosental","-16 °C"]
[71729,"Erdmannhausen","-12 °C",null,4231,"Untergaisbach","-13 °C"]
[9573,"Erdmannsdorf","-14 °C",null,7435,"Unterkohlstätten","-14 °C"]
[85253,"Erdweg","-16 °C",null,8352,"Unterlamm","-13 °C"]
[86922,"Eresing","-16 °C",null,8141,"Unterpremstätten","-15 °C"]
[50374,"Erftstadt","-12 °C",null,7452,"Unterpullendorf","-13 °C"]
["990xx","Erfurt","-14 °C",null,8484,"Unterpurkla","-13 °C"]
[66996,"Erfweiler","-12 °C",null,7371,"Unterrabnitz","-13 °C"]
[72108,"Ergenzingen","-16 °C",null,2074,"Unterretzbach","-14 °C"]
[84030,"Ergolding","-16 °C",null,8294,"Unterrohr","-12 °C"]
[84061,"Ergoldsbach","-18 °C",null,2284,"Untersiebenbrunn","-14 °C"]
[58239,"Ergste","-12 °C",null,2154,"Unterstinkenbrunn","-14 °C"]
[88097,"Eriskirch","-12 °C",null,5561,"Untertauern","-18 °C"]
[41812,"Erkelenz","-10 °C",null,3011,"Untertullnerbach","-14 °C"]
[33034,"Erkeln","-14 °C",null,2442,"Unterwaltersdorf","-13 °C"]
[73268,"Erkenbrechtsweiler","-16 °C",null,4273,"Unterweißenbach","-16 °C"]
[15537,"Erkner","-14 °C",null,8800,"Unzmarkt","-15 °C"]
[40699,"Erkrath","-10 °C",null,2731,"Urschendorf","-14 °C"]
[97250,"Erlabrunn","-14 °C",null,5261,"Uttendorf","-15 °C"]
[77871,"Erlach","-12 °C",null,5723,"Uttendorf","-18 °C"]
["9105x","Erlangen","-16 °C",null,4972,"Utzenaich","-15 °C"]
[8265,"Erlbach","-18 °C",null,6773,"Vandans","-16 °C"]
[9326,"Erlbach","-14 °C",null,9220,"Velden am Wörthersee","-15 °C"]
[46348,"Erle","-10 °C",null,2245,"Velm-Götzendorf","-14 °C"]
[74235,"Erlenbach","-12 °C",null,4091,"Vichtenstein","-15 °C"]
[97837,"Erlenbach b.Marktheidenfeld","-12 °C",null,3322,"Viehdorf","-14 °C"]
[88416,"Erlenmoos","-16 °C",null,5752,"Viehofen","-18 °C"]
[63526,"Erlensee","-12 °C",null,9500,"Villach","-16 °C"]
[74391,"Erligheim","-12 °C",null,9972,"Virgen","-16 °C"]
[86405,"Erlingen","-16 °C",null,3902,"Vitis","-17 °C"]
[87487,"Ermengerst","-16 °C",null,4840,"Vöcklabruck","-15 °C"]
[89081,"Ermingen","-14 °C",null,4870,"Vöcklamarkt","-17 °C"]
[6463,"Ermsleben","-14 °C",null,8570,"Voitsberg","-14 °C"]
[85119,"Ernsgaden","-18 °C",null,6111,"Volders","-14 °C"]
[35099,"Ernsthausen","-14 °C",null,9100,"Völkermarkt","-16 °C"]
[75365,"Ernstmühl","-14 °C",null,6176,"Völs","-15 °C"]
[88453,"Erolzheim","-16 °C",null,6134,"Vomp","-15 °C"]
[72820,"Erpfingen","-18 °C",null,6130,"Vomperbach","-15 °C"]
[67167,"Erpolzheim","-12 °C",null,8250,"Vorau","-14 °C"]
[75236,"Ersingen","-14 °C",null,4655,"Vorchdorf","-14 °C"]
[89155,"Ersingen","-14 °C",null,9614,"Vorderberg","-15 °C"]
[88521,"Ertingen","-14 °C",null,8794,"Vordernberg","-15 °C"]
[59597,"Erwitte","-12 °C",null,4574,"Vorderstoder","-15 °C"]
[33039,"Erwitzen","-14 °C",null,4191,"Vorderweißenbach","-15 °C"]
[39343,"Erxleben","-14 °C",null,2331,"Vösendorf","-13 °C"]
[72297,"Erzgrube","-16 °C",null,8435,"Wagna","-14 °C"]
[72336,"Erzingen","-18 °C",null,5602,"Wagrain Markt","-17 °C"]
[54585,"Esch","-14 °C",null,3830,"Waidhofen an der Thaya","-16 °C"]
[73569,"Eschach","-16 °C",null,3340,"Waidhofen an der Ybbs","-14 °C"]
[61250,"Eschbach","-14 °C",null,6384,"Waidring","-17 °C"]
[79427,"Eschbach","-12 °C",null,4730,"Waizenkirchen","-16 °C"]
[65760,"Eschborn","-12 °C",null,6344,"Walchsee","-17 °C"]
[78664,"Eschbronn","-16 °C",null,3144,"Wald","-14 °C"]
[85283,"Eschelbach","-18 °C",null,8781,"Wald am Schoberpaß","-16 °C"]
[90542,"Eschenau","-16 °C",null,5742,"Wald im Pinzgau","-17 °C"]
[73107,"Eschenbach","-16 °C",null,8253,"Waldbach","-15 °C"]
[92676,"Eschenbach","-16 °C",null,2754,"Waldegg","-14 °C"]
[97483,"Eschenbach","-16 °C",null,3961,"Waldenstein","-17 °C"]
[99869,"Eschenberg","-14 °C",null,3914,"Waldhausen","-18 °C"]
[35713,"Eschenburg","-14 °C",null,4391,"Waldhausen im Strudengau","-15 °C"]
[92295,"Eschenfelden","-16 °C",null,4111,"Walding","-14 °C"]
[63679,"Eschenrod","-14 °C",null,3844,"Waldkirchen an der Thaya","-16 °C"]
[37632,"Eschershausen","-14 °C",null,4595,"Waldneukirchen","-14 °C"]
[93458,"Eschlkam","-18 °C",null,8122,"Waldstein","-14 °C"]
[53840,"Eschmar","-12 °C",null,4924,"Waldzell","-16 °C"]
[37269,"Eschwege","-14 °C",null,3752,"Walkenstein","-16 °C"]
[52249,"Eschweiler / Rheinl.","-12 °C",null,4702,"Wallern an der Trattnach","-15 °C"]
[88271,"Esenhausen","-14 °C",null,7151,"Wallern im Burgenland","-14 °C"]
[53804,"Esinghausen","-12 °C",null,3313,"Wallsee","-14 °C"]
[59889,"Eslohe","-14 °C",null,5071,"Wals","-15 °C"]
[32339,"Espelkamp","-12 °C",null,8271,"Waltersdorf in Oststeiermark","-12 °C"]
[65391,"Espenschied","-14 °C",null,2485,"Wampersdorf","-13 °C"]
[24887,"Esperstoft","-12 °C",null,3262,"Wang","-14 °C"]
[97839,"Esselbach","-14 °C",null,4552,"Wartberg an der Krems","-14 °C"]
[49632,"Essen","-12 °C",null,8661,"Wartberg im Mürztal","-15 °C"]
["45xxx","Essen","-10 °C",null,4224,"Wartberg ob der Aist","-14 °C"]
["45xxx","Essen - Burgaltenburg","-12 °C",null,2831,"Warth","-14 °C"]
[45239,"Essen - Fischlaken","-10 °C",null,6767,"Warth","-17 °C"]
[45239,"Essen - Heidhausen","-10 °C",null,8752,"Wasendorf","-15 °C"]
[45259,"Essen - Heisingen","-10 °C",null,6112,"Wattens","-15 °C"]
[45219,"Essen - Kettwig","-10 °C",null,4182,"Waxenberg","-16 °C"]
[45359,"Essen - Schönebeck","-10 °C",null,6133,"Weerberg","-16 °C"]
[45141,"Essen - Stoppenberg","-10 °C",null,8634,"Wegscheid","-16 °C"]
[45277,"Essen - Überruhr-Hinsel","-10 °C",null,4675,"Weibern","-15 °C"]
[45277,"Essen - Überruhr-Holthausen","-10 °C",null,8633,"Weichselboden","-16 °C"]
[45239,"Essen - Werden","-10 °C",null,7121,"Weiden am See","-13 °C"]
[84051,"Essenbach","-16 °C",null,7463,"Weiden bei Rechnitz","-13 °C"]
[55270,"Essenheim","-12 °C",null,2253,"Weikendorf","-14 °C"]
[73457,"Essingen","-16 °C",null,3823,"Weikertschlag an der Thaya","-16 °C"]
[97440,"Eßleben","-14 °C",null,4984,"Weilbach","-15 °C"]
[78532,"Eßlingen","-16 °C",null,5093,"Weißbach bei Lofer","-17 °C"]
["737xx","Esslingen am Neckar","-14 °C",null,9622,"Weißbriach","-15 °C"]
[97230,"Estenfeld","-14 °C",null,4854,"Weißenbach am Attersee","-14 °C"]
[26897,"Esterwegen","-12 °C",null,8932,"Weißenbach an der Enns","-14 °C"]
[31629,"Estorf","-12 °C",null,2564,"Weißenbach an der Triesting","-14 °C"]
[27299,"Etelsen","-12 °C",null,3610,"Weißenkirchen in der Wachau","-12 °C"]
[66871,"Etschberg","-12 °C",null,9721,"Weißenstein","-15 °C"]
[33178,"Etteln","-14 °C",null,4616,"Weißkirchen","-14 °C"]
[89358,"Ettenbeuren","-16 °C",null,8741,"Weißkirchen in Steiermark","-16 °C"]
[77955,"Ettenheim","-12 °C",null,3351,"Weistrach","-14 °C"]
[77955,"Ettenheimmünster","-14 °C",null,3653,"Weiten","-14 °C"]
[88048,"Ettenkirch","-14 °C",null,9344,"Weitensfeld","-17 °C"]
[82237,"Etterschlag","-16 °C",null,2084,"Weitersfeld","-15 °C"]
[86641,"Etting","-16 °C",null,4272,"Weitersfelden","-16 °C"]
[76275,"Ettlingen","-12 °C",null,3970,"Weitra","-17 °C"]
[76275,"Ettlingenweier","-12 °C",null,8160,"Weiz","-13 °C"]
[72226,"Ettmannsweiler","-16 °C",null,9162,"Weizelsdorf","-16 °C"]
[26446,"Etzel","-10 °C",null,4600,"Wels","-13 °C"]
[92268,"Etzelwang","-16 °C",null,4741,"Wendling","-15 °C"]
[76337,"Etzenrot","-14 °C",null,4952,"Weng im Innkreis","-15 °C"]
[9128,"Euba","-14 °C",null,8254,"Wenigzell","-16 °C"]
[74744,"Eubigheim","-16 °C",null,6473,"Wenns","-16 °C"]
[53879,"Euenheim","-14 °C",null,7331,"Weppersdorf","-13 °C"]
[4651,"Eulatal","-14 °C",null,5450,"Werfen","-16 °C"]
[1623,"Eulitz","-14 °C",null,5453,"Werfenweng","-17 °C"]
[3149,"Eulo","-16 °C",null,8402,"Werndorf","-14 °C"]
[null,"Eupen (Belgien)","-14 °C",null,4783,"Wernstein am Inn","-15 °C"]
[82547,"Eurasburg","-18 °C",null,4085,"Wesenufer","-15 °C"]
["538xx","Euskirchen","-12 °C",null,6363,"Westendorf","-18 °C"]
[97776,"Eussenheim","-16 °C",null,8521,"Wettmannstätten","-14 °C"]
[23701,"Eutin","-10 °C",null,3335,"Weyer Markt","-14 °C"]
[72184,"Eutingen","-16 °C",null,4852,"Weyregg am Attersee","-15 °C"]
[29379,"Eutzen","-14 °C",null,1090,"Wien","-13 °C"]
[83552,"Evenhausen","-16 °C",null,1226,"Wien-Breitenlee","-13 °C"]
[31085,"Everode","-16 °C",null,1200,"Wien-Brigittenau","-13 °C"]
[29303,"Eversen","-14 °C",null,1190,"Wien-Döbling","-13 °C"]
[18055,"Evershagen","-10 °C",null,1220,"Wien-Donaustadt","-13 °C"]
[48351,"Everswinkel","-12 °C",null,2351,"Wiener Neudorf","-13 °C"]
[32699,"Extertal","-14 °C",null,2700,"Wiener Neustadt","-13 °C"]
[72184,"Eyach","-16 °C",null,3223,"Wienerbruck","-15 °C"]
[73312,"Eybach","-16 °C",null,1228,"Wien-Eßling","-14 °C"]
[21376,"Eyendorf","-14 °C",null,1100,"Wien-Favoriten","-13 °C"]
[56133,"Fachbach","-12 °C",null,1210,"Wien-Floridsdorf","-13 °C"]
[73434,"Fachsenfeld","-16 °C",null,1147,"Wien-Hadersdorf","-13 °C"]
[23999,"Fährdorf","-10 °C",null,1170,"Wien-Hernals","-13 °C"]
[74864,"Fahrenbach","-14 °C",null,1130,"Wien-Hietzing","-13 °C"]
[14476,"Fahrland","-14 °C",null,1010,"Wien-Innere Stadt","-13 °C"]
[79868,"Falkau","-18 °C",null,1080,"Wien-Josefstadt","-13 °C"]
[4880,"Falkenberg","-16 °C",null,1113,"Wien-Kaiserebersdorf","-13 °C"]
[4895,"Falkenberg","-16 °C",null,1237,"Wien-Kalksburg","-14 °C"]
[34590,"Falkenberg","-14 °C",null,1030,"Wien-Landstraße","-13 °C"]
[39615,"Falkenberg","-14 °C",null,1020,"Wien-Leopoldstadt","-13 °C"]
[84326,"Falkenberg","-16 °C",null,1230,"Wien-Liesing","-13 °C"]
[1776,"Falkenhain","-16 °C",null,1050,"Wien-Margareten","-13 °C"]
[14612,"Falkensee","-14 °C",null,1060,"Wien-Mariahilf","-13 °C"]
[93167,"Falkenstein/Oberpf.","-18 °C",null,1120,"Wien-Meidling","-13 °C"]
[29683,"Fallingbostel","-12 °C",null,1070,"Wien-Neubau","-13 °C"]
[29328,"Faßberg","-14 °C",null,1192,"Wien-Neustift","-13 °C"]
[73035,"Faurndau","-16 °C",null,1195,"Wien-Nußdorf","-13 °C"]
[77855,"Fautenbach","-12 °C",null,1107,"Wien-Oberlaa","-13 °C"]
[78628,"Feckenheim","-18 °C",null,1160,"Wien-Ottakring","-13 °C"]
[64625,"Fehlheim","-12 °C",null,1140,"Wien-Penzing","-13 °C"]
[49733,"Fehndorf","-10 °C",null,1150,"Wien-Rudolfsheim-Fünfhaus","-13 °C"]
[3096,"Fehrow","-16 °C",null,1110,"Wien-Simmering","-13 °C"]
[36325,"Feldatal","-14 °C",null,1216,"Wien-Stammersdorf","-13 °C"]
[17258,"Feldberg","-14 °C",null,1227,"Wien-Süßenbrunn","-13 °C"]
[79868,"Feldberg / Schwarzwald","-18 °C",null,1180,"Wien-Währing","-13 °C"]
[61389,"Feldberg/Taunus","-16 °C",null,1040,"Wien-Wieden","-13 °C"]
[46244,"Feldhausen","-10 °C",null,8551,"Wies","-14 °C"]
[72501,"Feldhausen","-16 °C",null,3250,"Wieselburg","-14 °C"]
[79258,"Feldkirch","-12 °C",null,7203,"Wiesen","-13 °C"]
[85622,"Feldkirchen","-16 °C",null,2811,"Wiesmath","-15 °C"]
[83620,"Feldkirchen-Westerham","-18 °C",null,9374,"Wieting","-16 °C"]
[46483,"Feldmark","-18 °C",null,8924,"Wildalpen","-15 °C"]
[80995,"Feldmoching","-16 °C",null,9323,"Wildbad Einöd","-15 °C"]
[75334,"Feldrennach","-14 °C",null,4933,"Wildenau","-15 °C"]
[null,"Feldrum","-14 °C",null,2164,"Wildendürnbach","-14 °C"]
["7073x","Fellbach / Württ.","-12 °C",null,8410,"Wildon","-14 °C"]
[72181,"Felldorf","-16 °C",null,6313,"Wildschönau-Auffach","-18 °C"]
[87748,"Fellheim","-16 °C",null,6314,"Wildschönau-Niederau","-18 °C"]
[34587,"Felsberg","-14 °C",null,6311,"Wildschönau-Oberau","-18 °C"]
[92269,"Fensterbach","-16 °C",null,2193,"Wilfersdorf","-14 °C"]
[53577,"Fernthal","-14 °C",null,2462,"Wilfleinsdorf","-14 °C"]
[77654,"Fessenbach","-12 °C",null,3150,"Wilhelmsburg","-14 °C"]
[90537,"Feucht","-16 °C",null,4073,"Wilhering","-14 °C"]
[79400,"Feuerbach","-14 °C",null,2732,"Willendorf","-14 °C"]
["70xxx","Feuerbach","-12 °C",null,2632,"Wimpassing","-14 °C"]
[54584,"Feusdorf","-14 °C",null,7092,"Winden am See","-13 °C"]
[null,"Fichtelberg","-18 °C",null,4263,"Windhaag bei Freistadt","-16 °C"]
[95686,"Fichtelberg / Oberfr.","-16 °C",null,4322,"Windhaag bei Perg","-14 °C"]
[74579,"Fichtenau","-16 °C",null,3841,"Windigsteig","-17 °C"]
[4931,"Fichtenberg","-16 °C",null,4580,"Windischgarsten","-14 °C"]
[74427,"Fichtenberg","-16 °C",null,9841,"Winklern","-16 °C"]
[14547,"Fichtenwalde","-14 °C",null,2722,"Winzendorf","-14 °C"]
[94405,"Fichtheim","-18 °C",null,7412,"Wolfau","-12 °C"]
[70794,"Filderstadt","-14 °C",null,4493,"Wolfern","-14 °C"]
[89281,"Filzingen","-16 °C",null,3354,"Wolfsbach","-14 °C"]
[21129,"Finkenwerder/Hamburg","-12 °C",null,9400,"Wolfsberg","-15 °C"]
[57413,"Finnentrop","-14 °C",null,8421,"Wolfsberg im Schwarzautal","-13 °C"]
[86923,"Finning","-16 °C",null,4902,"Wolfsegg am Hausruck","-15 °C"]
[89435,"Finningen","-16 °C",null,3012,"Wolfsgraben","-14 °C"]
[89233,"Finningen ( Neu Ulm )","-14 °C",null,2412,"Wolfsthal","-14 °C"]
[16244,"Finowfurt","-14 °C",null,6922,"Wolfurt","-12 °C"]
[85464,"Finsing","-16 °C",null,2120,"Wolkersdorf","-14 °C"]
[3238,"Finsterwalde","-16 °C",null,2752,"Wöllersdorf","-14 °C"]
[65779,"Fischbach","-14 °C",null,6300,"Wörgl","-16 °C"]
[83730,"Fischbachau","-18 °C",null,8942,"Wörschach","-16 °C"]
[64405,"Fischbachtal","-14 °C",null,8293,"Wörth an der Lafnitz","-12 °C"]
[31840,"Fischbeck","-14 °C",null,7041,"Wulkaprodersdorf","-12 °C"]
[47807,"Fischeln","-10 °C",null,2041,"Wullersdorf","-14 °C"]
[50354,"Fischenich","-12 °C",null,2064,"Wulzeshofen","-14 °C"]
[77716,"Fischerbach","-14 °C",null,8142,"Wundschuh","-14 °C"]
[72172,"Fischingen","-16 °C",null,3042,"Würmla","-14 °C"]
[79592,"Fischingen","-12 °C",null,2112,"Würnitz","-14 °C"]
[91604,"Flachslanden","-16 °C",null,3370,"Ybbs an der Donau","-13 °C"]
[53879,"Flamersheim","-14 °C",null,3341,"Ybbsitz","-15 °C"]
[75038,"Flehingen","-14 °C",null,3683,"Yspertal","-15 °C"]
[74223,"Flein","-12 °C",null,6511,"Zams","-14 °C"]
[88373,"Fleischwangen","-14 °C",null,5584,"Zederhaus","-18 °C"]
[16306,"Flemsdorf","-16 °C",null,3311,"Zeillern","-13 °C"]
["249xx","Flensburg","-10 °C",null,3424,"Zeiselmauer","-13 °C"]
[38539,"Flettmar","-14 °C",null,4893,"Zell am Moos","-15 °C"]
[36103,"Flieden","-14 °C",null,5700,"Zell am See","-18 °C"]
[24220,"Flintbek","-10 °C",null,6280,"Zell am Ziller","-15 °C"]
[83126,"Flintsbach","-18 °C",null,4755,"Zell an der Pram","-15 °C"]
[98593,"Floh","-16 °C",null,2051,"Zellerndorf","-14 °C"]
[9557,"Flöha","-14 °C",null,8740,"Zeltweg","-16 °C"]
[98593,"Floh-Seligenthal","-16 °C",null,7023,"Zemendorf","-13 °C"]
[61197,"Florstadt","-12 °C",null,3710,"Ziersdorf","-13 °C"]
[4651,"Flößberg","-14 °C",null,7034,"Zillingtal","-13 °C"]
[92696,"Flossenbürg","-18 °C",null,5342,"Zinkenbach","-14 °C"]
[52499,"Floverich","-12 °C",null,4871,"Zipf","-17 °C"]
[78658,"Flözlingen","-16 °C",null,6170,"Zirl","-15 °C"]
[24787,"Fockbek","-12 °C",null,2094,"Zissersdorf","-16 °C"]
[37603,"Fohlenplacken","-14 °C",null,2225,"Zistersdorf","-14 °C"]
[31061,"Föhrste","-16 °C",null,9713,"Zlan","-15 °C"]
[68200,"Folgensbourg / Frankreich","-12 °C",null,2871,"Zöbern","-14 °C"]
[76596,"Forbach","-16 °C",null,3561,"Zöbing","-13 °C"]
[79362,"Forchheim / Breisgau","-12 °C",null,2424,"Zurndorf","-13 °C"]
[9509,"Forchheim / Erzgebirge","-16 °C",null,9343,"Zweinitz","-16 °C"]
[91301,"Forchheim / Oberfr.","-16 °C",null,3435,"Zwentendorf an der Donau","-13 °C"]
[71540,"Fornsbach","-16 °C",null,4180,"Zwettl an der Rodl","-15 °C"]
[76694,"Forst","-12 °C",null,3910,"Zwettl Stadt","-17 °C"]
[3149,"Forst/Lausitz","-16 °C",null,2063,"Zwingendorf","-14 °C"]
[81476,"Forstenried","-16 °C"]
[85659,"Forstern","-16 °C"]
[4668,"Förstgen","-14 °C"]
[94550,"Forsthart","-18 °C"]
[85661,"Forstinning","-16 °C"]
[90542,"Forth","-16 °C"]
[17091,"Fouquettin","-14 °C"]
[97833,"Frammersbach","-14 °C"]
[35110,"Frankenau","-14 °C"]
[9669,"Frankenberg","-16 °C"]
[35066,"Frankenberg","-14 °C"]
[93179,"Frankenberg","-18 °C"]
[15926,"Frankendorf","-16 °C"]
[99441,"Frankendorf","-14 °C"]
[4430,"Frankenheim","-14 °C"]
[98634,"Frankenheim","-16 °C"]
[89584,"Frankenhofen","-16 °C"]
[92726,"Frankenreuth","-18 °C"]
[67227,"Frankenthal / Pfalz","-12 °C"]
["60xxx","Frankfurt / Main","-12 °C"]
["1523x","Frankfurt / Oder","-16 °C"]
[65934,"Frankfurt-Nied","-12 °C"]
[94258,"Frauenau","-18 °C"]
[91056,"Frauenaurach","-16 °C"]
[93339,"Frauenberghausen","-16 °C"]
[4643,"Frauendorf","-14 °C"]
[1609,"Frauenhain","-16 °C"]
[83553,"Frauenneuharting","-16 °C"]
[9623,"Frauenstein","-16 °C"]
[98711,"Frauenwald","-16 °C"]
[8427,"Fraureuth","-16 °C"]
[50226,"Frechen","-10 °C"]
[39317,"Frechland","-14 °C"]
[48231,"Freckenhorst","-12 °C"]
[31084,"Freden","-16 °C"]
[15370,"Fredersdorf b.Berlin","-14 °C"]
[17440,"Freest","-12 °C"]
[79348,"Freiamt","-14 °C"]
[9599,"Freiberg","-16 °C"]
[71691,"Freiberg","-12 °C"]
["79xxx","Freiburg i. Br.","-12 °C"]
[16515,"Freienhagen","-14 °C"]
[59872,"Freienohl","-14 °C"]
[35321,"Freienseen","-14 °C"]
[36399,"Freiensteinau","-14 °C"]
[24991,"Freienwill","-10 °C"]
[63579,"Freigericht","-12 °C"]
[55234,"Freimersheim","-12 °C"]
[66629,"Freisen","-14 °C"]
[53505,"Freisheim","-14 °C"]
["8535x","Freising","-16 °C"]
[27259,"Freistatt","-12 °C"]
[77866,"Freistett","-12 °C"]
[1705,"Freital","-14 °C"]
[45127,"Freital","-14 °C"]
[15910,"Freiwalde","-16 °C"]
[4685,"Fremdiswalde","-14 °C"]
[96158,"Frensdorf","-16 °C"]
[57413,"Fretter","-14 °C"]
[57258,"Freudenberg","-12 °C"]
[92272,"Freudenberg","-16 °C"]
[97896,"Freudenberg","-14 °C"]
[72250,"Freudenstadt","-16 °C"]
[75438,"Freudenstein","-14 °C"]
[74392,"Freudental","-12 °C"]
[72419,"Freudenweiler","-18 °C"]
[92342,"Freystadt","-16 °C"]
[94078,"Freyung","-18 °C"]
[72636,"Frickenhausen","-16 °C"]
[97252,"Frickenhausen","-14 °C"]
[88699,"Frickingen","-14 °C"]
[78567,"Fridingen","-16 °C"]
[78567,"Fridingen an der Donau","-16 °C"]
[61169,"Friedberg","-12 °C"]
[86316,"Friedberg","-16 °C"]
[95688,"Friedenfels","-18 °C"]
[79877,"Friedenweiler","-18 °C"]
[24327,"Friederikental","-10 °C"]
[2829,"Friedersdorf","-16 °C"]
[15306,"Friedersdorf","-14 °C"]
[15754,"Friedersdorf","-14 °C"]
[32469,"Friedewalde","-12 °C"]
[78224,"Friedingen","-14 °C"]
[15848,"Friedland","-16 °C"]
[17098,"Friedland","-14 °C"]
[37133,"Friedland","-16 °C"]
[6507,"Friedrichsbrunn","-16 °C"]
[8149,"Friedrichsgrün","-14 °C"]
["8804x","Friedrichshafen","-12 °C"]
[15754,"Friedrichshof","-14 °C"]
[85049,"Friedrichshofen","-16 °C"]
[74639,"Friedrichsruhe","-14 °C"]
[56112,"Friedrichssegen","-12 °C"]
[16306,"Friedrichsthal","-14 °C"]
[16247,"Friedrichswalde","-14 °C"]
[30826,"Frielingen (Garbsen 8)","-14 °C"]
[51789,"Frielingsdorf","-12 °C"]
[null,"Friesdorf Post Bad Godesberg","-10 °C"]
[96317,"Friesen","-16 °C"]
[51598,"Friesenhagen","-12 °C"]
[77948,"Friesenheim","-12 °C"]
[93092,"Friesheim","-18 °C"]
[26169,"Friesoythe","-12 °C"]
[71292,"Friolzheim","-16 °C"]
[53343,"Fritzdorf","-14 °C"]
[90542,"Frohnhof","-16 °C"]
[92256,"Frohnhof","-16 °C"]
[72510,"Frohnstetten","-16 °C"]
[58730,"Fröndenberg","-12 °C"]
[86657,"Fronhofen","-16 °C"]
[88273,"Fronhofen","-14 °C"]
[88273,"Fronreute","-14 °C"]
[84160,"Frontenhausen","-16 °C"]
[6464,"Frose","-14 °C"]
[85646,"Frotzhofen","-16 °C"]
[86925,"Fuchstal-Leeder","-16 °C"]
[50769,"Fühlingen","-10 °C"]
[30938,"Fuhrberg","-12 °C"]
["360xx","Fulda","-14 °C"]
[34277,"Fuldabrück","-14 °C"]
[88348,"Fulgenstadt","-14 °C"]
[38304,"Fümmelse","-14 °C"]
[88436,"Füramoos","-16 °C"]
[55546,"Fürfeld","-12 °C"]
[74906,"Fürfeld","-14 °C"]
[92262,"Fürnried","-16 °C"]
[37671,"Fürstenau","-14 °C"]
[49584,"Fürstenau","-12 °C"]
[33181,"Fürstenberg","-14 °C"]
[37699,"Fürstenberg","-14 °C"]
[16798,"Fürstenberg Havel","-14 °C"]
[82256,"Fürstenfeldbruck","-16 °C"]
[17235,"Fürstensee","-14 °C"]
[94538,"Fürstenstein","-18 °C"]
[15517,"Fürstenwalde / Spree","-14 °C"]
[17291,"Fürstenwerder","-14 °C"]
[94081,"Fürstenzell","-16 °C"]
[3246,"Fürstlich Drehna","-16 °C"]
[84095,"Furth","-16 °C"]
["9076x","Fürth / Bay.","-16 °C"]
[93437,"Furth im Wald","-18 °C"]
[77723,"Fußbach","-14 °C"]
[53909,"Füssenich","-14 °C"]
[67136,"Fussgönheim","-12 °C"]
[24327,"Futterkamp","-10 °C"]
[2953,"Gablenz","-16 °C"]
[86456,"Gablingen","-16 °C"]
[55288,"Gabsheim","-12 °C"]
[82813,"Gächingen","-18 °C"]
[56412,"Gackenbach","-12 °C"]
[19089,"Gädebehn","-12 °C"]
[19205,"Gadebusch","-12 °C"]
[31246,"Gadenstedt","-14 °C"]
[64686,"Gadernheim","-14 °C"]
[4720,"Gadewitz","-14 °C"]
[23968,"Gägelow","-10 °C"]
[76571,"Gaggenau","-14 °C"]
[74592,"Gaggstatt","-16 °C"]
[9569,"Gahlenz","-16 °C"]
[4618,"Gähsnitz","-14 °C"]
[69251,"Gaiberg","-12 °C"]
[78343,"Gaienhofen","-12 °C"]
[63743,"Gailbach (Aschaffenburg)","-12 °C"]
[74405,"Gaildorf","-16 °C"]
[74523,"Gailenkirchen","-16 °C"]
[30891,"Gailhof","-14 °C"]
[78262,"Gailingen","-12 °C"]
[85080,"Gaimersheim","-16 °C"]
[74653,"Gaisbach","-12 °C"]
[88339,"Gaisbeuren","-16 °C"]
[83674,"Gaißach","-18 °C"]
[92539,"Gaisthal","-18 °C"]
[79423,"Gallenweiler","-14 °C"]
[3058,"Gallinchen (Cottbus)","-16 °C"]
[4720,"Gallschütz","-14 °C"]
[19230,"Gammelin","-12 °C"]
[85408,"Gammelsdorf","-16 °C"]
[73108,"Gammelshausen","-16 °C"]
[72501,"Gammertingen","-16 °C"]
[74572,"Gammesfeld","-16 °C"]
[77855,"Gamshurst","-12 °C"]
[99192,"Gamstädt","-14 °C"]
[19309,"Gandow","-14 °C"]
[52538,"Gangelt","-10 °C"]
[84140,"Gangkofen","-16 °C"]
[18276,"Ganschow","-12 °C"]
[19205,"Ganzow","-12 °C"]
[30826,"Garbsen","-14 °C"]
[4618,"Garbus","-14 °C"]
[84518,"Garching","-16 °C"]
[39638,"Gardelegen","-14 °C"]
[27711,"Garlstedt","-12 °C"]
[92245,"Gärmersdorf","-16 °C"]
[82467,"Garmisch-Partenkirchen","-18 °C"]
[6571,"Garnbach","-14 °C"]
[9238,"Garnsdorf","-14 °C"]
[49681,"Garrel","-12 °C"]
[71116,"Gärtringen","-16 °C"]
[16307,"Gartz","-14 °C"]
[6466,"Gatersleben","-14 °C"]
[14089,"Gatow","-14 °C"]
[95185,"Gattendorf","-18 °C"]
[69181,"Gauangelloch","-12 °C"]
[55296,"Gau-Bischofsheim","-12 °C"]
[4769,"Gaudlitz","-14 °C"]
[71126,"Gäufelden","-16 °C"]
[97285,"Gaukönigshofen","-14 °C"]
[72393,"Gauselfingen","-18 °C"]
[82131,"Gauting","-16 °C"]
[86444,"Gebenhofen","-16 °C"]
[71229,"Gebersheim","-14 °C"]
[99189,"Gebesee","-14 °C"]
[88299,"Gebrazhofen","-16 °C"]
[91607,"Gebsattel","-16 °C"]
[75391,"Gechingen","-16 °C"]
[21502,"Geesthacht","-12 °C"]
[17375,"Gegensee","-12 °C"]
[32312,"Gehlenbeck","-12 °C"]
[26169,"Gehlenberg","-12 °C"]
[49596,"Gehrde","-12 °C"]
[30989,"Gehrden","-14 °C"]
[33034,"Gehrden","-14 °C"]
[73642,"Gehren","-16 °C"]
[98708,"Gehren","-16 °C"]
[53909,"Geich","-14 °C"]
[52511,"Geilenkirchen","-12 °C"]
[56379,"Geilnau","-12 °C"]
[8538,"Geilsdorf","-18 °C"]
[58239,"Geisecke","-12 °C"]
[82140,"Geiselbullach","-16 °C"]
[84144,"Geisenhausen","-16 °C"]
[65366,"Geisenheim","-12 °C"]
[1778,"Geising","-16 °C"]
[78187,"Geisingen","-16 °C"]
[72351,"Geislingen","-16 °C"]
[73312,"Geislingen / Steige","-16 °C"]
[4643,"Geithain","-14 °C"]
[18182,"Gelbensande","-10 °C"]
[97255,"Gelchsheim","-16 °C"]
[47608,"Geldern","-10 °C"]
[97505,"Geldersheim","-16 °C"]
[63571,"Gelnhausen","-12 °C"]
[63571,"Gelnhausen-Hailer","-14 °C"]
["458xx","Gelsenkirchen","-10 °C"]
[45889,"Gelsenkirchen-Bismarck","-10 °C"]
[45857,"Gelsenkirchen-Buer","-10 °C"]
[45883,"Gelsenkirchen-Heßler","-10 °C"]
[45881,"Gelsenkirchen-Schalke-Nord","-10 °C"]
[45897,"Gelsenkirchen-Scheffrath","-10 °C"]
[82269,"Geltendorf","-16 °C"]
[1877,"Gemitz - Thumitz","-16 °C"]
[75050,"Gemmingen","-14 °C"]
[74376,"Gemmrigheim","-12 °C"]
[74376,"Gemmringheim","-12 °C"]
[35329,"Gemünden","-14 °C"]
[55490,"Gemünden","-14 °C"]
[97737,"Gemünden a. Main","-14 °C"]
[86682,"Genderkingen","-16 °C"]
[77723,"Gengenbach","-12 °C"]
[72820,"Genkingen","-18 °C"]
[86853,"Gennach","-16 °C"]
[55457,"Gensingen","-12 °C"]
[39307,"Genthin","-14 °C"]
[65388,"Georgenborn","-14 °C"]
[91166,"Georgensgmünd","-16 °C"]
["075xx","Gera","-14 °C"]
[98716,"Geraberg","-16 °C"]
[74582,"Gerabronn","-16 °C"]
[37318,"Gerbershausen","-16 °C"]
[41812,"Gerderath","-10 °C"]
[null,"Geretsberg / Österreich","-18 °C"]
[86947,"Geretshausen","-16 °C"]
[82538,"Geretsried","-16 °C"]
[4827,"Gerichshain","-14 °C"]
[97950,"Gerichsheim","-14 °C"]
[74736,"Gerichtstetten","-16 °C"]
[56751,"Gering","-14 °C"]
[9326,"Geringswalde","-14 °C"]
[97922,"Gerlachsheim (Lauda-Königshofen, Baden )","-14 °C"]
[89223,"Gerlenhofen","-16 °C"]
[57482,"Gerlingen","-14 °C"]
[70839,"Gerlingen","-14 °C"]
[94051,"Germannsdorf","-18 °C"]
[82110,"Germering","-16 °C"]
[37339,"Gernrode","-16 °C"]
[76593,"Gernsbach","-14 °C"]
[64579,"Gernsheim","-12 °C"]
[97779,"Geroda","-16 °C"]
[37345,"Gerode","-16 °C"]
[97447,"Gerolzhofen","-16 °C"]
[1920,"Gersdorf","-16 °C"]
[2829,"Gersdorf","-16 °C"]
[9355,"Gersdorf","-14 °C"]
[9661,"Gersdorf","-14 °C"]
[36129,"Gersfeld","-16 °C"]
[66453,"Gersheim","-14 °C"]
[4617,"Gerstenberg","-14 °C"]
[89547,"Gerstetten","-16 °C"]
[86368,"Gersthofen","-16 °C"]
[99834,"Gerstungen","-16 °C"]
[17268,"Gerswalde","-14 °C"]
[48712,"Gescher","-10 °C"]
[79674,"Geschwend","-16 °C"]
[28857,"Gessel","-12 °C"]
[4552,"Gestewitz","-14 °C"]
[58285,"Gevelsberg","-12 °C"]
[9456,"Geyersdorf","-16 °C"]
[37434,"Gieboldehausen","-16 °C"]
[89537,"Giengen a.d. Brenz","-16 °C"]
[41363,"Gierath","-10 °C"]
[65558,"Giershausen","-14 °C"]
[99100,"Gierstädt","-14 °C"]
["353xx","Gießen","-12 °C"]
[38518,"Gifhorn","-14 °C"]
[82205,"Gilching","-16 °C"]
[54558,"Gillenfeld","-14 °C"]
[52511,"Gillrath","-12 °C"]
[34630,"Gilserberg","-14 °C"]
[29690,"Gilten","-12 °C"]
[48268,"Gimbte","-12 °C"]
[55767,"Gimbweiler","-14 °C"]
[67435,"Gimmeldingen","-12 °C"]
[53343,"Gimmersdorf","-14 °C"]
[73333,"Gingen","-16 °C"]
[54584,"Glaadt","-14 °C"]
["4596x","Gladbeck / Westf.","-10 °C"]
[37181,"Gladebeck","-16 °C"]
[66887,"Glanbrücken","-14 °C"]
[49219,"Glandorf","-12 °C"]
[74731,"Glashofen","-14 °C"]
[1768,"Glashütte","-14 °C"]
[31195,"Glashütte","-16 °C"]
[61479,"Glashütten/Taunus","-14 °C"]
[72172,"Glatt","-16 °C"]
[72293,"Glatten","-16 °C"]
[8371,"Glauchau","-14 °C"]
[56653,"Glees","-14 °C"]
[41352,"Glehn","-10 °C"]
[37130,"Gleichen","-16 °C"]
[93339,"Gleislhof","-16 °C"]
[93477,"Gleißenberg","-18 °C"]
[72555,"Glems","-16 °C"]
[4435,"Glesien","-14 °C"]
[4509,"Glesien","-14 °C"]
[50129,"Glessen","-12 °C"]
[19306,"Glewe","-14 °C"]
[15806,"Glienick","-14 °C"]
[16548,"Glienicke","-14 °C"]
[21509,"Glinde","-12 °C"]
[39248,"Glinde","-14 °C"]
[39326,"Glindenberg","-14 °C"]
[56588,"Glockscheid","-12 °C"]
[4769,"Glossen","-14 °C"]
[79286,"Glottertal","-14 °C"]
[18551,"Glowe","-10 °C"]
[25348,"Glückstadt","-10 °C"]
[27442,"Gnarrenburg","-12 °C"]
[2692,"Gnaschwitz","-16 °C"]
[19065,"Gneven","-12 °C"]
[7616,"Gniebsdorf","-14 °C"]
[24622,"Gnutz","-12 °C"]
[47574,"Goch","-10 °C"]
[97469,"Gochsheim","-14 °C"]
[2633,"Göda","-16 °C"]
[37671,"Godelheim","-14 °C"]
[31061,"Godenau","-14 °C"]
[54310,"Godendorf","-12 °C"]
[19065,"Godern","-12 °C"]
[39264,"Gödnitz","-14 °C"]
[31157,"Gödringen","-14 °C"]
[88527,"Göffingen","-14 °C"]
[72505,"Göggingen","-14 °C"]
[73571,"Göggingen","-16 °C"]
[86199,"Göggingen","-16 °C"]
[4420,"Göhrenz","-14 °C"]
[1824,"Gohrisch","-14 °C"]
[1824,"Gohrisch","-16 °C"]
[85399,"Goldach","-16 °C"]
[39596,"Goldbeck","-14 °C"]
[4720,"Göldnitz","-14 °C"]
[6567,"Göllingen","-14 °C"]
[86657,"Göllingen","-16 °C"]
[4509,"Gollmenz","-14 °C"]
[17291,"Gollmitz","-14 °C"]
[37640,"Golmbach","-14 °C"]
[7751,"Golmsdorf","-14 °C"]
[14913,"Gölsdorf","-14 °C"]
[75015,"Gölshausen","-12 °C"]
[6785,"Goltewitz","-14 °C"]
[4668,"Golzern","-14 °C"]
[52399,"Golzheim","-12 °C"]
[72532,"Gomadingen","-18 °C"]
[72810,"Gomaringen","-16 °C"]
[39245,"Gommern","-14 °C"]
[14822,"Gömnigk","-14 °C"]
[75053,"Gondelsheim","-12 °C"]
[54584,"Gönnersdorf","-14 °C"]
[72770,"Gönningen","-16 °C"]
[35315,"Gontershausen","-14 °C"]
["7303x","Göppingen","-14 °C"]
[73035,"Göppingen-Bezgenriet","-16 °C"]
[73037,"Göppingen-Hohenstaufen","-16 °C"]
[73037,"Göppingen-Holzheim","-16 °C"]
[73037,"Göppingen-Maitis","-16 °C"]
[17291,"Göritz","-14 °C"]
[1809,"Gorknitz","-14 °C"]
["0282x","Görlitz","-16 °C"]
[17121,"Görmin","-12 °C"]
[9405,"Gornau","-16 °C"]
[4703,"Gorschmitz","-14 °C"]
[6577,"Gorsleben","-14 °C"]
[79733,"Görwihl","-14 °C"]
[73342,"Gosbach","-18 °C"]
[4720,"Goselitz","-14 °C"]
[78559,"Gosheim","-18 °C"]
["3864x","Goslar","-14 °C"]
[8427,"Gospersgrün","-16 °C"]
[19249,"Gößlow","-12 °C"]
[4639,"Gößnitz","-14 °C"]
[91327,"Gössweinstein","-16 °C"]
[4838,"Gotha","-14 °C"]
[99867,"Gotha","-14 °C"]
[72297,"Göttelfingen","-16 °C"]
[79288,"Gottenheim","-12 °C"]
[19209,"Gottesgabe","-12 °C"]
[94239,"Gotteszell","-18 °C"]
[84177,"Gottfrieding","-18 °C"]
["3707x","Göttingen","-16 °C"]
[84166,"Göttlkofen","-16 °C"]
[78244,"Gottmadingen","-12 °C"]
[94107,"Gottsdorf","-18 °C"]
[14778,"Götz","-14 °C"]
[18181,"Graal-Müritz","-10 °C"]
[71577,"Grab","-16 °C"]
[76676,"Graben Neudorf","-12 °C"]
[72582,"Grabenstetten","-16 °C"]
[14823,"Grabow","-14 °C"]
[19300,"Grabow","-14 °C"]
[4886,"Graditz","-16 °C"]
[49626,"Grafeld","-12 °C"]
[31079,"Grafelde","-16 °C"]
[82166,"Gräfelfing","-16 °C"]
[71120,"Grafenau","-16 °C"]
[94481,"Grafenau","-18 °C"]
[72661,"Grafenberg","-16 °C"]
[91322,"Gräfenberg","-16 °C"]
[4916,"Gräfendorf","-16 °C"]
[72532,"Grafeneck an der Lauter","-18 °C"]
[6773,"Gräfenhainichen","-14 °C"]
[77966,"Grafenhausen","-12 °C"]
[77966,"Grafenhausen","-12 °C"]
[79865,"Grafenhausen","-16 °C"]
[75217,"Gräfenhausen","-14 °C"]
[99330,"Gräfenroda","-16 °C"]
[93479,"Grafenwiesen","-18 °C"]
[92655,"Grafenwöhr","-16 °C"]
[89264,"Grafertshofen","-16 °C"]
[85567,"Grafing","-16 °C"]
[82284,"Grafrath","-16 °C"]
[53501,"Grafschaft","-14 °C"]
[82491,"Grainau","-18 °C"]
[83122,"Grainbach","-18 °C"]
[17375,"Grambin","-12 °C"]
[17375,"Grambin-Zeltplatz","-12 °C"]
[23968,"Gramkow","-10 °C"]
[17291,"Gramzow","-14 °C"]
[89584,"Granheim","-16 °C"]
[41812,"Granterath","-12 °C"]
[28879,"Grasberg","-12 °C"]
[31188,"Grasdorf","-14 °C"]
[64689,"Grasellenbach","-14 °C"]
[39579,"Grassau","-14 °C"]
[94541,"Grattersdorf","-18 °C"]
[1796,"Graupa","-14 °C"]
[1827,"Graupa","-14 °C"]
[37647,"Grave","-12 °C"]
[61279,"Grävenwiesbach","-14 °C"]
[17419,"Graz","-12 °C"]
[19374,"Grebbin","-14 °C"]
[4509,"Grebehna","-14 °C"]
[37276,"Grebendorf","-16 °C"]
[34393,"Grebenstein","-14 °C"]
[91171,"Greding","-16 °C"]
[77836,"Greffern","-12 °C"]
[86926,"Greifenberg","-16 °C"]
[9661,"Greifendorf","-14 °C"]
[3116,"Greifenhain","-16 °C"]
[35753,"Greifenstein","-14 °C"]
["174xx","Greifswald","-12 °C"]
[87755,"Greimeltshofen","-16 °C"]
["L-8363","Greisch (Luxemburg)","-14 °C"]
[7973,"Greiz","-16 °C"]
[24975,"Gremmerup","-10 °C"]
[79639,"Grenzach - Wyhlen","-12 °C"]
[48268,"Greven / Westf.","-12 °C"]
["4151x","Grevenbroich","-10 °C"]
[23936,"Grevesmühlen","-10 °C"]
[79206,"Grezhausen","-12 °C"]
[18516,"Griebenow","-12 °C"]
[77740,"Griesbach","-16 °C"]
[94086,"Griesbach","-16 °C"]
[6786,"Griesen","-14 °C"]
[64347,"Griesheim","-12 °C"]
[77652,"Griesheim","-12 °C"]
[89608,"Griesingen","-14 °C"]
[9112,"Griffen / Österreich","-18 °C"]
[4668,"Grimma","-14 °C"]
[18507,"Grimmen","-12 °C"]
[79395,"Grißheim","-12 °C"]
[17498,"Gristow","-12 °C"]
[8538,"Grobau","-16 °C"]
[82194,"Gröbenzell","-16 °C"]
[6184,"Gröbers","-14 °C"]
[1609,"Gröditz","-16 °C"]
[2627,"Gröditz","-16 °C"]
[88456,"Grodt","-16 °C"]
[31860,"Grohnde","-12 °C"]
[4539,"Groitzsch","-14 °C"]
[4838,"Groitzsch","-14 °C"]
[74906,"Grombach","-12 °C"]
[72294,"Grömbach","-16 °C"]
[31028,"Gronau","-14 °C"]
[71720,"Gronau","-14 °C"]
[48599,"Gronau / Westf.","-10 °C"]
[39397,"Gröningen","-14 °C"]
[95701,"Groschlattengrün","-18 °C"]
[19258,"Groß Bengerstorf","-12 °C"]
[31855,"Groß Berkel","-14 °C"]
[38319,"Groß Biewende","-14 °C"]
[39435,"Groß Börnecke","-14 °C"]
[69509,"Groß Breitenbach","-14 °C"]
[31171,"Groß Escherde","-14 °C"]
[64521,"Gross Gerau","-12 °C"]
[18442,"Groß Kordshagen","-10 °C"]
[15746,"Groß Köris","-14 °C"]
[23966,"Groß Krankow","-12 °C"]
[19288,"Groß Laasch","-14 °C"]
[31246,"Groß Lafferde","-14 °C"]
[15913,"Groß Leine","-16 °C"]
[19336,"Groß Lüben","-14 °C"]
[18445,"Groß Mohrdorf","-10 °C"]
[19217,"Groß Molzahn","-12 °C"]
[3058,"Groß Oßnig","-16 °C"]
[17489,"Groß Petershagen","-12 °C"]
[68649,"Groß Rohrheim","-12 °C"]
[39240,"Groß Rosenburg","-14 °C"]
[23627,"Groß Sarau","-12 °C"]
[2999,"Groß Särchen","-16 °C"]
[16348,"Groß Schönebeck","-14 °C"]
[15806,"Groß Schulzendorf","-14 °C"]
[39579,"Groß Schwechten","-14 °C"]
[23972,"Groß Stieten","-12 °C"]
[64823,"Groß Umstadt","-14 °C"]
[24802,"Groß Vollstedt","-12 °C"]
[17166,"Groß Wokern","-12 °C"]
[64846,"Groß Zimmern","-14 °C"]
[86845,"Großaiting","-16 °C"]
[86845,"Großaitingen","-16 °C"]
[63457,"Grossauheim","-12 °C"]
[14979,"Großbeeren","-14 °C"]
[72663,"Großbettlingen","-16 °C"]
[64401,"Groß-Bieberau","-14 °C"]
[71723,"Großbottwar","-14 °C"]
[30938,"Großburgwedel","-14 °C"]
[4460,"Großdalzig","-14 °C"]
[73527,"Großdeinbach","-16 °C"]
[1665,"Großdobritz","-16 °C"]
[97633,"Großeibstsdt","-16 °C"]
[72415,"Grosselfingen","-16 °C"]
[31812,"Großenberg","-14 °C"]
[34582,"Großenenglis","-14 °C"]
[99991,"Großengottern","-14 °C"]
[1558,"Großenhain","-16 °C"]
[31515,"Grossenheidorn","-14 °C"]
[71577,"Großenlach","-16 °C"]
[91091,"Großenseebach","-16 °C"]
[1454,"Großerkmannsdorf","-14 °C"]
[99100,"Großfahner","-14 °C"]
[8541,"Großfriesen","-16 °C"]
[99706,"Großfurra","-14 °C"]
[75417,"Großglattbach","-14 °C"]
[6686,"Großgörschen","-14 °C"]
[2994,"Großgrabe","-16 °C"]
[6246,"Großgräfendorf","-14 °C"]
[90427,"Großgründlach","-16 °C"]
[90613,"Großhabersdorf","-16 °C"]
[1906,"Großhänchen","-16 °C"]
[1909,"Großharthau","-14 °C"]
[9618,"Großhartmannsdorf","-16 °C"]
[83607,"Großhartpenning","-18 °C"]
[96269,"Großheirath","-16 °C"]
[2747,"Großhennersdorf","-16 °C"]
[63920,"Großheubach","-14 °C"]
[85244,"Großinzemoos","-16 °C"]
[83109,"Großkarolinenfeld","-16 °C"]
[1990,"Großkmehlen","-16 °C"]
[89359,"Grosskötz","-16 °C"]
[89518,"Großkuchen","-16 °C"]
[4420,"Großlehna","-14 °C"]
[15907,"Groß-Lubolz","-16 °C"]
[56276,"Großmaischeid","-14 °C"]
[85098,"Großmehring","-18 °C"]
[39221,"Großmühlingen","-14 °C"]
[1936,"Großnaundorf","-14 °C"]
[67259,"Großniedesheim","-12 °C"]
[63762,"Großostheim","-12 °C"]
[4463,"Großpösna","-14 °C"]
[2692,"Großpostwitz","-16 °C"]
[4539,"Großprießligk","-14 °C"]
[1983,"Großräschen","-16 °C"]
[97950,"Großrinderfeld","-14 °C"]
[1825,"Großröhrsdorf","-14 °C"]
[1900,"Großröhsdorf","-14 °C"]
[4895,"Großrössen","-16 °C"]
[99195,"Großrudestedt","-14 °C"]
[39517,"Groß-Schwarzlosen","-14 °C"]
[2708,"Großschweidnitz","-16 °C"]
[4668,"Großsteinberg","-14 °C"]
[4932,"Großthiemig","-16 °C"]
[9575,"Großwaltersdorf","-16 °C"]
[91174,"Großweingarten","-16 °C"]
[4720,"Großweitzschen","-14 °C"]
[null,"Großwerther","-14 °C"]
[4860,"Großwig","-16 °C"]
[6905,"Großwig","-14 °C"]
[39319,"Großwulkow","-14 °C"]
[8538,"Großzöbern","-18 °C"]
[6632,"Gröst","-14 °C"]
[52511,"Grotenrath","-12 °C"]
[9474,"Grottendorf","-16 °C"]
[50181,"Grottenherten","-12 °C"]
[72631,"Grötzingen","-14 °C"]
[96271,"Grub am Forst","-16 °C"]
[null,"Gruben","-16 °C"]
[73344,"Gruibingen","-16 °C"]
[9224,"Grüna","-14 °C"]
[8223,"Grünbach","-16 °C"]
[35305,"Grünberg","-14 °C"]
[63584,"Gründau","-14 °C"]
[23948,"Grundshagen","-10 °C"]
[89613,"Grundsheim","-16 °C"]
[31073,"Grünenplan","-14 °C"]
[79219,"Grunern","-14 °C"]
[1945,"Grünewald","-16 °C"]
[39218,"Grünewalde","-14 °C"]
[8358,"Grünhain","-16 °C"]
[9579,"Grünhainichen","-16 °C"]
[88287,"Grünkraut","-14 °C"]
[9661,"Grünlichtenberg","-14 °C"]
[72160,"Grünmettstetten","-16 °C"]
[17291,"Grünow","-14 °C"]
[97947,"Grünsfeld","-16 °C"]
[97947,"Grünsfeldhausen","-14 °C"]
[76228,"Grünwettersbach","-12 °C"]
[72401,"Gruol","-16 °C"]
[74417,"Gschwend b. Gaildorf","-16 °C"]
[83257,"Gstadt an Chiemsee","-16 °C"]
[3172,"Guben","-16 °C"]
[74363,"Güglingen","-14 °C"]
[15913,"Guhlen","-16 °C"]
[55452,"Guldental","-12 °C"]
[72218,"Gültlingen","-16 °C"]
[71083,"Gültstein","-16 °C"]
[17089,"Gültz","-14 °C"]
["5164x","Gummersbach","-12 °C"]
[7751,"Gumperda","-14 °C"]
[71665,"Gündelbach","-14 °C"]
[79194,"Gundelfingen","-14 °C"]
[89423,"Gundelfingen","-16 °C"]
[74831,"Gundelsheim","-12 °C"]
[64380,"Gundernhausen","-14 °C"]
[79206,"Gündlingen","-12 °C"]
[89355,"Gundremmingen","-16 °C"]
[59519,"Günne","-12 °C"]
[91224,"Guntersrieth","-16 °C"]
[89312,"Günzburg","-16 °C"]
[91710,"Gunzenhausen","-16 °C"]
[79761,"Gurtweil","-12 °C"]
[39317,"Güsen","-14 °C"]
[54413,"Gusenburg","-14 °C"]
[17509,"Gustebin","-12 °C"]
[39439,"Güsten","-14 °C"]
[91189,"Gustenfelden","-16 °C"]
[21514,"Güster","-12 °C"]
[19205,"Güstow","-12 °C"]
[18273,"Güstrow","-12 °C"]
[77793,"Gutach","-16 °C"]
[79261,"Gutach","-14 °C"]
[1945,"Guteborn","-16 °C"]
[86869,"Gutenberg","-16 °C"]
[72488,"Gutenstein","-16 °C"]
[88484,"Gutenzell","-16 °C"]
["3333x","Gütersloh","-12 °C"]
[78187,"Gutmadingen","-16 °C"]
[17506,"Gützkow","-12 °C"]
[50374,"Gymnich","-12 °C"]
[85410,"Haag","-16 °C"]
[91126,"Haag","-16 °C"]
[4758,"Haage","-14 °C"]
[42781,"Haan","-10 °C"]
[85540,"Haar","-16 °C"]
[94542,"Haarbach","-16 °C"]
[97720,"Haard","-14 °C"]
[19336,"Haaren","-14 °C"]
[3058,"Haasow","-16 °C"]
[82392,"Habach","-16 °C"]
[99706,"Hachelbich","-14 °C"]
[57627,"Hachenburg","-14 °C"]
[31188,"Hackenstedt","-14 °C"]
[65589,"Hadamar (Westerwald)","-14 °C"]
[29693,"Hademstorf","-12 °C"]
[89356,"Hafenhofen","-16 °C"]
[74343,"Häfnerhaslach","-14 °C"]
[76889,"Haftelhof","-12 °C"]
[79685,"Häg-Ehrsberg","-16 °C"]
[93095,"Hagelstadt","-18 °C"]
[27628,"Hagen","-10 °C"]
[29378,"Hagen","-14 °C"]
["58xxx","Hagen","-12 °C"]
[76767,"Hagenbach","-12 °C"]
[91469,"Hagenbüchbach","-16 °C"]
[31558,"Hagenburg","-14 °C"]
[17194,"Hagenow","-12 °C"]
[19230,"Hagenow","-12 °C"]
[88709,"Hagnau/Bodensee","-12 °C"]
[64319,"Hahn","-12 °C"]
[92256,"Hahnbach","-16 °C"]
[38640,"Hahndorf","-14 °C"]
[55278,"Hahnheim","-12 °C"]
[63808,"Haibach","-12 °C"]
[94353,"Haibach","-18 °C"]
[4910,"Haida","-16 °C"]
[7926,"Haidefeld","-18 °C"]
[3130,"Haidemühl","-16 °C"]
[94501,"Haidenburg","-16 °C"]
[88410,"Haidgau","-16 °C"]
[93142,"Haidhof","-16 °C"]
[94522,"Haidlfing","-18 °C"]
[35708,"Haiger","-14 °C"]
[72401,"Haigerloch","-16 °C"]
[35708,"Haigerseelbach","-14 °C"]
[72108,"Hailfingen","-16 °C"]
[88525,"Hailtingen","-14 °C"]
[31319,"Haimar","-14 °C"]
[2779,"Hainewalde","-16 °C"]
[76835,"Hainfeld","-12 °C"]
[4567,"Hainichen","-14 °C"]
[9661,"Hainichen","-14 °C"]
[99735,"Hainrode","-14 °C"]
[86744,"Hainsfarth","-16 °C"]
[63512,"Hainstadt","-12 °C"]
[72221,"Haiterbach","-16 °C"]
[63571,"Haitz","-14 °C"]
[38820,"Halberstadt","-14 °C"]
[57489,"Halbhusten","-12 °C"]
[32351,"Haldem","-12 °C"]
[39340,"Haldensleben","-14 °C"]
[89356,"Haldenwang","-16 °C"]
[46459,"Haldern","-10 °C"]
[83128,"Halfing","-16 °C"]
[6116,"Halle","-14 °C"]
["061xx","Halle / Kröllwitz","-14 °C"]
[33790,"Halle / Westf. ","-12 °C"]
[59969,"Hallenberg","-16 °C"]
[91352,"Hallerndorf","-16 °C"]
[67826,"Hallgarten","-12 °C"]
[96103,"Hallstadt","-16 °C"]
[9633,"Halsbrücke","-16 °C"]
[56283,"Halsenbach","-14 °C"]
[45721,"Haltern","-10 °C"]
[79576,"Haltingen","-12 °C"]
[58553,"Halver","-12 °C"]
[97456,"Hambach","-16 °C"]
[75242,"Hamberg","-14 °C"]
[23619,"Hamberge","-12 °C"]
[27729,"Hambergen","-12 °C"]
[76707,"Hambrücken","-12 °C"]
[56761,"Hambuch","-14 °C"]
[29313,"Hambühren","-12 °C"]
["22xxx","Hamburg","-12 °C"]
[21037,"Hamburg - Reitbrook","-12 °C"]
["3178x","Hameln","-12 °C"]
["590xx","Hamm / Westf.","-12 °C"]
[97762,"Hammelburg","-14 °C"]
[16559,"Hammer","-14 °C"]
[52152,"Hammer","-14 °C"]
[4849,"Hammermühle","-14 °C"]
[99441,"Hammerstedt","-14 °C"]
[46499,"Hamminkeln","-10 °C"]
[22929,"Hammoor","-12 °C"]
["6345x","Hanau","-12 °C"]
[48157,"Handorf","-12 °C"]
[31311,"Hänigsen","-14 °C"]
[29386,"Hankensbüttel","-14 °C"]
[34346,"Hann.- Münden","-12 °C"]
["30xxx","Hannover","-14 °C"]
[29582,"Hanstedt","-14 °C"]
[86655,"Harburg","-16 °C"]
[74736,"Hardheim","-14 °C"]
[78739,"Hardt","-16 °C"]
[49733,"Haren","-10 °C"]
[55595,"Hargesheim","-12 °C"]
[79713,"Harpolingen","-12 °C"]
[27243,"Harpstedt","-12 °C"]
[21698,"Harsefeld","-12 °C"]
[33428,"Harsewinkel","-12 °C"]
[38829,"Harsleben","-14 °C"]
[31177,"Harsum","-14 °C"]
[72401,"Hart","-16 °C"]
[8134,"Härtensdorf","-14 °C"]
[8118,"Hartenstein","-16 °C"]
[91235,"Hartenstein","-16 °C"]
[4746,"Hartha","-14 °C"]
[9569,"Hartha","-14 °C"]
[67376,"Harthausen","-12 °C"]
[72501,"Harthausen","-16 °C"]
[86316,"Harthausen","-16 °C"]
[79258,"Hartheim","-12 °C"]
[56459,"Härtlingen","-14 °C"]
[8107,"Hartmannsdorf","-16 °C"]
[9232,"Hartmannsdorf","-14 °C"]
[8468,"Hartmannsgrün","-16 °C"]
[91224,"Hartmannshof","-16 °C"]
[6493,"Harzgerode","-16 °C"]
[49205,"Hasbergen","-12 °C"]
[79686,"Hasel","-14 °C"]
[9509,"Haselbach","-14 °C"]
[49740,"Haselünne","-12 °C"]
[71083,"Haslach","-16 °C"]
[77716,"Haslach","-16 °C"]
[88430,"Haslach","-16 °C"]
[1920,"Häslich","-16 °C"]
[25474,"Hasloh","-12 °C"]
[82285,"Haspelmoor","-16 °C"]
[38899,"Hasselfelde","-16 °C"]
[8112,"Haßlau","-14 °C"]
[17291,"Haßleben","-14 °C"]
[74855,"Haßmersheim","-12 °C"]
[31559,"Haste","-14 °C"]
[88416,"Hattenburg","-16 °C"]
[65347,"Hattenheim","-12 °C"]
[73110,"Hattenhofen","-16 °C"]
[82285,"Hattenhofen","-16 °C"]
[65795,"Hattersheim","-12 °C"]
[78194,"Hattingen","-16 °C"]
["4552x","Hattingen / Ruhr","-12 °C"]
[37197,"Hattorf","-16 °C"]
[25856,"Hattstedt","-10 °C"]
[76846,"Hauenstein","-12 °C"]
[79725,"Hauenstein","-12 °C"]
[88410,"Hauerz","-16 °C"]
[91729,"Haundorf","-16 °C"]
[91249,"Haunritz","-16 °C"]
[89437,"Haunsheim","-16 °C"]
[86179,"Haunstetten","-16 °C"]
[8468,"Hauptmannsgrün","-16 °C"]
[34626,"Hauptschwenda","-14 °C"]
[94481,"Haus im Wald","-18 °C"]
[77756,"Hausach","-16 °C"]
[35415,"Hausen","-14 °C"]
[36280,"Hausen","-16 °C"]
[63840,"Hausen","-14 °C"]
[71263,"Hausen","-16 °C"]
[72393,"Hausen","-18 °C"]
[79688,"Hausen","-14 °C"]
[91353,"Hausen","-16 °C"]
[97262,"Hausen","-14 °C"]
[89604,"Hausen ob Allmendingen","-14 °C"]
[78595,"Hausen ob Verena","-18 °C"]
[78183,"Hausen vor Wald","-16 °C"]
[79837,"Häusern","-16 °C"]
[83734,"Hausham","-18 °C"]
[1900,"Hauswalde","-14 °C"]
[6577,"Hauteroda","-14 °C"]
[94051,"Hauzenberg","-18 °C"]
[39539,"Havelberg","-14 °C"]
[38275,"Haverlah","-14 °C"]
[48329,"Havixbeck","-12 °C"]
[72534,"Hayingen","-16 °C"]
[37339,"Haynrode","-16 °C"]
[95168,"Hebanz","-18 °C"]
[84332,"Hebertsfelden","-16 °C"]
[6571,"Hechendorf","-14 °C"]
[82229,"Hechendorf","-16 °C"]
[72379,"Hechingen","-16 °C"]
[21755,"Hechthausen","-12 °C"]
[55129,"Hechtsheim","-12 °C"]
[54518,"Heckenmünster","-14 °C"]
[79341,"Hecklingen ","-12 °C"]
[36275,"Heddersdorf","-14 °C"]
[68542,"Heddersheim","-12 °C"]
[56564,"Heddesdorf","-12 °C"]
[33719,"Heepen","-12 °C"]
[1833,"Heeselicht","-14 °C"]
[27404,"Heeslingen","-12 °C"]
[31707,"Heeßen","-14 °C"]
[65510,"Heftrich","-14 °C"]
[73669,"Hegenlohe","-16 °C"]
[57413,"Heggen","-14 °C"]
[71334,"Hegnach","-12 °C"]
[16559,"Heidchen","-14 °C"]
[19294,"Heiddorf","-12 °C"]
[53797,"Heide","-12 °C"]
[25746,"Heide / Holst.","-10 °C"]
[91180,"Heideck","-16 °C"]
["691xx","Heidelberg","-10 °C"]
[76646,"Heidelsheim","-12 °C"]
[46359,"Heiden","-10 °C"]
[1809,"Heidenau","-14 °C"]
[54426,"Heidenburg","-12 °C"]
[55262,"Heidenfahrt","-12 °C"]
["895xx","Heidenheim / Brenz","-16 °C"]
[65321,"Heidenrod","-14 °C"]
[55262,"Heidesheim","-12 °C"]
[54518,"Heidweiler","-12 °C"]
["740xx","Heilbronn / Neckar","-12 °C"]
[88633,"Heiligenberg","-14 °C"]
[78731,"Heiligenbronn","-16 °C"]
[42579,"Heiligenhaus b. Velbert","-12 °C"]
[37308,"Heiligenstadt","-16 °C"]
[6347,"Heiligenthal","-14 °C"]
[77948,"Heiligenzell","-12 °C"]
[72348,"Heiligenzimmern","-16 °C"]
[69253,"Heiligkreuzsteinach","-12 °C"]
[91560,"Heilsbronn","-16 °C"]
[79331,"Heimbach","-12 °C"]
[53474,"Heimersheim","-14 °C"]
[71296,"Heimsheim","-16 °C"]
[37627,"Heinade","-14 °C"]
[73092,"Heiningen","-16 °C"]
[52525,"Heinsberg","-10 °C"]
[8468,"Heinsdorfergrund","-16 °C"]
[37649,"Heinsen","-12 °C"]
[74906,"Heinsheim","-12 °C"]
[67742,"Heinzenhausen","-12 °C"]
[54497,"Heinzerath","-14 °C"]
[87493,"Heising","-16 °C"]
[85276,"Heißmanning","-16 °C"]
[25492,"Heist","-10 °C"]
[53639,"Heisterbacherrott","-12 °C"]
[79423,"Heitersheim","-14 °C"]
[6311,"Helbra","-14 °C"]
[85414,"Helfenbrunn","-16 °C"]
[56244,"Helferskirchen","-14 °C"]
[37627,"Hellental","-14 °C"]
[53940,"Hellenthal","-14 °C"]
[95233,"Helmbrechts","-18 °C"]
[77866,"Helmlingen","-12 °C"]
[17498,"Helmshagen","-12 °C"]
[74921,"Helmstadt","-12 °C"]
[97264,"Helmstadt","-14 °C"]
[38350,"Helmstedt","-14 °C"]
[34298,"Helsa","-14 °C"]
[31535,"Helstorf","-14 °C"]
[33034,"Hembsen","-14 °C"]
[58675,"Hemer","-12 °C"]
[91334,"Hemhofen","-16 °C"]
[72108,"Hemmendorf","-16 °C"]
[97258,"Hemmersheim","-16 °C"]
[71282,"Hemmingen","-14 °C"]
[30966,"Hemmingen ","-14 °C"]
[92353,"Heng","-16 °C"]
[72574,"Hengen","-18 °C"]
[94491,"Hengersberg","-18 °C"]
[53773,"Hennef","-12 °C"]
[53773,"Hennef/Sieg","-12 °C"]
[16761,"Hennigsdorf","-14 °C"]
[16761,"Henningsdorf b. Berlin","-14 °C"]
[64646,"Heppenheim","-12 °C"]
[67551,"Heppenheim","-12 °C"]
[73235,"Hepsisau","-16 °C"]
[88518,"Herbertingen","-14 °C"]
[85241,"Herbertshausen","-16 °C"]
[86405,"Herbertshofen","-16 °C"]
[74861,"Herbolzheim","-12 °C"]
[79336,"Herbolzheim","-12 °C"]
[91478,"Herbolzheim","-16 °C"]
[35745,"Herborn","-14 °C"]
[89542,"Herbrechtingen","-16 °C"]
[99955,"Herbsleben","-14 °C"]
[97980,"Herbsthausen","-16 °C"]
[36355,"Herchenhain","-14 °C"]
[58313,"Herdecke","-12 °C"]
[88634,"Herdwangen","-14 °C"]
["320xx","Herford","-12 °C"]
[36318,"Hergersdorf","-14 °C"]
[6313,"Hergisdorf","-14 °C"]
[97534,"Hergolshausen","-14 °C"]
[36266,"Heringen/Werra","-14 °C"]
[23777,"Heringsdorf","-10 °C"]
[37293,"Herleshausen","-14 °C"]
[73527,"Herlikofen","-16 °C"]
[29320,"Hermannsburg","-14 °C"]
[66919,"Hermersberg","-12 °C"]
[1776,"Hermsdorf","-16 °C"]
[1945,"Hermsdorf","-16 °C"]
[7629,"Hermsdorf","-14 °C"]
["446xx","Herne","-10 °C"]
[72535,"Heroldstatt","-16 °C"]
[71083,"Herrenberg","-16 °C"]
[9217,"Herrenhaide","-14 °C"]
[78662,"Herrenzimmern","-16 °C"]
[56729,"Herresbach","-14 °C"]
[50374,"Herrig","-12 °C"]
[79737,"Herrischried","-14 °C"]
[23923,"Herrnburg","-10 °C"]
[2747,"Herrnhut","-16 °C"]
[67550,"Herrnsheim","-12 °C"]
[82211,"Herrsching am Ammersee","-16 °C"]
[2899,"Hersbach","-16 °C"]
[91217,"Hersbruck","-16 °C"]
[58849,"Herscheid","-14 °C"]
[53332,"Hersel","-12 °C"]
["45xxx","Herten / Westf.","-10 °C"]
[79415,"Hertingen","-12 °C"]
[71364,"Hertmannsweiler","-14 °C"]
[67273,"Herxheim am Berg","-12 °C"]
[91074,"Herzogenaurach","-16 °C"]
[52134,"Herzogenrath","-12 °C"]
[72336,"Heselwangen","-18 °C"]
[35085,"Heskem","-12 °C"]
[91093,"Heßdorf","-16 °C"]
[63607,"Hesseldorf","-14 °C"]
[38835,"Hessen","-14 °C"]
[74394,"Hessigheim","-12 °C"]
[37235,"Hessisch Lichtenau","-14 °C"]
[31840,"Hessisch Oldendorf","-12 °C"]
[74722,"Hettigenbeuern","-16 °C"]
[6333,"Hettstedt","-14 °C"]
[41812,"Hetzerath","-12 °C"]
[54523,"Hetzerath","-10 °C"]
[91077,"Hetzlers","-16 °C"]
[91077,"Hetzles","-16 °C"]
[73540,"Heubach","-16 °C"]
[72589,"Heuberg","-18 °C"]
[73572,"Heuchlingen","-16 °C"]
[89547,"Heuchlingen","-16 °C"]
[78253,"Heudorf im Hegau","-14 °C"]
[83052,"Heufeld","-16 °C"]
[97618,"Heustreu","-14 °C"]
[66265,"Heusweiler","-12 °C"]
[79194,"Heuweiler","-14 °C"]
[93336,"Hexenagger","-16 °C"]
[31171,"Heyersum","-14 °C"]
[32120,"Hiddenhausen","-12 °C"]
[59457,"Hilbeck","-12 °C"]
[2894,"Hilbersdorf","-16 °C"]
[9627,"Hilbersdorf","-16 °C"]
[57271,"Hilchenbach","-14 °C"]
[98646,"Hildburghausen","-16 °C"]
["4072x","Hilden","-10 °C"]
["311xx","Hildesheim","-14 °C"]
[71157,"Hildrizhausen","-16 °C"]
[57612,"Hilgenroth/Westerw.","-12 °C"]
[32479,"Hille","-12 °C"]
[32694,"Hillentrup","-14 °C"]
[54576,"Hillesheim","-14 °C"]
[56204,"Hillscheid","-12 °C"]
[91161,"Hilpoltstein","-16 °C"]
[74889,"Hilsbach","-12 °C"]
[91355,"Hiltpoltstein","-16 °C"]
[78247,"Hilzingen","-12 °C"]
[39596,"Hindenburg","-14 °C"]
[6386,"Hinsdorf","-14 °C"]
[1855,"Hinterhermsdorf","-16 °C"]
[98553,"Hinternah","-16 °C"]
[17375,"Hintersee","-12 °C"]
[36396,"Hintersteinau","-14 °C"]
[79856,"Hinterzarten","-18 °C"]
[27432,"Hipstedt","-12 °C"]
[72145,"Hirrlingen","-16 °C"]
[75365,"Hirsau ","-16 °C"]
[96114,"Hirschaid","-16 °C"]
[72070,"Hirschau","-16 °C"]
[7927,"Hirschberg","-18 °C"]
[9526,"Hirschberg","-16 °C"]
[69493,"Hirschberg","-12 °C"]
[18311,"Hirschburg","-10 °C"]
[98678,"Hirschendorf","-16 °C"]
[4932,"Hirschfeld","-16 °C"]
[37235,"Hirschhagen","-14 °C"]
[57635,"Hirzbach","-14 °C"]
[63697,"Hirzenhain","-14 °C"]
[21522,"Hittbergen","-12 °C"]
[39279,"Hobeck","-14 °C"]
[88348,"Hochberg","-14 °C"]
[71686,"Hochdorf","-14 °C"]
[71735,"Hochdorf","-14 °C"]
[72202,"Hochdorf","-16 °C"]
[72297,"Hochdorf","-16 °C"]
[73269,"Hochdorf","-16 °C"]
[88454,"Hochdorf","-16 °C"]
[72151,"Hochdorf  bei Horb / Neckar","-16 °C"]
[79862,"Höchenschwand","-16 °C"]
[2627,"Hochkirch","-16 °C"]
[41363,"Hochneukirch","-10 °C"]
[64739,"Höchst","-14 °C"]
[95186,"Höchstädt","-18 °C"]
[76351,"Hochstetten","-12 °C"]
[79206,"Hochstetten","-12 °C"]
[55606,"Hochstetten-Dhaun","-14 °C"]
[86163,"Hochzoll","-16 °C"]
[68766,"Hockenheim","-12 °C"]
[88662,"Hödingen (Überlingen)","-12 °C"]
[56472,"Hof","-14 °C"]
["950xx","Hof, Saale","-18 °C"]
[36145,"Hofbieber","-16 °C"]
[84152,"Hofdorf","-18 °C"]
[75339,"Höfen","-16 °C"]
[90431,"Höfen","-16 °C"]
[92342,"Höfen","-16 °C"]
[74889,"Hoffenheim","-12 °C"]
[51503,"Hoffnungsthal","-12 °C"]
[34369,"Hofgeismar","-14 °C"]
[4668,"Höfgen","-14 °C"]
[65719,"Hofheim","-12 °C"]
[97461,"Hofheim / Unterfr.","-14 °C"]
[71229,"Höfingen","-14 °C"]
[84082,"Hofkirchen","-18 °C"]
[94544,"Hofkirchen","-18 °C"]
[86928,"Hofstetten","-16 °C"]
[77749,"Hofweier","-12 °C"]
[77749,"Hohberg","-12 °C"]
[4808,"Hohburg","-14 °C"]
[38700,"Hohegeiß","-16 °C"]
[16540,"Hohen Neuendorf","-14 °C"]
[23996,"Hohen Viecheln","-12 °C"]
[83670,"Hohenbirken","-14 °C"]
[18445,"Hohendorf","-10 °C"]
[31185,"Hoheneggelsen","-14 °C"]
[16306,"Hohenfelde ","-14 °C"]
[73666,"Hohengehren","-14 °C"]
[31249,"Hohenhameln","-14 °C"]
[74420,"Hohenhardtsweiler","-16 °C"]
[74343,"Hohenhaslach","-12 °C"]
[4448,"Hohenheida","-14 °C"]
[26434,"Hohenkirchen","-10 °C"]
[7958,"Hohenleiben","-16 °C"]
[4934,"Hohenleipisch","-16 °C"]
[58119,"Hohenlimburg","-12 °C"]
[6773,"Hohenlubast","-14 °C"]
[89537,"Hohenmemmingen","-16 °C"]
[82383,"Hohenpeißenberg","-16 °C"]
[82335,"Höhenrain","-16 °C"]
[86637,"Hohenreichen","-16 °C"]
[16307,"Hohenreinkendorf","-14 °C"]
[36284,"Hohenroda","-14 °C"]
[16248,"Hohensaaten","-14 °C"]
[82069,"Hohenschäftlarn","-16 °C"]
[87645,"Hohenschwangau","-18 °C"]
[73453,"Hohenstadt","-16 °C"]
[null,"Hohenstange","-12 °C"]
[65329,"Hohenstein","-14 °C"]
[72531,"Hohenstein","-18 °C"]
[9337,"Hohenstein-Ernstthal","-14 °C"]
[79801,"Hohentengen","-12 °C"]
[88367,"Hohentengen","-14 °C"]
[83104,"Hohenthann","-16 °C"]
[75181,"Hohenwart","-14 °C"]
[93480,"Hohenwarth","-18 °C"]
[39291,"Hohenwarthe","-14 °C"]
[6179,"Hohenweiden","-14 °C"]
[24594,"Hohenwestedt","-12 °C"]
[1561,"Hohndorf","-16 °C"]
[7985,"Hohndorf","-16 °C"]
[9434,"Hohndorf","-14 °C"]
[29362,"Hohne","-14 °C"]
[31559,"Hohnhorst","-14 °C"]
[77694,"Hohnhurst","-12 °C"]
[6179,"Höhnstedt","-14 °C"]
[42655,"Höhscheid","-12 °C"]
[41469,"Hoisten","-10 °C"]
[49451,"Holdorf","-12 °C"]
[49584,"Hollenstede","-12 °C"]
[21279,"Hollenstedt","-12 °C"]
[37154,"Hollenstedt","-16 °C"]
[83098,"Höllenstein","-18 °C"]
[53940,"Hollerath","-14 °C"]
[21723,"Hollern-Twielenfleth","-10 °C"]
[96142,"Hollfeld","-16 °C"]
[32257,"Holsen","-12 °C"]
[41069,"Holt ","-10 °C"]
[46147,"Holten","-10 °C"]
[31787,"Holtensen","-12 °C"]
[26629,"Holtrop","-10 °C"]
[41363,"Holz","-12 °C"]
[66265,"Holz","-12 °C"]
[56379,"Holzappel","-12 °C"]
[9623,"Holzau","-16 °C"]
[75365,"Holzbronn","-14 °C"]
[6926,"Holzdorf","-16 °C"]
[72805,"Holzelfingen","-18 °C"]
[37632,"Holzen","-14 °C"]
[79400,"Holzen","-12 °C"]
[71088,"Holzgerlingen","-16 °C"]
[4454,"Holzhausen","-14 °C"]
[32457,"Holzhausen","-12 °C"]
[35753,"Holzhausen","-14 °C"]
[77866,"Holzhausen","-12 °C"]
[79232,"Holzhausen","-12 °C"]
[86919,"Holzhausen a. Ammersee","-16 °C"]
[32805,"Holzhausen-Externsteine","-14 °C"]
[41472,"Holzheim","-10 °C"]
[89438,"Holzheim","-16 °C"]
[90453,"Holzheim","-16 °C"]
[83607,"Holzkirchen ","-18 °C"]
[73271,"Holzmaden","-16 °C"]
[37603,"Holzminden","-12 °C"]
[53501,"Holzweiler","-14 °C"]
[6808,"Holzweißig","-14 °C"]
[59439,"Holzwickede","-12 °C"]
[34576,"Homberg","-14 °C"]
[67744,"Homberg","-14 °C"]
["47xxx","Homberg / Niederrh.","-10 °C"]
[40882,"Homberg-Meiersberg","-10 °C"]
[44227,"Hombruch","-12 °C"]
[66424,"Homburg / Saar","-12 °C"]
[31177,"Hönnersum","-14 °C"]
[15366,"Hönow","-14 °C"]
[59737,"Honrath","-12 °C"]
[44869,"Höntrop","-12 °C"]
[66606,"Hoof","-12 °C"]
[49846,"Hoogstede","-10 °C"]
[72172,"Hopfau","-16 °C"]
[71711,"Höpfigheim","-12 °C"]
[74746,"Höpfingen","-14 °C"]
[14641,"Hoppenrade","-14 °C"]
[48496,"Hopsten","-12 °C"]
[72160,"Horb","-16 °C"]
[56412,"Horbach","-12 °C"]
[35745,"Hörbach","-14 °C"]
[79289,"Horben","-16 °C"]
[76771,"Hördt","-12 °C"]
[88477,"Hörenhausen","-16 °C"]
[88263,"Horgenzell","-14 °C"]
[85413,"Hörgertshausen","-16 °C"]
[79793,"Horheim","-12 °C"]
[74417,"Horlachen","-16 °C"]
[1986,"Hörlitz","-16 °C"]
[32805,"Horn-Bad Meinberg","-14 °C"]
[2763,"Hörnitz","-16 °C"]
[3130,"Hornow","-16 °C"]
[55457,"Horrweiler","-12 °C"]
[96231,"Horsdorf","-16 °C"]
[99976,"Horsmar","-16 °C"]
[21220,"Horst","-12 °C"]
[45899,"Horst","-10 °C"]
[6785,"Horstdorf","-14 °C"]
[63755,"Hörstein","-12 °C"]
[48477,"Hörstel","-12 °C"]
[63768,"Hösbach","-14 °C"]
[1996,"Hosena","-16 °C"]
[88374,"Hoßkirch","-14 °C"]
[88374,"Hoßkirch","-14 °C"]
[73663,"Hößlinswart","-14 °C"]
[79736,"Hottingen","-14 °C"]
[53902,"Houverath","-14 °C"]
[33161,"Hövelhof","-12 °C"]
[37671,"Höxter","-12 °C"]
[27318,"Hoyerhagen","-12 °C"]
[31093,"Hoyershausen","-14 °C"]
[2977,"Hoyerswerda","-16 °C"]
[6308,"Hübitz","-14 °C"]
[75181,"Huchenfeld","-14 °C"]
[32609,"Huchzen","-12 °C"]
[41836,"Hückelhoven","-10 °C"]
[47259,"Huckingen","-10 °C"]
[31177,"Hüddessum","-14 °C"]
[27798,"Hude","-12 °C"]
[74928,"Hüffenhardt","-12 °C"]
[78183,"Hüfingen","-16 °C"]
[76549,"Hügelsheim","-12 °C"]
[82386,"Huglfing","-16 °C"]
[79232,"Hugstetten","-12 °C"]
[77933,"Hugsweier","-12 °C"]
[47551,"Huisberden","-10 °C"]
[72584,"Hülben","-16 °C"]
[32609,"Hüllhorst","-12 °C"]
[31867,"Hülsede","-14 °C"]
[66773,"Hülzweiler","-12 °C"]
[32676,"Hummersen","-14 °C"]
[98634,"Hümpfershausen","-16 °C"]
[94336,"Hunderdorf","-18 °C"]
[88518,"Hundersingen","-14 °C"]
[67749,"Hundheim","-14 °C"]
[97900,"Hundheim","-14 °C"]
[39343,"Hundisburg","-14 °C"]
[36088,"Hünfeld","-14 °C"]
[65510,"Hünstetten","-14 °C"]
[46569,"Hünxe","-10 °C"]
[54518,"Hupperath","-14 °C"]
[52393,"Hürtgenwald","-14 °C"]
[52393,"Hürtgenwald-Gey","-14 °C"]
[50354,"Hürth","-10 °C"]
[24850,"Hüsby","-12 °C"]
[39579,"Hüselitz","-14 °C"]
[31632,"Husum","-12 °C"]
[25813,"Husum / Nordsee","-10 °C"]
[66882,"Hütschenhausen","-12 °C"]
[35625,"Hüttenberg","-14 °C"]
[76661,"Huttenheim","-12 °C"]
[84152,"Hüttenkofen","-18 °C"]
[38889,"Hüttenrode","-16 °C"]
[54636,"Hüttingen/Kyll","-14 °C"]
[73460,"Hüttlingen","-16 °C"]
[36110,"Hutzdorf","-14 °C"]
[29646,"Hützel","-14 °C"]
[79837,"Ibach-Mutterslehen","-16 °C"]
["4947x","Ibbenbüren","-12 °C"]
[89335,"Ichenhausen","-16 °C"]
[77743,"Ichenheim","-12 °C"]
[99334,"Ichtershausen","-14 °C"]
[55743,"Idar-Oberstein","-12 °C"]
[65510,"Idstein","-14 °C"]
[76473,"Iffezheim","-12 °C"]
[91338,"Igensdorf","-16 °C"]
[97999,"Igersheim","-16 °C"]
[67471,"Iggelbach","-12 °C"]
[94547,"Iggensbach","-18 °C"]
[73574,"Iggingen","-16 °C"]
[86859,"Igling","-16 °C"]
[72160,"Ihlingen","-16 °C"]
[79241,"Ihringen","-12 °C"]
[93346,"Ihrlerstein","-16 °C"]
[38723,"Ildehausen","-16 °C"]
[99958,"Illeben","-14 °C"]
[89269,"Illerberg","-16 °C"]
[89281,"Illereichen","-16 °C"]
[89171,"Illerkirchberg","-16 °C"]
[89186,"Illerrieden","-16 °C"]
[89257,"Illertissen","-16 °C"]
[75428,"Illingen","-14 °C"]
[76477,"Illingen","-12 °C"]
[88636,"Illmensee","-14 °C"]
[98693,"Ilmenau","-16 °C"]
[99326,"Ilmtal","-14 °C"]
[31241,"Ilsede","-14 °C"]
[38871,"Ilsenburg","-16 °C"]
[74360,"Ilsfeld","-12 °C"]
[74532,"Ilshofen","-16 °C"]
[68549,"Ilvesheim","-12 °C"]
[78194,"Immendingen","-16 °C"]
[56077,"Immendorf","-12 °C"]
[34376,"Immenhausen","-14 °C"]
[72127,"Immenhausen","-16 °C"]
[73463,"Immenhofen","-16 °C"]
[95505,"Immenreuth","-18 °C"]
[31275,"Immensen","-14 °C"]
[88090,"Immenstaad","-12 °C"]
[87509,"Immenstadt","-18 °C"]
[72534,"Indelhausen","-16 °C"]
[94428,"Indersbach","-16 °C"]
[74653,"Ingelfingen","-14 °C"]
[55218,"Ingelheim","-12 °C"]
[88456,"Ingoldingen","-16 °C"]
["850xx","Ingolstadt","-16 °C"]
[35410,"Inheiden","-12 °C"]
[72513,"Inneringen","-16 °C"]
[94548,"Innernzell","-18 °C"]
[24613,"Innien","-12 °C"]
[98599,"Inselsberg","-16 °C"]
[53520,"Insul","-14 °C"]
[72514,"Inzigkofen","-14 °C"]
[97258,"Ippesheim","-16 °C"]
[91472,"Ipsheim","-16 °C"]
[75446,"Iptingen","-14 °C"]
[8485,"Irfersgrün","-16 °C"]
[85049,"Irgertsheim","-16 °C"]
[52388,"Irresheim","-12 °C"]
[83737,"Irschenberg","-18 °C"]
[39167,"Irxleben","-14 °C"]
["5863x","Iserlohn","-12 °C"]
[30916,"Isernhagen","-14 °C"]
[85737,"Ismaning","-16 °C"]
[88316,"Isny","-16 °C"]
[75228,"Ispringen","-14 °C"]
[54338,"Issel","-10 °C"]
[65558,"Isselbach","-14 °C"]
[46419,"Isselburg","-10 °C"]
[47661,"Issum","-10 °C"]
[88677,"Ittendorf","-12 °C"]
[49847,"Itterbeck","-10 °C"]
[76307,"Ittersbach","-14 °C"]
[88048,"Ittingen","-12 °C"]
[88515,"Ittingen","-16 °C"]
[74930,"Ittlingen","-14 °C"]
[25524,"Izehoe","-12 °C"]
[15236,"Jacobsdorf","-16 °C"]
[26349,"Jade","-10 °C"]
[7768,"Jägersdorf","-14 °C"]
[74249,"Jagsthausen","-14 °C"]
[73489,"Jagstzell","-16 °C"]
[37688,"Jakobsberg","-14 °C"]
[3130,"Jämlitz","-16 °C"]
[2906,"Jänkendorf","-16 °C"]
[1945,"Jannowitz","-16 °C"]
[17126,"Jarmen","-12 °C"]
[73035,"Jebenhausen","-16 °C"]
[79361,"Jechtingen","-12 °C"]
[89257,"Jedesheim","-16 °C"]
["0774x","Jena","-14 °C"]
[39319,"Jerichow","-14 °C"]
[3159,"Jerischke","-16 °C"]
[4838,"Jesewitz","-14 °C"]
[73230,"Jesingen","-16 °C"]
[1689,"Jessen","-16 °C"]
[2699,"Jeßnitz","-16 °C"]
[4720,"Jeßnitz","-14 °C"]
[21266,"Jesteburg","-12 °C"]
[98708,"Jesuborn","-16 °C"]
[72127,"Jettenburg","-16 °C"]
[71131,"Jettingen","-16 °C"]
[89343,"Jettingen-Scheppach","-16 °C"]
[8543,"Jocketa","-16 °C"]
[8349,"Johanngeorgenstadt","-18 °C"]
[96328,"Johannisthal","-16 °C"]
[75045,"Jöhlingen","-12 °C"]
[1768,"Johnsbach","-16 °C"]
[33739,"Jöllenbeck","-12 °C"]
[2796,"Jonsdorf","-16 °C"]
[41363,"Jüchen","-10 °C"]
[37127,"Jühnde","-14 °C"]
[52428,"Jülich","-12 °C"]
[72417,"Jungingen","-18 °C"]
[54584,"Jünkerath","-14 °C"]
[17214,"Jürgenshof","-12 °C"]
[17153,"Jürgenstorf","-14 °C"]
[14913,"Jüterbog","-14 °C"]
[37345,"Jützenbach","-16 °C"]
[41564,"Kaarst","-10 °C"]
[79790,"Kadelburg","-12 °C"]
[56337,"Kadenbach","-12 °C"]
[4668,"Kaditzsch","-14 °C"]
[63796,"Kahl am Main","-12 °C"]
[72479,"Kaiseringen","-16 °C"]
[73667,"Kaisersbach","-16 °C"]
[56759,"Kaisersesch","-14 °C"]
["676xx","Kaiserslautern","-12 °C"]
[86687,"Kaisheim","-16 °C"]
[6785,"Kakau","-14 °C"]
[36148,"Kalbach","-14 °C"]
[60437,"Kalbach","-12 °C"]
[91720,"Kalbensteinberg","-16 °C"]
[63755,"Kälberau","-12 °C"]
[90562,"Kalchreuth","-16 °C"]
[23942,"Kalkhorst","-10 °C"]
[78355,"Kalkofen","-14 °C"]
[88356,"Kalkreute","-14 °C"]
[1561,"Kalkreuth","-16 °C"]
[53925,"Kall","-14 °C"]
[32689,"Kalldorf ","-12 °C"]
[59602,"Kallenhardt","-14 °C"]
[32689,"Kalletal","-14 °C"]
[56294,"Kalt","-14 °C"]
[82269,"Kaltenberg","-16 °C"]
[82269,"Kalteneck","-16 °C"]
[87662,"Kaltental","-16 °C"]
[98634,"Kaltenwestheim","-16 °C"]
[52156,"Kalterherberg ","-14 °C"]
[9661,"Kaltofen","-14 °C"]
[59174,"Kamen / Westf.","-12 °C"]
[1917,"Kamenz","-16 °C"]
[39524,"Kamern","-14 °C"]
[4886,"Kamitz","-16 °C"]
[83278,"Kammer","-16 °C"]
[91126,"Kammerstein","-16 °C"]
[26169,"Kampe","-12 °C"]
[75236,"Kämpfelbach","-14 °C"]
[47475,"Kamp-Lintfort","-10 °C"]
[18516,"Kandelin","-12 °C"]
[79400,"Kandern","-14 °C"]
[79400,"Kandern","-14 °C"]
[18299,"Kankel","-12 °C"]
[88422,"Kanzach","-14 °C"]
[41516,"Kapellen","-10 °C"]
[99510,"Kapellendorf","-14 °C"]
[75339,"Kapfenhardt","-14 °C"]
[84186,"Kapfing","-16 °C"]
[77966,"Kappel","-12 °C"]
[79853,"Kappel","-18 °C"]
[88263,"Kappel","-14 °C"]
[91355,"Kappel","-16 °C"]
[24376,"Kappeln","-10 °C"]
[77876,"Kappelrodeck","-14 °C"]
[61184,"Karben","-12 °C"]
[52525,"Karken","-10 °C"]
[76307,"Karlsbad","-14 °C"]
[17495,"Karlsburg","-12 °C"]
[76689,"Karlsdorf","-12 °C"]
[17449,"Karlshagen","-12 °C"]
[27442,"Karlshöfen","-12 °C"]
[86668,"Karlshuld","-16 °C"]
["76xxx","Karlsruhe","-12 °C"]
[97753,"Karlstadt","-14 °C"]
[23966,"Karow","-10 °C"]
[94094,"Karpfham","-16 °C"]
[17498,"Karrendorf","-12 °C"]
[17440,"Karrin","-12 °C"]
[79618,"Karsau","-12 °C"]
[19357,"Karstädt","-14 °C"]
["341xx","Kassel","-12 °C"]
[84556,"Kastl","-16 °C"]
[92280,"Kastl","-16 °C"]
[95506,"Kastl","-16 °C"]
[31311,"Katensen","-14 °C"]
[37191,"Katlenburg","-16 °C"]
[49536,"Kattenvenne","-14 °C"]
[4749,"Kattwitz","-14 °C"]
[35630,"Katzenfurt","-14 °C"]
[79297,"Katzenmoos","-16 °C"]
[17509,"Katzow","-12 °C"]
[4886,"Kaucklitz","-16 °C"]
[6231,"Kauern","-14 °C"]
[87600,"Kaufbeuren","-16 °C"]
[86916,"Kaufering","-16 °C"]
[71083,"Kayh","-16 °C"]
[18513,"Keffenbrink","-12 °C"]
[77694,"Kehl","-12 °C"]
[88074,"Kehlen","-14 °C"]
[65779,"Kelkheim","-14 °C"]
[89293,"Kellmünz","-16 °C"]
[65451,"Kelsterbach","-14 °C"]
[75210,"Keltern","-14 °C"]
[6901,"Kemberg","-14 °C"]
[88212,"Kemmerlang","-14 °C"]
[73760,"Kemnat","-14 °C"]
[95478,"Kemnath","-16 °C"]
[8538,"Kemnitz","-18 °C"]
[17509,"Kemnitz","-12 °C"]
[17509,"Kemnitzerhagen","-12 °C"]
[56746,"Kempenich","-14 °C"]
["8743x","Kempten / Allgäu","-16 °C"]
[54344,"Kenn","-10 °C"]
[79341,"Kenzingen","-12 °C"]
[47647,"Kerken","-10 °C"]
[3172,"Kerkwitz","-16 °C"]
[71394,"Kernen","-14 °C"]
[50171,"Kerpen","-12 °C"]
[54589,"Kerschenbach","-14 °C"]
[8373,"Kertzsch","-14 °C"]
[16845,"Kerzlin","-14 °C"]
[65510,"Kesselbach","-14 °C"]
[52152,"Kesternich","-14 °C"]
[36325,"Kestrich","-14 °C"]
[68775,"Ketsch","-12 °C"]
[72501,"Kettenacker","-16 °C"]
[49577,"Kettenkamp","-12 °C"]
[86498,"Kettershausen","-16 °C"]
[14669,"Ketzin","-14 °C"]
[99713,"Keula","-14 °C"]
[47623,"Kevelaer","-10 °C"]
[89407,"Kicklingen","-16 °C"]
[72108,"Kiebingen","-16 °C"]
[4720,"Kiebitz","-14 °C"]
[4720,"Kiebitz","-14 °C"]
[3058,"Kiekebusch","-16 °C"]
["241xx","Kiel","-10 °C"]
[2899,"Kiesdorf","-16 °C"]
[36460,"Kieselbach","-16 °C"]
[75249,"Kieselbronn","-14 °C"]
[72072,"Kilchberg","-16 °C"]
[61137,"Kilianstädten","-12 °C"]
[73667,"Killenhof","-16 °C"]
[72393,"Killer","-18 °C"]
[87452,"Kimratshofen","-16 °C"]
[48159,"Kinderhaus","-12 °C"]
[66862,"Kindsbach","-12 °C"]
[52249,"Kinzweiler","-12 °C"]
[77971,"Kippenheim","-12 °C"]
[74912,"Kirchardt","-14 °C"]
[88486,"Kirchberg","-16 °C"]
[8107,"Kirchberg / Sachsen","-16 °C"]
[74592,"Kirchberg a.d. Jagst","-16 °C"]
[71737,"Kirchberg an der Murr","-14 °C"]
[29664,"Kirchboitzen","-12 °C"]
[37619,"Kirchbrak","-14 °C"]
[78086,"Kirchdorf","-18 °C"]
[88457,"Kirchdorf","-16 °C"]
[93348,"Kirchdorf","-18 °C"]
[94261,"Kirchdorf i. Wald","-18 °C"]
[91356,"Kirchehrenbach","-16 °C"]
[57548,"Kirchen","-12 °C"]
[95158,"Kirchenlamitz","-18 °C"]
[91241,"Kirchensittenbach","-16 °C"]
[72138,"Kirchentellinsfurt","-16 °C"]
[91281,"Kirchenthumbach","-16 °C"]
[21394,"Kirchgellersen","-12 °C"]
[99334,"Kirchheim","-14 °C"]
[73230,"Kirchheim / Teck","-16 °C"]
[74366,"Kirchheim am Neckar","-12 °C"]
[67292,"Kirchheimbolanden","-12 °C"]
[46244,"Kirchhellen","-10 °C"]
[50181,"Kirchherten","-12 °C"]
[79238,"Kirchhofen","-14 °C"]
[52525,"Kirchhoven","-10 °C"]
[32278,"Kirchlengern","-12 °C"]
[27308,"Kirchlinteln","-12 °C"]
[27412,"Kirchtimke","-12 °C"]
[57368,"Kirchveischede","-14 °C"]
[56729,"Kirchwald","-14 °C"]
[21037,"Kirchwerder","-12 °C"]
[79199,"Kirchzarten","-16 °C"]
[77756,"Kirnbach","-16 °C"]
[64646,"Kirschhausen","-14 °C"]
[7919,"Kirschkau","-16 °C"]
[86438,"Kissing","-16 °C"]
[4460,"Kitzen","-14 °C"]
[97318,"Kitzingen","-14 °C"]
[4567,"Kitzscher","-14 °C"]
[39579,"Kläden","-14 °C"]
[17087,"Klatzow","-14 °C"]
[18445,"Klausdorf","-10 °C"]
[16766,"Klein - Ziethen","-14 °C"]
[31789,"Klein Berkel","-12 °C"]
[31171,"Klein Escherde","-14 °C"]
[19348,"Klein Gottschow","-14 °C"]
[85293,"Klein Gurnibach","-16 °C"]
[15746,"Klein Köris","-14 °C"]
[37130,"Klein Legden","-16 °C"]
[37130,"Klein Lengden","-16 °C"]
[31319,"Klein Lobke","-14 °C"]
[3130,"Klein Loitz","-16 °C"]
[18445,"Klein Mohrdorf","-10 °C"]
[23948,"Klein Pravtshagen","-10 °C"]
[23942,"Klein Schwansee","-10 °C"]
[19069,"Klein Trebbow","-12 °C"]
[18276,"Klein Upahl","-12 °C"]
[23992,"Klein Warin","-12 °C"]
[86507,"Kleinaitingen","-16 °C"]
[2627,"Kleinbautzen","-16 °C"]
[66271,"Kleinblittersdorf","-12 °C"]
[4668,"Kleinbothen","-14 °C"]
[30938,"Kleinburgwedel","-14 °C"]
[2708,"Kleindehsa","-16 °C"]
[73527,"Kleindeinbach","-16 °C"]
[72829,"Kleinengstingen","-18 °C"]
[67483,"Kleinfischlingen","-12 °C"]
[99735,"Kleinfurra","-14 °C"]
[6686,"Kleingörschen","-14 °C"]
[9575,"Kleinhartmannsdorf","-16 °C"]
[1824,"Kleinhennersdorf","-16 °C"]
[63924,"Kleinheubach","-14 °C"]
[91177,"Kleinhöbing 2","-16 °C"]
[79588,"Kleinkems","-12 °C"]
[1990,"Kleinkmehlen","-16 °C"]
[6926,"Kleinkorga","-14 °C"]
[6184,"Kleinkugel","-14 °C"]
[91235,"Kleinmeinfeld","-16 °C"]
[39221,"Kleinmühlingen","-14 °C"]
[1516,"Kleinnaundorf","-16 °C"]
[39167,"Klein-Rodensleben","-14 °C"]
[1900,"Kleinröhrsdorf","-14 °C"]
[2694,"Kleinsaubernitz","-16 °C"]
[1259,"Kleinschachwitz","-14 °C"]
[17291,"Klein-Sperrenwalde","-14 °C"]
[76327,"Kleinsteinbach","-12 °C"]
[1561,"Kleinthiemig","-16 °C"]
[63839,"Kleinwallstadt","-12 °C"]
[2627,"Kleinwelka","-16 °C"]
[24969,"Kleinwiehe","-10 °C"]
[75378,"Kleinwildbad","-16 °C"]
[64846,"Klein-Zimmern","-14 °C"]
[8538,"Kleinzöbern","-18 °C"]
[99102,"Klettbach","-14 °C"]
[1998,"Klettwitz","-16 °C"]
[47533,"Kleve","-10 °C"]
[18516,"Klevenow","-12 °C"]
[39524,"Klietz","-14 °C"]
[4668,"Klinga","-14 °C"]
[86551,"Klingen","-16 °C"]
[63911,"Klingenberg","-14 °C"]
[74246,"Klingenhof","-14 °C"]
[8248,"Klingenthal","-18 °C"]
[78588,"Klippeneck","-18 °C"]
[1665,"Klipphausen","-14 °C"]
[18311,"Klockenhagen","-10 °C"]
[8527,"Kloschwitz","-16 °C"]
[6308,"Klostermansfeld","-14 °C"]
[72270,"Klosterreichenbach","-16 °C"]
[88048,"Kluftern","-12 °C"]
[23948,"Klütz","-10 °C"]
[2977,"Knappenrode","-16 °C"]
[4420,"Knautnaundorf","-14 °C"]
[29379,"Knesebeck","-14 °C"]
[97478,"Knetzgau","-16 °C"]
[75438,"Knittlingen","-14 °C"]
[34593,"Knüllwald","-14 °C"]
[23881,"Koberg","-12 °C"]
[56330,"Kobern-Gondorf","-12 °C"]
[2999,"Koblenz","-16 °C"]
["5607x","Koblenz","-12 °C"]
[39517,"Köckte","-14 °C"]
[39649,"Köckte","-14 °C"]
[2923,"Kodersdorf","-16 °C"]
[2924,"Kodersdorf-Bahnhof","-16 °C"]
[95189,"Köditz","-18 °C"]
[72664,"Kohlberg","-16 °C"]
[27624,"Köhlen","-12 °C"]
[52134,"Kohlscheid","-12 °C"]
[72829,"Kohlstetten","-18 °C"]
[4683,"Köhra","-14 °C"]
[83059,"Kolbermoor","-16 °C"]
[78600,"Kolbingen","-16 °C"]
[56459,"Kölbingen","-14 °C"]
[31515,"Kolenfeld","-14 °C"]
[3099,"Kolkwitz","-16 °C"]
[99625,"Kölleda","-14 °C"]
[37696,"Kollerbeck","-14 °C"]
[4886,"Köllitsch","-16 °C"]
[79312,"Kollmarsreute","-14 °C"]
[79183,"Kollnau","-14 °C"]
[94262,"Kollnburg","-18 °C"]
["5xxxx","Köln","-10 °C"]
[50769,"Köln-Fühlingen","-10 °C"]
[50737,"Köln-Longerich","-10 °C"]
[50769,"Köln-Seeberg","-10 °C"]
[50858,"Köln-Weiden","-10 °C"]
[50737,"Köln-Weidenpesch","-10 °C"]
[4509,"Kölsa","-14 °C"]
[4579,"Kömmlitz","-14 °C"]
[79331,"Köndringen","-12 °C"]
[54329,"Könen","-10 °C"]
[73257,"Köngen","-14 °C"]
[6493,"Königerode","-16 °C"]
[97953,"Königheim","-16 °C"]
[15711,"Königs Wusterhausen","-14 °C"]
[75203,"Königsbach-Stein","-14 °C"]
[39175,"Königsborn","-14 °C"]
[89551,"Königsbronn","-16 °C"]
[89551,"Königsbronn - Zang","-16 °C"]
[1936,"Königsbrück","-16 °C"]
[86343,"Königsbrunn","-16 °C"]
[79346,"Königschaffhausen","-12 °C"]
[82549,"Königsdorf","-18 °C"]
[78126,"Königsfeld","-16 °C"]
[2829,"Königshain","-16 °C"]
[9306,"Königshain","-14 °C"]
[38154,"Königslutter","-14 °C"]
[83471,"Königssee","-18 °C"]
[1824,"Königstein","-14 °C"]
[1824,"Königstein / OT Ebenheit","-14 °C"]
[61462,"Königstein/Taunus","-12 °C"]
[8412,"Königswalde","-14 °C"]
[53639,"Königswinter","-12 °C"]
[7336,"Könitz","-14 °C"]
[86872,"Konradshofen","-16 °C"]
[95176,"Konradsreuth","-18 °C"]
["7846x","Konstanz","-12 °C"]
[54329,"Konz","-10 °C"]
[52156,"Konzen","-14 °C"]
[71404,"Korb","-14 °C"]
[34497,"Korbach","-14 °C"]
[59519,"Körbecke","-12 °C"]
[39175,"Körbelitz","-14 °C"]
[6905,"Korgau","-14 °C"]
[77694,"Kork","-12 °C"]
[34327,"Körle","-12 °C"]
[96317,"Kornach","-16 °C"]
[4808,"Kornhain","-14 °C"]
[70825,"Korntal","-14 °C"]
[70806,"Kornwestheim","-12 °C"]
[41352,"Korschenbroich","-10 °C"]
[85092,"Kösching","-18 °C"]
[24354,"Kosel","-10 °C"]
[1609,"Koselitz","-16 °C"]
[17459,"Koserow","-12 °C"]
[52428,"Koslar","-12 °C"]
[4603,"Kosma","-14 °C"]
[4895,"Koßdorf","-16 °C"]
[4668,"Kössern","-14 °C"]
[3226,"Koßwig","-16 °C"]
[6366,"Köthen / Anhalt","-14 °C"]
[9249,"Köthensdorf","-14 °C"]
[2627,"Kotitz","-16 °C"]
[8223,"Kottengrün","-16 °C"]
[91189,"Kottensdorf","-16 °C"]
[1809,"Köttewitz","-14 °C"]
[82284,"Kottgeisering","-16 °C"]
[2730,"Kottmarsdorf","-16 °C"]
[93444,"Kötzting","-18 °C"]
[54340,"Köwerich","-10 °C"]
[19077,"Kraak","-12 °C"]
[19243,"Kraft","-12 °C"]
[7586,"Kraftsdorf","-14 °C"]
[53797,"Krahwinkel","-12 °C"]
[76703,"Kraichtal","-12 °C"]
[47559,"Kranenburg","-10 °C"]
[4889,"Kranichau","-16 °C"]
[99195,"Kranichborn","-14 °C"]
[99448,"Kranichfeld","-14 °C"]
[85402,"Kranzberg","-16 °C"]
[72505,"Krauchenwies","-14 °C"]
[2957,"Krauschwitz","-16 °C"]
[52355,"Krauthausen","-12 °C"]
[54673,"Krautscheid","-14 °C"]
[8538,"Krebes","-18 °C"]
[97839,"Kredenbach","-14 °C"]
[88637,"Kreenheinstetten","-16 °C"]
["47xxx","Krefeld","-10 °C"]
[37547,"Kreiensen","-16 °C"]
[1731,"Kreischa","-14 °C"]
[79761,"Krenkingen","-14 °C"]
[4509,"Krensitz","-14 °C"]
[19288,"Krenzliner Hütte","-12 °C"]
[88079,"Kressbronn","-12 °C"]
[52372,"Kreuzau","-12 °C"]
[16559,"Kreuzbruch","-14 °C"]
[16559,"Kreuzthal","-14 °C"]
[17094,"Krickow","-14 °C"]
[4617,"Kriebitzsch","-14 °C"]
[17391,"Krien","-12 °C"]
[65830,"Kriftel","-12 °C"]
[18198,"Kritzmow","-10 °C"]
[65510,"Kroftel","-14 °C"]
[6237,"Kröllwitz","-14 °C"]
[63829,"Krombach","-14 °C"]
[96317,"Kronach","-16 °C"]
[76709,"Kronau","-12 °C"]
[61476,"Kronberg","-14 °C"]
[39397,"Kroppenstedt","-14 °C"]
[17440,"Kröslin","-12 °C"]
[4509,"Krostitz","-14 °C"]
[54536,"Kröv","-10 °C"]
[56642,"Kruft","-14 °C"]
[86381,"Krumbach","-16 °C"]
[9633,"Krummenhennersdorf","-16 °C"]
[92703,"Krummennaab","-16 °C"]
[23974,"Krusenhagen","-10 °C"]
[1920,"Kuchau","-16 °C"]
[73329,"Kuchen","-16 °C"]
[86556,"Kühbach","-16 °C"]
[39524,"Kuhlhausen","-14 °C"]
[18225,"Kühlungsborn","-10 °C"]
[4420,"Kulkwitz","-14 °C"]
[95508,"Kulmain","-18 °C"]
[95326,"Kulmbach","-16 °C"]
[97900,"Külsheim","-14 °C"]
[92245,"Kümmersbruck","-16 °C"]
[2829,"Kunnersdorf","-16 °C"]
[7922,"Künsdorf","-16 °C"]
[74653,"Künzelsau","-14 °C"]
[94550,"Künzing","-18 °C"]
[74635,"Kupferzell","-16 °C"]
[71083,"Kuppingen","-16 °C"]
[96328,"Küps","-16 °C"]
[75057,"Kürnbach","-14 °C"]
[88427,"Kürnbach","-16 °C"]
[1737,"Kurort Hartha","-14 °C"]
[9484,"Kurort Oberwiesental","-18 °C"]
[9548,"Kurort Seiffen","-18 °C"]
[6543,"Kurort Wippra","-16 °C"]
[53773,"Kurscheid","-12 °C"]
[51515,"Kürten","-12 °C"]
[77974,"Kürzell","-12 °C"]
[91802,"Kurzenaltheim","-16 °C"]
[66869,"Kusel","-14 °C"]
[72127,"Kusterdingen","-16 °C"]
[97490,"Kützberg","-16 °C"]
[86500,"Kutzenhausen","-16 °C"]
[99955,"Kutzleben","-14 °C"]
[54655,"Kyllberg","-14 °C"]
[16866,"Kyritz","-14 °C"]
[67610,"La Wantzenau","-12 °C"]
[93164,"Laaber","-16 °C"]
[3205,"Laasow","-16 °C"]
[30880,"Laatzen","-14 °C"]
[47665,"Labbeck","-10 °C"]
[23898,"Labenz","-12 °C"]
[84082,"Laberweinting","-18 °C"]
[29331,"Lachendorf","-14 °C"]
[78655,"Lackendorf","-16 °C"]
[49549,"Ladbergen","-12 °C"]
[16321,"Ladeburg","-14 °C"]
[68526,"Ladenburg","-12 °C"]
[48366,"Laer","-12 °C"]
[32791,"Lage","-12 °C"]
[35633,"Lahnau","-12 °C"]
[56112,"Lahnstein","-12 °C"]
[77933,"Lahr / Schwarzwald","-12 °C"]
[31246,"Lahstedt","-14 °C"]
[89150,"Laichingen","-18 °C"]
[88069,"Laimnau","-14 °C"]
[93462,"Lam","-18 °C"]
[52152,"Lammersdorf","-14 °C"]
[68623,"Lampertheim","-12 °C"]
[1561,"Lampertswalde","-16 °C"]
[4758,"Lampertswalde","-14 °C"]
[31195,"Lamspringe","-16 °C"]
[94405,"Landau / Isar","-18 °C"]
[76829,"Landau / Pfalz","-12 °C"]
[89361,"Landensberg","-16 °C"]
[52379,"Landerwehe","-12 °C"]
[31628,"Landesbergen","-12 °C"]
[56814,"Landkern","-14 °C"]
[37136,"Landolfshausen","-16 °C"]
[6188,"Landsberg","-14 °C"]
[86899,"Landsberg am Lech","-16 °C"]
["840xx","Landshut / Bay.","-16 °C"]
["79xxx","Landwasser","-16 °C"]
[31087,"Landwehr","-16 °C"]
[52538,"Langbroich","-10 °C"]
[1844,"Langburkersdorf","-14 °C"]
[33014,"Langeland","-14 °C"]
[38871,"Langeln","-14 °C"]
[38685,"Langelsheim","-14 °C"]
[27607,"Langen","-10 °C"]
[49838,"Langen","-12 °C"]
[63225,"Langen / Hessen","-12 °C"]
[75334,"Langenalb","-14 °C"]
[88085,"Langenargen","-12 °C"]
[79650,"Langenau","-12 °C"]
[89129,"Langenau/Württ.","-16 °C"]
[35708,"Langenaubach","-14 °C"]
[33449,"Langenberg","-12 °C"]
[8428,"Langenbernsdorf","-14 °C"]
[74243,"Langenbeutingen","-14 °C"]
[75328,"Langenbrand","-16 °C"]
[74243,"Langenbrettach","-14 °C"]
[74595,"Langenburg","-16 °C"]
[6667,"Langendorf","-14 °C"]
[6729,"Langendorf","-14 °C"]
[44894,"Langendreer","-12 °C"]
[57368,"Langenei","-14 °C"]
[6268,"Langeneichstädt","-14 °C"]
[88515,"Langenenslingen","-14 °C"]
[91474,"Langenfeld","-16 °C"]
[40764,"Langenfeld / Rheinl.","-10 °C"]
["3085x","Langenhagen / Han.","-14 °C"]
[56459,"Langenhahn","-14 °C"]
[1819,"Langenhennersdorf","-14 °C"]
[8439,"Langenhessen","-14 °C"]
[1849,"Langenheunersdorf","-14 °C"]
[37154,"Langenholtensen","-16 °C"]
[32689,"Langenholzhausen","-14 °C"]
[25842,"Langenhorn","-10 °C"]
[55450,"Langenlonsheim","-12 °C"]
[85465,"Langenpreising","-16 °C"]
[97737,"Langenprozelten","-14 °C"]
[8439,"Langenreinsdorf","-14 °C"]
[6571,"Langenroda","-14 °C"]
[7407,"Langenschade","-14 °C"]
[65558,"Langenscheid","-12 °C"]
[78112,"Langenschiltach","-16 °C"]
[63505,"Langenselbold","-12 °C"]
[88515,"Langenslingen","-14 °C"]
[38895,"Langenstein","-14 °C"]
[9569,"Langenstriegis","-14 °C"]
[39171,"Langenweddingen","-14 °C"]
[90579,"Langenzenn","-16 °C"]
[26465,"Langeoog","-10 °C"]
[86853,"Langerringen","-16 °C"]
[52379,"Langerwehe","-12 °C"]
[98704,"Langewiesen","-16 °C"]
[29364,"Langlingen","-14 °C"]
[84085,"Langquaid","-18 °C"]
[30890,"Langreder","-14 °C"]
[27299,"Langwedel","-12 °C"]
[86462,"Langweid","-16 °C"]
[81249,"Langwied","-16 °C"]
[66894,"Langwieden","-12 °C"]
[19053,"Lankow","-12 °C"]
[19057,"Lankow","-12 °C"]
[19309,"Lanz","-14 °C"]
[93138,"Lappersdorf","-16 °C"]
[19246,"Lassahn","-12 °C"]
[49688,"Lastrup","-12 °C"]
[30926,"Lathwehren","-14 °C"]
[73453,"Laubach","-16 °C"]
[88416,"Laubach","-16 °C"]
[87493,"Lauben","-16 °C"]
[90579,"Laubendorf","-16 °C"]
[1979,"Lauchhammer","-16 °C"]
[1979,"Lauchhammer - Ost","-16 °C"]
[73466,"Lauchheim","-16 °C"]
[63925,"Laudenbach","-14 °C"]
[69514,"Laudenbach","-12 °C"]
[31867,"Lauenau","-14 °C"]
[37697,"Lauenförde","-12 °C"]
[1778,"Lauenstein","-16 °C"]
[31020,"Lauenstein","-14 °C"]
[77886,"Lauf","-14 °C"]
[91207,"Lauf","-16 °C"]
[54533,"Laufeld","-14 °C"]
[79295,"Laufen","-14 °C"]
[83410,"Laufen","-16 °C"]
[79725,"Laufenburg","-12 °C"]
[74348,"Lauffen a. N.","-12 °C"]
[89415,"Lauingen","-16 °C"]
[88437,"Laupertshausen","-16 °C"]
[88471,"Laupheim","-16 °C"]
[56379,"Laurenburg","-12 °C"]
[8491,"Lauschgrün","-16 °C"]
[79780,"Lausheim","-16 °C"]
[2627,"Lauske","-16 °C"]
[1936,"Laußnitz","-16 °C"]
[2991,"Lauta","-16 °C"]
[8312,"Lauter","-16 °C"]
[89584,"Lauterach","-14 °C"]
[1561,"Lauterbach","-16 °C"]
[9496,"Lauterbach","-16 °C"]
[78730,"Lauterbach","-16 °C"]
[86465,"Lauterbrunn","-16 °C"]
[67742,"Lauterecken","-12 °C"]
[92283,"Lauterhofen","-16 °C"]
[53501,"Lautershofen","-14 °C"]
[73111,"Lauterstein","-16 °C"]
[56355,"Lautert","-12 °C"]
[64686,"Lautertal-Elmshausen","-14 °C"]
[72459,"Lautlingen","-18 °C"]
[2708,"Lawalde","-16 °C"]
[66822,"Lebach","-12 °C"]
[17091,"Lebbin","-14 °C"]
[50374,"Lechenich","-12 °C"]
[86169,"Lechhausen","-16 °C"]
[49134,"Lechtingen","-12 °C"]
[64560,"Leeheim","-12 °C"]
[26789,"Leer / Ostfriesland","-10 °C"]
[90596,"Leerstetten","-16 °C"]
[28844,"Leeste","-12 °C"]
[19067,"Leezen","-12 °C"]
[87764,"Legau","-16 °C"]
[99438,"Legefeld","-14 °C"]
[77731,"Legelhurst","-12 °C"]
[7349,"Lehesten","-18 °C"]
[86732,"Lehmingen","-16 °C"]
[1920,"Lehndorf","-16 °C"]
[16565,"Lehnitz","-14 °C"]
[31275,"Lehrte","-14 °C"]
[76547,"Leiberstung","-12 °C"]
[88637,"Leibertingen","-16 °C"]
[94339,"Leiblfing","-18 °C"]
[42799,"Leichlingen","-10 °C"]
[63849,"Leidersbach","-14 °C"]
[72348,"Leidringen","-16 °C"]
[38542,"Leiferde","-14 °C"]
[23715,"leiferdeBosau","-12 °C"]
[69181,"Leimen","-12 °C"]
[53501,"Leimersdorf","-14 °C"]
[97274,"Leinach","-14 °C"]
[91227,"Leinburg","-16 °C"]
[70771,"Leinfelden-Echterdingen","-14 °C"]
[76829,"Leinsweiler","-12 °C"]
[73575,"Leinzell","-16 °C"]
[78187,"Leipferdingen","-16 °C"]
[89340,"Leipheim","-16 °C"]
[2991,"Leippe","-16 °C"]
["04xxx","Leipzig","-14 °C"]
[4277,"Leipzig-Connewitz","-14 °C"]
[4207,"Leipzig-Grünau","-14 °C"]
[4357,"Leipzig-Mockau","-14 °C"]
[4703,"Leisnig","-14 °C"]
[15848,"Leißnitz","-16 °C"]
[86391,"Leitershofen","-16 °C"]
[39279,"Leitzkau","-14 °C"]
[54340,"Leiwen","-10 °C"]
[16866,"Lellichow","-14 °C"]
[32657,"Lemgo","-12 °C"]
[23769,"Lemkenhafen","-10 °C"]
[7819,"Lemnitz","-14 °C"]
[4519,"Lemsel","-14 °C"]
[27809,"Lemwerder","-12 °C"]
[52355,"Lendersdorf","-12 °C"]
[9514,"Lengefeld","-16 °C"]
[27419,"Lengenborstel","-12 °C"]
[8485,"Lengenfeld","-16 °C"]
[86869,"Lengenfeld","-16 °C"]
[86932,"Lengenfeld","-16 °C"]
[49525,"Lengerich / Westf.","-12 °C"]
[36266,"Lengers","-14 °C"]
[83661,"Lenggries","-18 °C"]
[37627,"Lenne","-14 °C"]
[42897,"Lennep","-12 °C"]
[57368,"Lennestadt","-14 °C"]
[73252,"Lenningen","-16 °C"]
[23738,"Lensahn","-10 °C"]
[85101,"Lenting","-18 °C"]
[19309,"Lenzen","-14 °C"]
[79853,"Lenzkirch","-18 °C"]
[71229,"Leonberg","-12 °C"]
[95666,"Leonberg","-18 °C"]
[76344,"Leopoldshafen","-12 °C"]
[33818,"Leopoldshöhe","-12 °C"]
[39264,"Leps","-14 °C"]
[4720,"Leschen","-14 °C"]
[38228,"Lesse","-14 °C"]
[58642,"Letmathe","-12 °C"]
[8539,"Leubnitz","-16 °C"]
[9573,"Leubsdorf","-16 °C"]
[92705,"Leuchtenberg","-16 °C"]
[26180,"Leuchtenburg","-12 °C"]
[6237,"Leuna","-14 °C"]
[95191,"Leupoldsgrün","-18 °C"]
[88239,"Leupolz","-16 °C"]
[51570,"Leuscheid","-12 °C"]
[71397,"Leutenbach","-14 °C"]
[2794,"Leutersdorf","-16 °C"]
[69493,"Leutershausen","-12 °C"]
[77694,"Leutersheim","-12 °C"]
[56559,"Leutesdorf","-12 °C"]
[88299,"Leutkirch","-16 °C"]
["513xx","Leverkusen","-10 °C"]
[51371,"Leverkusen - Rheindorf","-10 °C"]
[51375,"Leverkusen - Schlebusch","-10 °C"]
[88356,"Levertsweiler","-14 °C"]
[35423,"Lich","-14 °C"]
[77839,"Lichtenau / Ulm","-12 °C"]
[9638,"Lichtenberg","-16 °C"]
[96215,"Lichtenfels","-16 °C"]
[9350,"Lichtenstein","-14 °C"]
[72805,"Lichtenstein","-18 °C"]
[8115,"Lichtentanne","-16 °C"]
[73669,"Lichtenwald","-16 °C"]
[9577,"Lichtenwalde","-14 °C"]
[16230,"Lichterfelde","-14 °C"]
[31618,"Liebenau","-12 °C"]
[38704,"Liebenburg","-14 °C"]
[16559,"Liebenwalde","-14 °C"]
[4445,"Liebertwolkwitz","-14 °C"]
[63584,"Lieblos","-14 °C"]
[65835,"Liederbach am Taunus","-14 °C"]
[76706,"Liedolsheim","-12 °C"]
[1465,"Liegau-Augustusbad","-14 °C"]
[79801,"Lienheim","-12 °C"]
[75417,"Lienzingen","-14 °C"]
[3238,"Lieskau","-16 °C"]
[1920,"Lieske","-16 °C"]
[28865,"Lilienthal","-12 °C"]
[1723,"Limbach","-14 °C"]
[74838,"Limbach","-14 °C"]
[9212,"Limbach-Oberfrohna","-14 °C"]
["655xxx","Limburg a.d.Lahn","-12 °C"]
[67117,"Limburgerhof","-12 °C"]
[88677,"Limpach","-14 °C"]
[73527,"Lindach","-16 °C"]
[88131,"Lindau / Bodensee","-12 °C"]
[94227,"Lindberg","-18 °C"]
[90592,"Lindelburg","-16 °C"]
[91459,"Linden","-16 °C"]
[17111,"Lindenberg","-14 °C"]
[65551,"Lindenholzhausen","-12 °C"]
[4158,"Lindenthal","-14 °C"]
[4466,"Lindenthal","-14 °C"]
[31698,"Lindhorst","-14 °C"]
[39326,"Lindhorst","-14 °C"]
[51789,"Lindlar","-12 °C"]
["498xx","Lingen / Ems","-10 °C"]
[56291,"Lingerhahn","-14 °C"]
[56317,"Linkenbach","-14 °C"]
[76347,"Linkenheim","-12 °C"]
[76351,"Linkenheim","-12 °C"]
[37627,"Linnenkamp","-14 °C"]
[52441,"Linnich","-12 °C"]
[31636,"Linsburg","-12 °C"]
[63589,"Linsengericht","-14 °C"]
[72636,"Linsenhofen","-16 °C"]
[92272,"Lintach","-16 °C"]
[1561,"Linz","-16 °C"]
[73463,"Lippach","-16 °C"]
[9509,"Lippersdorf","-16 °C"]
[59510,"Lippetal","-12 °C"]
[33129,"Lippling","-12 °C"]
["5955x","Lippstadt","-12 °C"]
[78576,"Liptingen","-16 °C"]
[54587,"Lissendorf","-14 °C"]
[25992,"List auf Sylt","-10 °C"]
[2999,"Litschen","-16 °C"]
[35719,"Lixfeld","-14 °C"]
[37639,"Lobach","-14 °C"]
[2708,"Löbau","-16 °C"]
[74931,"Lobbach","-12 °C"]
[6780,"Löberitz","-14 °C"]
[4509,"Löbnitz","-14 °C"]
[4685,"Lobschütz","-14 °C"]
[39279,"Loburg","-14 °C"]
[31547,"Loccum","-12 °C"]
[6184,"Lochau","-14 °C"]
[74369,"Löchgau","-12 °C"]
[81249,"Lochhausen","-16 °C"]
[17321,"Löcknitz","-14 °C"]
[14806,"Locktow","-14 °C"]
[23923,"Lockwisch","-10 °C"]
[39240,"Lödderitz","-14 °C"]
[39446,"Löderburg","-14 °C"]
[37139,"Lödingsen","-14 °C"]
[76597,"Loffenau","-14 °C"]
[79843,"Löffingen","-16 °C"]
[93470,"Lohberg","-18 °C"]
[85716,"Lohhof","-16 °C"]
[16845,"Lohm","-14 °C"]
[7907,"Löhma ü. Schleiz","-16 °C"]
[53797,"Lohmar","-12 °C"]
[1847,"Lohmen","-14 °C"]
[49393,"Lohne","-12 °C"]
[32584,"Löhne","-12 °C"]
[67727,"Lohnsfeld","-12 °C"]
[97816,"Lohr","-14 °C"]
[2999,"Lohsa","-16 °C"]
[4895,"Löhsten","-16 °C"]
[17509,"Loissin","-12 °C"]
[39326,"Loitsche","-14 °C"]
[17121,"Loitz","-12 °C"]
[1623,"Lommatzsch","-14 °C"]
[53945,"Lommersdorf ","-14 °C"]
[53919,"Lommersum","-14 °C"]
[1454,"Lomnitz","-14 °C"]
[2699,"Lomske","-16 °C"]
[54338,"Longen","-10 °C"]
[54340,"Longuich","-10 °C"]
[49624,"Löningen","-12 °C"]
[91475,"Lonnerstadt","-16 °C"]
[56295,"Lonnig","-14 °C"]
[89173,"Lonsee","-16 °C"]
[82813,"Lonsingen","-18 °C"]
[86720,"Löpsingen","-16 °C"]
[73547,"Lorch","-16 °C"]
[65391,"Lorch/Rheingau","-12 °C"]
["795xx","Lörrach","-12 °C"]
[64653,"Lorsch","-12 °C"]
[55296,"Lörzweiler","-12 °C"]
[1326,"Loschwitz","-14 °C"]
[66679,"Losheim am See","-12 °C"]
[58644,"Lössel","-12 °C"]
[8294,"Lößnitz","-16 °C"]
[4889,"Loßwig","-16 °C"]
[1665,"Löthain","-14 °C"]
[32816,"Lothe","-14 °C"]
[79807,"Lottstetten","-12 °C"]
[50859,"Lövenich b. Frechen","-10 °C"]
[14959,"Löwendorf","-14 °C"]
[37696,"Löwendorf","-14 °C"]
[74245,"Löwenstein","-14 °C"]
[27612,"Loxstedt","-10 °C"]
[32312,"Lübbecke","-12 °C"]
[15907,"Lübben","-16 °C"]
[3222,"Lübbenau / Spreewald","-16 °C"]
[23992,"Lübberstorf","-12 °C"]
["235xx","Lübeck","-10 °C"]
[17509,"Lubmin","-12 °C"]
[23972,"Lübow","-10 °C"]
[19386,"Lübz","-14 °C"]
[37671,"Lüchtringen","-12 °C"]
[4613,"Lucka","-14 °C"]
[3229,"Luckaitz","-16 °C"]
[15926,"Luckau","-16 °C"]
[57629,"Luckenbach","-14 °C"]
[2797,"Lückendorf","-16 °C"]
[14943,"Luckenwalde","-14 °C"]
[1920,"Lückersdorf-Gelenau","-16 °C"]
[44229,"Lücklemberg","-12 °C"]
[17375,"Luckow","-12 °C"]
[19243,"Luckwitz","-12 °C"]
["585xx","Lüdenscheid","-12 °C"]
[39517,"Lüderitz","-14 °C"]
[23992,"Lüdersdorf","-12 °C"]
[23992,"Lüderstorf","-12 °C"]
[59348,"Lüdinghausen","-12 °C"]
[36251,"Ludwigsau","-14 °C"]
["716xx","Ludwigsburg/Württ.","-12 °C"]
[2829,"Ludwigsdorf","-14 °C"]
[14974,"Ludwigsfelde","-14 °C"]
["670xx","Ludwigshafen am Rhein","-12 °C"]
[19288,"Ludwigslust","-14 °C"]
[66996,"Ludwigswinkel","-12 °C"]
[37635,"Lüerdissen","-14 °C"]
[3253,"Lugau","-16 °C"]
[9385,"Lugau","-14 °C"]
[32676,"Lügde","-14 °C"]
[31711,"Luhden","-14 °C"]
[92706,"Luhe","-16 °C"]
[17495,"Lühmannsdorf","-12 °C"]
[24816,"Luhnstedt","-12 °C"]
[85235,"Lukka","-16 °C"]
[6869,"Luko","-14 °C"]
["2133x","Lüneburg","-12 °C"]
["4453x","Lünen","-12 °C"]
[44532,"Lünen - Horstmar","-12 °C"]
[59427,"Lünern","-12 °C"]
[48480,"Lünne","-12 °C"]
[9328,"Lunzenau","-14 °C"]
[41065,"Lürrip","-10 °C"]
[24850,"Lürschau","-12 °C"]
[14806,"Lüsse","-14 °C"]
[17506,"Lüssow","-12 °C"]
[24321,"Lütjenburg","-10 °C"]
[22952,"Lütjensee","-12 °C"]
[37671,"Lütmarsen","-14 °C"]
[17258,"Lüttenhagen","-14 °C"]
[37318,"Lutter","-16 °C"]
[38729,"Lutter am Barenberg","-14 °C"]
[34355,"Lutterberg","-12 °C"]
[4721,"Lüttewitz","-14 °C"]
[79725,"Luttingen","-12 °C"]
[46509,"Lüttingen","-10 °C"]
[4769,"Lüttnitz","-14 °C"]
[2627,"Luttowizt","-16 °C"]
[42899,"Lüttringhausen","-12 °C"]
[86456,"Lützelburg","-16 °C"]
[35398,"Lützellinden","-14 °C"]
[6686,"Lützen","-14 °C"]
[72178,"Lützenhardt","-16 °C"]
[56826,"Lutzerath","-14 °C"]
[89440,"Lutzingen","-16 °C"]
[4159,"Lützschena","-14 °C"]
[4469,"Lützschena","-16 °C"]
[56729,"Luxem","-14 °C"]
[17279,"Lychen","-14 °C"]
[24404,"Maasholm-Bad","-10 °C"]
[4827,"Machern","-14 °C"]
[89150,"Machtolsheim ","-18 °C"]
[31177,"Machtsum","-14 °C"]
[67686,"Mackenbach","-12 °C"]
[37318,"Mackenrode","-16 °C"]
[55758,"Mackenrodt","-14 °C"]
["3912x","Magdeburg","-14 °C"]
[6493,"Mägdesprung","-16 °C"]
[72818,"Mägerkingen","-18 °C"]
[71106,"Magstadt","-16 °C"]
[94508,"Mahd","-18 °C"]
[4874,"Mahitschen","-16 °C"]
[15831,"Mahlow","-14 °C"]
[39517,"Mahlwinkel","-14 °C"]
[89081,"Mähringen","-16 °C"]
[35510,"Maibach","-14 °C"]
[71069,"Maichingen","-16 °C"]
[86747,"Maihingen","-16 °C"]
[84048,"Mainburg","-18 °C"]
[74535,"Mainhardt","-16 °C"]
[95336,"Mainleus","-16 °C"]
[63477,"Maintal","-12 °C"]
["551xx","Mainz","-12 °C"]
[55246,"Mainz-Kostheim","-12 °C"]
[82216,"Maisach","-16 °C"]
[75378,"Maisenbach","-16 °C"]
[73037,"Maitis","-16 °C"]
[17213,"Malchow","-14 °C"]
[84066,"Mallersdorf","-18 °C"]
[19294,"Malliß","-12 °C"]
[71272,"Malmsheim","-16 °C"]
[69254,"Malsch","-12 °C"]
[76316,"Malsch","-12 °C"]
[2694,"Malschwitz","-16 °C"]
[79364,"Malterdingen","-12 °C"]
[2627,"Maltitz","-16 °C"]
[57636,"Mammelzen","-14 °C"]
[82291,"Mammendorf","-16 °C"]
[94437,"Mamming","-18 °C"]
[35716,"Mandeln","-14 °C"]
[31535,"Mandelsloh","-12 °C"]
[54531,"Manderscheid","-14 °C"]
["68xxx","Mannheim","-12 °C"]
[96257,"Mannsgereuth","-16 °C"]
[6343,"Mansfeld","-14 °C"]
[79588,"Mappach","-12 °C"]
[9661,"Marbach","-14 °C"]
[71672,"Marbach","-12 °C"]
[72532,"Marbach","-18 °C"]
[78056,"Marbach","-18 °C"]
[94536,"Marbach","-18 °C"]
["3503x","Marburg/Lahn","-12 °C"]
[31535,"Mardorf","-14 °C"]
[85447,"Maria Thalheim","-16 °C"]
[94424,"Mariakirchen","-16 °C"]
[31863,"Marienau","-14 °C"]
[9496,"Marienberg","-16 °C"]
[97828,"Marienbrunn","-14 °C"]
[31094,"Marienhagen","-14 °C"]
[34516,"Marienhagen","-14 °C"]
[51709,"Marienheide","-12 °C"]
[37696,"Marienmünster","-14 °C"]
[54484,"Maring-Noviand","-12 °C"]
[88677,"Markdorf","-14 °C"]
[97980,"Markelsheim","-16 °C"]
[9236,"Markersdorf","-14 °C"]
[15528,"Markgrafpieske","-14 °C"]
[71706,"Markgröningen","-12 °C"]
[4416,"Markkleeberg","-14 °C"]
[31608,"Marklohe","-12 °C"]
[8258,"Markneukirchen","-18 °C"]
[4420,"Markranstädt","-14 °C"]
[79576,"Märkt","-12 °C"]
[91801,"Markt Berolzheim","-16 °C"]
[91459,"Markt Erlbach","-16 °C"]
[85229,"Markt Indersdorf","-16 °C"]
[85570,"Markt Schwaben","-16 °C"]
[91613,"Marktbergel","-16 °C"]
[91477,"Markt-Bibart","-16 °C"]
[96257,"Marktgraitz","-16 °C"]
[97828,"Marktheidenfeld","-14 °C"]
[95352,"Marktleugast","-16 °C"]
[95168,"Marktleuthen","-18 °C"]
[87616,"Marktoberdorf","-16 °C"]
[95615,"Marktredwitz","-18 °C"]
[83487,"Marktschellenberg","-18 °C"]
[95509,"Marktschorgast","-16 °C"]
["457xx","Marl","-10 °C"]
[77694,"Marlen","-12 °C"]
[18337,"Marlow","-12 °C"]
[53947,"Marmagen","-14 °C"]
[21077,"Marmstorf/Hamburg","-12 °C"]
[82362,"Marnbach","-16 °C"]
[66646,"Marpingen","-12 °C"]
[83250,"Marquartstein","-18 °C"]
[97340,"Martinsheim","-16 °C"]
[75387,"Martinsmoos","-16 °C"]
[16727,"Marwitz","-14 °C"]
[86688,"Marxheim","-16 °C"]
[76359,"Marxzell","-14 °C"]
[88437,"Maselheim","-16 °C"]
[92242,"Massenricht","-16 °C"]
[84323,"Massing","-16 °C"]
[23972,"Maßlow","-10 °C"]
[56869,"Mastershausen","-14 °C"]
[66909,"Matzenbach","-12 °C"]
[67067,"Maudach","-12 °C"]
[69256,"Mauer","-12 °C"]
[75181,"Mauerach","-14 °C"]
[75181,"Mauerach","-14 °C"]
[85419,"Mauern","-16 °C"]
[75433,"Maulbronn","-14 °C"]
[79689,"Maulburg","-12 °C"]
[57635,"Maulsbach","-14 °C"]
[67133,"Maxdorf","-12 °C"]
[1809,"Maxen","-14 °C"]
[93142,"Maxhütte","-16 °C"]
[56727,"Mayen","-14 °C"]
[53508,"Mayschoß","-14 °C"]
[29416,"Mechau","-14 °C"]
[8541,"Mechelgrün","-16 °C"]
[53894,"Mechernich","-14 °C"]
[16866,"Mechow","-14 °C"]
[67354,"Mechtersheim","-12 °C"]
[88074,"Meckenbeuren","-14 °C"]
[53340,"Meckenheim","-14 °C"]
[74909,"Meckesheim","-12 °C"]
[67744,"Medard","-12 °C"]
[59964,"Medebach","-16 °C"]
[35767,"Medenbach","-14 °C"]
[1458,"Medingen","-14 °C"]
[8393,"Meerane","-14 °C"]
[31715,"Meerbeck","-14 °C"]
[40667,"Meerbusch","-10 °C"]
[88709,"Meersburg/Bodensee","-12 °C"]
[24799,"Meggerdorf","-12 °C"]
[4889,"Mehderitzsch","-16 °C"]
[67735,"Mehlbach","-12 °C"]
[8539,"Mehlteuer","-16 °C"]
[46499,"Mehrhoog","-10 °C"]
[54346,"Mehring","-10 °C"]
[16356,"Mehrow","-14 °C"]
[31249,"Mehrum","-14 °C"]
[46562,"Mehrum","-10 °C"]
[72531,"Meidelstetten","-18 °C"]
[38527,"Meine","-14 °C"]
[34497,"Meineringhausen","-14 °C"]
[9390,"Meinersdorf","-14 °C"]
[58540,"Meinerzhagen","-12 °C"]
[37276,"Meinhard","-16 °C"]
[91802,"Meinheim","-16 °C"]
[98617,"Meiningen","-16 °C"]
[6862,"Meinsdorf","-14 °C"]
[55590,"Meisenheim","-12 °C"]
[1662,"Meißen","-14 °C"]
[77974,"Meißenheim","-12 °C"]
[37290,"Meißner","-14 °C"]
[59602,"Meiste","-14 °C"]
[75323,"Meistern","-16 °C"]
[86405,"Meitingen","-16 °C"]
[21406,"Melbeck","-12 °C"]
[99097,"Melchendorf","-14 °C"]
[72393,"Melchingen","-18 °C"]
[88145,"Mellatz","-16 °C"]
[49324,"Melle","-12 °C"]
[27249,"Mellinghausen","-12 °C"]
[97638,"Mellrichstadt","-16 °C"]
[4860,"Melpitz","-16 °C"]
[34212,"Melsungen","-12 °C"]
[96117,"Memmelsdorf","-16 °C"]
[87700,"Memmingen","-16 °C"]
[87766,"Memmingerberg","-16 °C"]
[77866,"Memprechtshofen","-12 °C"]
[58708,"Menden/Sauerland","-12 °C"]
[2894,"Mengelsdorf","-16 °C"]
[88512,"Mengen","-14 °C"]
[88512,"Mengen-Ennetach","-14 °C"]
[84152,"Mengkofen","-18 °C"]
[49637,"Menslage","-12 °C"]
[49716,"Meppen","-10 °C"]
[86504,"Merching","-16 °C"]
[74747,"Merchingen","-14 °C"]
[89522,"Mergelstetten","-16 °C"]
[86415,"Mering","-16 °C"]
[96117,"Merkendorf","-16 °C"]
[71263,"Merklingen","-16 °C"]
[89188,"Merklingen","-16 °C"]
[52134,"Merkstein","-12 °C"]
[4639,"Merlach","-14 °C"]
["L-7513","Mersch (Luxemburg)","-14 °C"]
[6217,"Merseburg/Saale","-14 °C"]
[54318,"Mertesdorf","-12 °C"]
[67271,"Mertesheim","-12 °C"]
[55627,"Merxheim","-12 °C"]
[52399,"Merzenich","-12 °C"]
[79249,"Merzhausen","-14 °C"]
[66663,"Merzig","-12 °C"]
[59872,"Meschede","-14 °C"]
[17498,"Mesekenhagen","-12 °C"]
[8527,"Meßbach","-16 °C"]
[64409,"Messel","-12 °C"]
[88605,"Meßkirch","-14 °C"]
[72469,"Meßstetten","-18 °C"]
[23972,"Metelsdorf","-10 °C"]
[94526,"Metten/Niederbay.","-18 °C"]
[66693,"Mettlach","-12 °C"]
[40822,"Mettmann","-12 °C"]
[55777,"Mettweiler","-14 °C"]
[72555,"Metzingen","-16 °C"]
[6686,"Meuchen","-14 °C"]
[1994,"Meuro","-16 °C"]
[6217,"Meuschau","-14 °C"]
[16306,"Meyenburg","-16 °C"]
[2979,"Michacken","-16 °C"]
[96247,"Michelau","-16 °C"]
[97782,"Michelau","-14 °C"]
[74858,"Michelbach","-12 °C"]
[74613,"Michelbach am Wald","-14 °C"]
[74544,"Michelbach an der Bilz","-16 °C"]
[74545,"Michelfeld","-16 °C"]
[74918,"Michelfeld","-12 °C"]
[88339,"Michelwinnaden","-16 °C"]
[12051,"Michendorf","-14 °C"]
[86866,"Mickhausen","-14 °C"]
[83714,"Miesbach","-18 °C"]
[77933,"Mietersheim","-12 °C"]
[88487,"Mietingen","-16 °C"]
[52538,"Millen","-10 °C"]
[93468,"Miltach","-18 °C"]
[17091,"Miltitzwalde","-14 °C"]
[89350,"Mindelaltheim","-16 °C"]
[87719,"Mindelheim","-16 °C"]
[86513,"Mindelzell","-16 °C"]
["3242x","Minden/Westf.","-12 °C"]
[76872,"Minfeld","-12 °C"]
[19079,"Mirow","-12 °C"]
[30629,"Misburg","-14 °C"]
[91785,"Mischelbach","-16 °C"]
[4720,"Mischütz","-14 °C"]
[27632,"Misselwarden","-10 °C"]
[95490,"Mistelgau","-16 °C"]
[56729,"Mittelbaar","-14 °C"]
[87466,"Mittelberg b. Oy","-18 °C"]
[88441,"Mittelbiberach","-16 °C"]
[88416,"Mittelbuch","-16 °C"]
[91734,"Mitteleschenbach","-16 °C"]
[99195,"Mittelhausen","-14 °C"]
[2763,"Mittelherwigsdorf","-16 °C"]
[86868,"Mittelneufnach","-16 °C"]
[88682,"Mittelstenweiler","-14 °C"]
[72270,"Mitteltal","-16 °C"]
[35756,"Mittenaar","-12 °C"]
[82481,"Mittenwald","-16 °C"]
[94360,"Mitterfels","-18 °C"]
[95666,"Mitterteich","-18 °C"]
[9648,"Mittweida","-14 °C"]
[96268,"Mitwitz","-16 °C"]
[9661,"Mobendorf","-14 °C"]
[4720,"Möbertitz","-14 °C"]
[4720,"Mochau","-14 °C"]
[6888,"Mochau","-14 °C"]
[74219,"Möckmühl","-14 °C"]
[4838,"Mockrehna","-14 °C"]
[4720,"Mockritz","-14 °C"]
[4860,"Mockritz","-16 °C"]
[6193,"Möderau","-14 °C"]
[19374,"Möderitz","-14 °C"]
[89426,"Mödingen","-16 °C"]
["4744x","Moers","-10 °C"]
[73563,"Mögglingen","-16 °C"]
["CH","Möhlin / Schweiz (PLZ:4314)","-12 °C"]
[59519,"Möhnesee","-12 °C"]
[86498,"Mohrenhausen","-16 °C"]
[70567,"Möhringen","-14 °C"]
[23560,"Moisling","-12 °C"]
[49696,"Molbergen","-12 °C"]
[4579,"Mölbis","-14 °C"]
[4838,"Mölbitz","-14 °C"]
[4457,"Mölkau","-14 °C"]
[17237,"Möllenbeck","-14 °C"]
[17091,"Mölln","-14 °C"]
[23879,"Mölln","-12 °C"]
[57482,"Möllnicke","-14 °C"]
[99869,"Molschleben","-14 °C"]
[18246,"Moltenow","-12 °C"]
[55278,"Mommenheim","-12 °C"]
[75378,"Monakam","-14 °C"]
[71083,"Mönchberg","-16 °C"]
["4106x","Mönchengladbach","-10 °C"]
[78087,"Mönchweiler","-18 °C"]
[53859,"Mondorf","-12 °C"]
[86653,"Monheim","-16 °C"]
[40789,"Monheim/Rheinl.","-10 °C"]
[17375,"Mönkebude","-12 °C"]
[52156,"Monschau","-14 °C"]
[67590,"Monsheim","-12 °C"]
[71297,"Mönsheim","-14 °C"]
[82271,"Moorenweis","-16 °C"]
[77815,"Moos","-12 °C"]
[87493,"Moos","-16 °C"]
[94554,"Moos","-18 °C"]
[89613,"Moosbeuren","-16 °C"]
[76571,"Moosbronn","-14 °C"]
[85368,"Moosburg/Isar","-16 °C"]
[84164,"Moosthenning","-18 °C"]
[54497,"Morbach","-14 °C"]
[67700,"Morbach","-12 °C"]
[71577,"Morbach","-16 °C"]
[99735,"Mörbach","-14 °C"]
[53913,"Morenhoven","-14 °C"]
[64546,"Mörfelden-Walldorf","-12 °C"]
[8262,"Morgenröthe","-18 °C"]
[37186,"Moringen","-16 °C"]
[1468,"Moritzburg","-14 °C"]
[6193,"Morl","-14 °C"]
[61161,"Mörlach","-16 °C"]
[69509,"Mörlenbach","-12 °C"]
[91804,"Mörnsheim","-16 °C"]
[51597,"Morsbach","-12 °C"]
[76287,"Mörsch","-12 °C"]
[55758,"Mörschied","-14 °C"]
[4838,"Mörtitz","-14 °C"]
[2999,"Mortka","-16 °C"]
[14806,"Mörz","-14 °C"]
[76829,"Mörzheim","-12 °C"]
[74821,"Mosbach","-12 °C"]
[7973,"Moschwitz","-16 °C"]
[56073,"Moselweiß","-14 °C"]
[39291,"Möser/Magdeburg","-14 °C"]
[null,"Moskau","-16 °C"]
[72116,"Mössingen","-18 °C"]
[14715,"Möthlow","-14 °C"]
[86753,"Möttingen","-16 °C"]
[75378,"Möttlingen","-16 °C"]
[71159,"Mötzingen","-16 °C"]
[7381,"Moxa","-14 °C"]
[53804,"Much","-12 °C"]
[35325,"Mücke","-14 °C"]
[69427,"Mudau","-16 °C"]
[19063,"Mueß","-12 °C"]
[4769,"Mügeln","-14 °C"]
[79674,"Muggenbrunn","-18 °C"]
[91346,"Muggendorf","-16 °C"]
[76461,"Muggensturm","-12 °C"]
[75417,"Mühlacker","-14 °C"]
[9241,"Mühlau","-14 °C"]
[9557,"Mühlbach","-14 °C"]
[75031,"Mühlbach","-14 °C"]
[4931,"Mühlberg","-16 °C"]
[99869,"Mühlberg","-14 °C"]
[84453,"Mühldorf","-16 °C"]
[77796,"Mühlenbach","-16 °C"]
[16567,"Mühlenbeck","-14 °C"]
[8626,"Mühlhausen","-18 °C"]
[69242,"Mühlhausen","-12 °C"]
[78056,"Mühlhausen","-18 °C"]
[86444,"Mühlhausen","-16 °C"]
[92360,"Mühlhausen","-16 °C"]
[99974,"Mühlhausen","-14 °C"]
[73347,"Mühlhausen im Täle","-16 °C"]
[72172,"Mühlheim","-16 °C"]
[78570,"Mühlheim / Donau","-16 °C"]
[63165,"Mühlheim/Main","-12 °C"]
[90453,"Mühlhof","-16 °C"]
[7919,"Mühltroff","-16 °C"]
[91735,"Muhr am See","-16 °C"]
[9619,"Mulda","-16 °C"]
[8269,"Muldenberg","-18 °C"]
[53945,"Mülheim","-14 °C"]
["4547x","Mülheim/Ruhr","-10 °C"]
[79379,"Müllheim","-12 °C"]
[15299,"Müllrose","-16 °C"]
[8132,"Mülsen bei St. Jacob","-14 °C"]
["CH","Mumpf / Schweiz (PLZ 4322)","-12 °C"]
[95213,"Münchberg","-18 °C"]
[15748,"Münchehofe","-14 °C"]
["8xxxx","München","-16 °C"]
[35759,"Münchhausen","-14 °C"]
[70825,"Münchingen","-14 °C"]
[84034,"Münchnerau","-16 °C"]
[41516,"Münchrath","-10 °C"]
[94439,"Münchsdorf","-16 °C"]
[77955,"Münchweier","-12 °C"]
[66981,"Münchweiler","-12 °C"]
[78183,"Mundelfingen","-16 °C"]
[74395,"Mundelsheim","-12 °C"]
[89597,"Munderkingen","-14 °C"]
[79312,"Mundingen","-12 °C"]
[50933,"Müngersdorf","-12 °C"]
[82541,"Münsing","-16 °C"]
[72525,"Münsingen/Württ.","-16 °C"]
[29633,"Munster","-14 °C"]
[65618,"Münster","-14 °C"]
["481xx","Münster","-12 °C"]
[86692,"Münster/Lech","-16 °C"]
[56294,"Münstermaifeld","-12 °C"]
[79244,"Münstertal","-18 °C"]
[35516,"Münzenberg","-14 °C"]
[76703,"Münzesheim","-12 °C"]
[86757,"Munzingen","-16 °C"]
[79730,"Murg","-12 °C"]
[82418,"Murnau","-16 °C"]
[71711,"Murr","-12 °C"]
[71540,"Murrhardt","-16 °C"]
[9228,"Murschnitz","-14 °C"]
[88371,"Musbach","-14 °C"]
[6679,"Muschwitz","-14 °C"]
[46395,"Mussum","-10 °C"]
[73557,"Mutlangen","-16 °C"]
[76307,"Mutschelbach","-14 °C"]
[88456,"Muttensweiler","-16 °C"]
[67112,"Mutterstadt","-12 °C"]
[14823,"Mützdorf","-14 °C"]
[39307,"Mützel","-14 °C"]
[54608,"Mützenich","-14 °C"]
[4688,"Mutzschen","-14 °C"]
[41849,"Myhl","-10 °C"]
[8499,"Mylau","-16 °C"]
[73230,"Nabern","-16 °C"]
[55299,"Nackenheim","-12 °C"]
[6785,"Naderkau","-14 °C"]
[72202,"Nagold","-16 °C"]
[86720,"Nähermemmingen","-16 °C"]
[7973,"Naitschau","-16 °C"]
[66809,"Nalbach","-12 °C"]
[85405,"Nandlstadt","-16 °C"]
[2979,"Nardt","-16 °C"]
[4657,"Narsdorf","-14 °C"]
[27404,"Nartum","-12 °C"]
[23936,"Naschendorf","-10 °C"]
[4758,"Nasenberg","-14 °C"]
[29857,"Natendorf","-14 °C"]
[89564,"Nattheim","-16 °C"]
[14641,"Nauen","-14 °C"]
[64569,"Nauheim","-12 °C"]
[6618,"Naumburg","-14 °C"]
[34311,"Naumburg","-14 °C"]
[1796,"Naundorf","-14 °C"]
[4683,"Naunhof","-14 °C"]
[4703,"Naunhof","-14 °C"]
[56237,"Nauort","-14 °C"]
[65207,"Naurod","-14 °C"]
[6571,"Nausitz","-14 °C"]
[1920,"Naußlitz","-16 °C"]
[71126,"Nebringen","-16 °C"]
[74924,"Neckarbischofsheim","-12 °C"]
[69151,"Neckargemünd","-12 °C"]
[69437,"Neckargerach","-12 °C"]
[72622,"Neckarhausen","-14 °C"]
[71686,"Neckarrems","-12 °C"]
[74172,"Neckarsulm","-12 °C"]
[72666,"Neckartailfingen","-14 °C"]
[72654,"Neckartenzlingen","-16 °C"]
[74382,"Neckarwestheim","-12 °C"]
[74865,"Neckarzimmern","-12 °C"]
[17039,"Neddemin","-14 °C"]
[26802,"Neermoor","-10 °C"]
[21398,"Neetze","-12 °C"]
[37643,"Negenborn","-14 °C"]
["597xx","Neheim-Hüsten","-12 °C"]
[6193,"Nehlitz","-14 °C"]
[72147,"Nehren","-16 °C"]
[73272,"Neidlingen","-16 °C"]
[74336,"Neipperg","-12 °C"]
[57638,"Neitersen","-14 °C"]
[73760,"Nellingen","-14 °C"]
[89191,"Nellingen","-18 °C"]
[72149,"Nellingsheim","-16 °C"]
[71397,"Nellmersbach","-14 °C"]
[6268,"Nemsdorf","-14 °C"]
[78532,"Nendingen","-16 °C"]
[56412,"Nentershausen","-14 °C"]
[4828,"Nepperwitz","-16 °C"]
[4685,"Nerchau","-14 °C"]
[54570,"Neroth","-14 °C"]
[14806,"Neschholz","-14 °C"]
[2699,"Neschwitz","-16 °C"]
[27612,"Nesse","-10 °C"]
[77767,"Nesselried","-12 °C"]
[57250,"Netphen","-14 °C"]
[53947,"Nettersheim","-14 °C"]
[41334,"Nettetal","-10 °C"]
[31185,"Nettlingen","-14 °C"]
[31099,"Netze","-16 °C"]
[17440,"Netzelkow","-12 °C"]
[8491,"Netzschkau","-16 °C"]
[61267,"Neu Anspach","-14 °C"]
[2699,"Neu Jeßnitz","-16 °C"]
[17348,"Neu Käbelich","-14 °C"]
[6449,"Neu Königsaue","-14 °C"]
[2829,"Neu Krauscha","-16 °C"]
[18586,"Neu Reddevitz","-10 °C"]
[55546,"Neu-Bamberg","-12 °C"]
[24879,"Neuberend","-10 °C"]
[83115,"Neubeuern","-18 °C"]
["1703x","Neubrandenburg","-14 °C"]
[73453,"Neubronn","-16 °C"]
[75387,"Neubulach","-16 °C"]
[76776,"Neuburg","-12 °C"]
[74861,"Neudenau","-12 °C"]
[78166,"Neudingen","-16 °C"]
[76676,"Neudorf","-12 °C"]
[1920,"Neudörfel","-16 °C"]
[8543,"Neudörfel","-16 °C"]
[2739,"Neueibau","-16 °C"]
[33100,"Neuenbeken","-14 °C"]
[75305,"Neuenbürg","-14 °C"]
["7939x","Neuenburg am Rhein","-12 °C"]
[18516,"Neuendorf","-12 °C"]
[15518,"Neuendorf im Sande","-14 °C"]
[15366,"Neuenhagen","-14 °C"]
[72631,"Neuenhaus","-14 °C"]
[39345,"Neuenhofe","-14 °C"]
[17498,"Neuenkirchen","-12 °C"]
[28790,"Neuenkirchen","-10 °C"]
[29643,"Neuenkirchen","-12 °C"]
[48485,"Neuenkirchen","-12 °C"]
[49434,"Neuenkirchen","-12 °C"]
[18445,"Neuenpleen","-10 °C"]
[8451,"Neuensalz","-16 °C"]
[74196,"Neuenstadt","-12 °C"]
[36286,"Neuenstein","-16 °C"]
[84088,"Neufahrn","-18 °C"]
[85375,"Neufahrn","-18 °C"]
[72639,"Neuffen","-16 °C"]
[85464,"Neufinsing","-16 °C"]
[72419,"Neufra","-16 °C"]
[88499,"Neufra","-14 °C"]
[88682,"Neufrach","-14 °C"]
[84181,"Neufraunhofen","-16 °C"]
[2727,"Neugersdorf","-16 °C"]
[85659,"Neuharting","-16 °C"]
[19273,"Neuhaus","-12 °C"]
[37603,"Neuhaus","-14 °C"]
[91284,"Neuhaus","-16 °C"]
[67547,"Neuhausen","-12 °C"]
[72555,"Neuhausen","-16 °C"]
[73765,"Neuhausen","-14 °C"]
[75242,"Neuhausen","-14 °C"]
[89291,"Neuhausen","-16 °C"]
[75382,"Neuhengstett","-14 °C"]
[1920,"Neuhof","-16 °C"]
[90616,"Neuhof a. d. Zenn","-16 °C"]
[67141,"Neuhofen","-12 °C"]
[16515,"Neuholland","-14 °C"]
[63263,"Neu-Isenburg","-12 °C"]
[2699,"Neu-Jessnitz","-16 °C"]
[1904,"Neukirch","-16 °C"]
[1936,"Neukirch","-16 °C"]
[88099,"Neukirch","-14 °C"]
[8459,"Neukirchen","-14 °C"]
[23779,"Neukirchen","-10 °C"]
[92259,"Neukirchen","-16 °C"]
[93453,"Neukirchen","-18 °C"]
[94127,"Neukirchen","-16 °C"]
[94362,"Neukirchen","-18 °C"]
[94154,"Neukirchen v. W.","-16 °C"]
[47506,"Neukirchen-Vluyn","-10 °C"]
[23992,"Neukloster","-12 °C"]
[21710,"Neuland, Kr. Stade","-10 °C"]
[98744,"Neu-Leibis","-16 °C"]
[73491,"Neuler","-16 °C"]
[75245,"Neulingen","-14 °C"]
[68809,"Neulußheim","-12 °C"]
[54347,"Neumagen","-10 °C"]
[15306,"Neu-Mahlisch","-16 °C"]
[92318,"Neumarkt","-16 °C"]
["2453x","Neumünster","-12 °C"]
[8527,"Neundorf","-16 °C"]
[39418,"Neundorf","-14 °C"]
[73479,"Neunheim","-16 °C"]
[57520,"Neunkhausen","-14 °C"]
[53819,"Neunkirchen","-12 °C"]
[57290,"Neunkirchen","-14 °C"]
[74867,"Neunkirchen","-12 °C"]
[91233,"Neunkirchen","-16 °C"]
[91077,"Neunkirchen a.B.","-16 °C"]
["665xx","Neunkirchen/Saar","-12 °C"]
[91567,"Neunstetten","-16 °C"]
[84524,"Neuötting","-16 °C"]
[6333,"Neuplatendorf","-14 °C"]
[2699,"Neupuschwitz","-16 °C"]
[41517,"Neurath","-12 °C"]
[76149,"Neureut","-12 °C"]
[77743,"Neuried","-12 °C"]
[16816,"Neuruppin","-14 °C"]
[2742,"Neusalza-Spremberg","-16 °C"]
[86356,"Neusäß","-16 °C"]
[91330,"Neuses","-16 °C"]
[91616,"Neusitz","-16 °C"]
[95700,"Neusorg","-18 °C"]
[41363,"Neu-Spenrath","-12 °C"]
["4146x","Neuss","-10 °C"]
[41472,"Neuss - Grefrath","-10 °C"]
[41470,"Neuss - Rosellen","-10 °C"]
[1844,"Neustadt","-14 °C"]
[53577,"Neustadt","-14 °C"]
[71336,"Neustadt","-14 °C"]
[92660,"Neustadt","-16 °C"]
[19306,"Neustadt - Glewe","-14 °C"]
[35279,"Neustadt (Hessen)","-14 °C"]
[95514,"Neustadt a. Kulm","-16 °C"]
[31535,"Neustadt am Rübenberge","-14 °C"]
[91413,"Neustadt an der Aisch","-16 °C"]
[96465,"Neustadt bei Coburg","-16 °C"]
[93333,"Neustadt/Donau","-18 °C"]
[7806,"Neustadt/Orla","-14 °C"]
[67433,"Neustadt/Weinstraße","-10 °C"]
[72149,"Neustetten","-16 °C"]
[17235,"Neustrelitz","-14 °C"]
[17268,"Neu-Temmen","-14 °C"]
[76689,"Neuthard","-12 °C"]
[93073,"Neutraubling","-16 °C"]
[15320,"Neutrebbin","-14 °C"]
["8923x","Neu-Ulm","-14 °C"]
[30916,"Neuwarmbüchen","-14 °C"]
[39393,"Neuwegersleben","-14 °C"]
[76534,"Neuweier","-14 °C"]
[71093,"Neuweiler","-16 °C"]
[75389,"Neuweiler","-16 °C"]
[4828,"Neuweißenborn","-14 °C"]
[41066,"Neuwerk","-10 °C"]
["5656x","Neuwied","-12 °C"]
[23816,"Neversdorf","-12 °C"]
["4254x","Neviges","-12 °C"]
[54309,"Newel","-14 °C"]
[3253,"Nexdorf","-16 °C"]
[56645,"Nickenich","-14 °C"]
[4703,"Nicollschwitz","-14 °C"]
[63667,"Nidda","-12 °C"]
[61194,"Niddatal","-12 °C"]
[61130,"Nidderau-Windecken","-12 °C"]
[52385,"Nideggen","-14 °C"]
[75210,"Niebelsbach","-14 °C"]
[7580,"Niebra","-14 °C"]
[65934,"Nied","-12 °C"]
[34305,"Niedenstein","-14 °C"]
[2906,"Nieder Seifersdorf","-16 °C"]
[56729,"Niederbaar","-14 °C"]
[53343,"Niederbachem","-14 °C"]
[9627,"Niederbobritzsch","-16 °C"]
[65611,"Niederbrechen","-12 °C"]
[2708,"Niedercunnersdorf","-16 °C"]
[33739,"Niederdornberg","-12 °C"]
[56651,"Niederdürenbach","-14 °C"]
[56412,"Niederelbert","-14 °C"]
[60437,"Nieder-Erlenbach","-14 °C"]
[78078,"Niedereschach","-16 °C"]
[67592,"Nieder-Flörsheim","-12 °C"]
[9243,"Niederfrohna","-14 °C"]
[4618,"Niederhain","-14 °C"]
[65760,"Niederhöchstadt","-12 °C"]
[79730,"Niederhof","-12 °C"]
[89604,"Niederhofen","-14 °C"]
[37269,"Niederhone","-14 °C"]
[53501,"Niederich","-14 °C"]
[63486,"Niederissigheim","-12 °C"]
[65817,"Niederjosbach","-10 °C"]
[53859,"Niederkassel","-12 °C"]
[41372,"Niederkrüchten","-10 °C"]
[15751,"Niederlehme","-14 °C"]
[39264,"Niederlepte","-14 °C"]
[56556,"Niederlützingen","-12 °C"]
[8138,"Niedermülsen","-14 °C"]
[92545,"Niedermurach","-18 °C"]
[39167,"Niederndodeleben","-14 °C"]
[74676,"Niedernhall","-14 °C"]
[65527,"Niedernhausen","-14 °C"]
[37133,"Niedernjesa","-16 °C"]
[27432,"Nieder-Ochtenhausen","-12 °C"]
[2791,"Niederoderwitz","-16 °C"]
[35325,"Nieder-Ohmen","-14 °C"]
[35325,"Nieder-Ohmen","-14 °C"]
[86381,"Niederraunau","-16 °C"]
[87767,"Niederrieden","-16 °C"]
[8393,"Niederschindmaas","-14 °C"]
[34497,"Niederschleidern","-16 °C"]
[77749,"Niederschopfheim","-12 °C"]
[54570,"Niederstadtfeld","-14 °C"]
[89168,"Niederstotzingen","-16 °C"]
[84494,"Niedertaufkirchen","-16 °C"]
[35274,"Niederwald","-12 °C"]
[56357,"Niederwallmenach","-12 °C"]
[79379,"Niederweiler","-14 °C"]
[8396,"Niederwiera","-14 °C"]
[79733,"Niederwihl","-14 °C"]
[79297,"Niederwinden","-16 °C"]
[55758,"Niederworresbach","-14 °C"]
[66440,"Niederwürzbach","-12 °C"]
[52382,"Niederzier","-12 °C"]
[56651,"Niederzissen","-14 °C"]
[75223,"Niefern","-14 °C"]
[67308,"Niefernheim","-12 °C"]
[1561,"Niegeroda","-16 °C"]
[33039,"Nieheim","-14 °C"]
[19258,"Nieklitz","-12 °C"]
[1968,"Niemtsch","-16 °C"]
[31582,"Nienburg/Weser","-12 °C"]
[29690,"Nienhagen","-12 °C"]
[29364,"Nienhof","-14 °C"]
[19017,"Nienmark","-12 °C"]
[31688,"Nienstädt","-14 °C"]
[31035,"Nienstedt","-14 °C"]
[31848,"Nienstedt","-14 °C"]
[1609,"Nieska","-16 °C"]
[2906,"Niesky","-16 °C"]
[79331,"Nimburg","-12 °C"]
[4626,"Nischwitz","-14 °C"]
[4808,"Nischwitz","-14 °C"]
[54453,"Nittel","-12 °C"]
[93152,"Nittendorf","-16 °C"]
[56729,"Nitz","-14 °C"]
[39539,"Nitzow","-14 °C"]
[4639,"Nitzschka","-14 °C"]
[66625,"Nohfelden","-14 °C"]
[54579,"Nollenbach","-14 °C"]
[53639,"Nonnenberg","-12 °C"]
[77963,"Nonnenweier","-12 °C"]
[66620,"Nonnweiler","-14 °C"]
[24811,"Norby","-12 °C"]
[26954,"Nordenham","-10 °C"]
[26548,"Norderney","-10 °C"]
[22851,"Norderstedt","-12 °C"]
[96365,"Nordhalden","-18 °C"]
[74226,"Nordhausen","-12 °C"]
[99734,"Nordhausen","-14 °C"]
[27637,"Nordholz","-10 °C"]
["4852x","Nordhorn","-10 °C"]
[86720,"Nördlingen","-16 °C"]
[77787,"Nordrach","-14 °C"]
[34132,"Nordshausen/Kassel","-14 °C"]
[31171,"Nordstemmen","-14 °C"]
[72160,"Nordstetten","-16 °C"]
[25845,"Nordstrand","-10 °C"]
[79341,"Nordweil","-12 °C"]
[27211,"Nordwohlde","-12 °C"]
[89312,"Nornheim","-16 °C"]
[37176,"Nörten-Hardenberg","-16 °C"]
[37154,"Northeim","-16 °C"]
[52388,"Nörvenich","-12 °C"]
[4749,"Noschkowitz","-14 °C"]
[2627,"Nostitz","-16 °C"]
[53902,"Nöthen","-14 °C"]
[79254,"Notschrei","-18 °C"]
[75196,"Nöttingen","-14 °C"]
[48301,"Nottuln","-12 °C"]
[73274,"Notzingen","-16 °C"]
[97720,"Nüdlingen","-14 °C"]
[71154,"Nufringen","-16 °C"]
[51588,"Nümbrecht","-12 °C"]
[66687,"Nunkirchen","-12 °C"]
[53520,"Nürburg","-14 °C"]
["904xx","Nürnberg","-16 °C"]
[72622,"Nürtingen","-14 °C"]
[54675,"Nusbaum","-14 °C"]
[77704,"Nußbach","-12 °C"]
[71735,"Nussdorf","-14 °C"]
[83131,"Nußdorf","-18 °C"]
[69226,"Nußloch","-12 °C"]
[36088,"Nüst","-14 °C"]
[76703,"Oberacker","-12 °C"]
[70771,"Oberaichen","-14 °C"]
[79761,"Oberalpfen","-14 °C"]
[82487,"Oberammergau","-18 °C"]
[4618,"Oberarnsdorf","-14 °C"]
[82496,"Oberau","-18 °C"]
[83080,"Oberaudorf","-18 °C"]
[56729,"Oberbaar","-14 °C"]
[97772,"Oberbach","-16 °C"]
[78073,"Oberbaldingen","-16 °C"]
[79235,"Oberbergen","-12 °C"]
[72644,"Oberboihingen","-14 °C"]
[65611,"Oberbrechen","-12 °C"]
[36284,"Oberbreitzbach","-14 °C"]
[52525,"Oberbruch","-10 °C"]
[1762,"Obercarsdorf","-14 °C"]
[8147,"Obercrinitz","-16 °C"]
[2708,"Obercunnersdorf","-16 °C"]
[75038,"Oberderdingen","-14 °C"]
[69429,"Oberdielbach","-14 °C"]
[73441,"Oberdorf","-16 °C"]
[88085,"Oberdorf","-12 °C"]
[88348,"Obereggatsweiler","-16 °C"]
[79418,"Obereggenen","-14 °C"]
[97247,"Obereisenheim","-14 °C"]
[56412,"Oberelbert","-14 °C"]
[99819,"Oberellen","-16 °C"]
[61352,"Ober-Erlenbach","-14 °C"]
[88436,"Oberessendorf","-16 °C"]
[90559,"Oberferrieden (Burgthann)","-16 °C"]
[1762,"Oberfrauendorf","-14 °C"]
[53894,"Obergartzem","-14 °C"]
[94486,"Obergessenbach","-18 °C"]
[76646,"Obergrombach","-12 °C"]
[73569,"Obergröningen","-16 °C"]
[18239,"Oberhagen","-12 °C"]
[96173,"Oberhaid","-16 °C"]
[77784,"Oberharmersbach","-14 °C"]
[75387,"Oberhaugstett","-16 °C"]
[46147,"Oberhausen","-10 °C"]
[68794,"Oberhausen","-12 °C"]
[76887,"Oberhausen","-12 °C"]
[82386,"Oberhausen","-16 °C"]
[86154,"Oberhausen","-16 °C"]
[68794,"Oberhausen-Rheinhausen","-12 °C"]
[23948,"Oberhof","-10 °C"]
[98559,"Oberhof","-16 °C"]
[88447,"Oberhöfen","-16 °C"]
[84503,"Oberholzhausen","-16 °C"]
[88480,"Oberholzheim","-16 °C"]
[97258,"Oberickelsheim","-16 °C"]
[72296,"Oberiflingen","-16 °C"]
[71083,"Oberjesingen","-16 °C"]
[71131,"Oberjettingen","-16 °C"]
[77704,"Oberkirch","-14 °C"]
[31683,"Oberkirchen","-14 °C"]
[57392,"Oberkirchen","-14 °C"]
[73447,"Oberkochen","-16 °C"]
[75394,"Oberkollbach","-16 °C"]
[7922,"Oberkoskau","-16 °C"]
[97488,"Oberlauringen","-16 °C"]
[7356,"Oberlemnitz","-18 °C"]
[75328,"Oberlengenhardt","-16 °C"]
[8527,"Oberlosa","-16 °C"]
[32479,"Oberlübbe","-12 °C"]
[89611,"Obermarchtal","-14 °C"]
[86836,"Obermeitingen","-16 °C"]
[90587,"Obermichelbach","-16 °C"]
[61239,"Ober-Mörlen","-14 °C"]
[67823,"Obermoschel","-12 °C"]
[63785,"Obernburg","-12 °C"]
[35606,"Oberndorf","-12 °C"]
[72108,"Oberndorf","-16 °C"]
[84107,"Oberndorf","-16 °C"]
[86698,"Oberndorf","-16 °C"]
[99310,"Oberndorf","-14 °C"]
[78727,"Oberndorf/Neckar","-16 °C"]
[75217,"Obernhausen","-14 °C"]
[72364,"Obernheim","-18 °C"]
[37124,"Obernjesa","-16 °C"]
[94130,"Obernzell","-16 °C"]
[2744,"Oberoderwitz","-16 °C"]
[86869,"Oberostendorf","-16 °C"]
[76889,"Oberotterbach","-12 °C"]
[86507,"Oberottmarshausen","-16 °C"]
[76703,"Oberöwisheim","-12 °C"]
[53639,"Oberpleis","-12 °C"]
[94562,"Oberpöring","-18 °C"]
[79215,"Oberprechtal","-16 °C"]
[35641,"Oberquembach","-14 °C"]
[64372,"Ober-Ramstadt","-14 °C"]
[4720,"Oberranschütz","-14 °C"]
[75394,"Oberreichenbach","-16 °C"]
[91097,"Oberreichenbach","-16 °C"]
[61389,"Oberreifenberg","-16 °C"]
[79254,"Oberried","-18 °C"]
[71739,"Oberriexingen","-12 °C"]
[79206,"Oberrimsingen","-12 °C"]
[6528,"Oberröblingen","-14 °C"]
[36041,"Oberrode","-14 °C"]
[74420,"Oberrot","-16 °C"]
[79233,"Oberrotweil","-12 °C"]
[91483,"Oberscheinfeld","-16 °C"]
[76889,"Oberschlettenbach","-12 °C"]
[73485,"Oberschneidheim","-16 °C"]
[94363,"Oberschneiding","-18 °C"]
[9600,"Oberschöna","-16 °C"]
[77948,"Oberschopfheim","-12 °C"]
[72221,"Oberschwandorf","-16 °C"]
[97478,"Oberschwappach","-16 °C"]
[88410,"Oberschwarzach","-16 °C"]
[2763,"Oberseifersdorf","-16 °C"]
[65520,"Oberselters","-14 °C"]
[57078,"Obersetzen","-14 °C"]
[38173,"Obersickte","-14 °C"]
[74423,"Obersontheim","-16 °C"]
[97509,"Oberspiesheim","-14 °C"]
[89613,"Oberstadion","-14 °C"]
[54570,"Oberstadtfeld","-14 °C"]
["8752x","Oberstaufen","-18 °C"]
[71720,"Oberstenfeld","-14 °C"]
[72531,"Oberstetten","-18 °C"]
[88416,"Oberstetten ","-16 °C"]
[97640,"Oberstreu","-14 °C"]
[74182,"Obersulm","-14 °C"]
[88471,"Obersulmetingen","-16 °C"]
[84101,"Obersüßbach","-16 °C"]
[99444,"Obersynderstedt","-14 °C"]
[88094,"Oberteuringen","-14 °C"]
[97723,"Oberthulba","-14 °C"]
[73656,"Oberurbach","-16 °C"]
[61440,"Oberursel/Taunus","-12 °C"]
[92526,"Oberviechtach","-16 °C"]
[34281,"Obervorschütz","-14 °C"]
[89349,"Oberwaldbach","-16 °C"]
[79780,"Oberwangen","-14 °C"]
[77948,"Oberweier","-12 °C"]
[72226,"Oberweiler","-16 °C"]
[71554,"Oberweissach","-14 °C"]
[79862,"Oberweschnegg","-16 °C"]
[55430,"Oberwesel","-14 °C"]
[34399,"Oberweser","-12 °C"]
[8396,"Oberwiera","-14 °C"]
[92355,"Oberwiesenacker","-16 °C"]
[86519,"Oberwiesenbach","-16 °C"]
[79733,"Oberwihl","-12 °C"]
[74747,"Oberwittstadt","-14 °C"]
[77709,"Oberwolfach","-14 °C"]
[56651,"Oberzissen","-14 °C"]
[83119,"Obing","-16 °C"]
[53506,"Obliers","-14 °C"]
[46485,"Obrighoven","-10 °C"]
[97199,"Ochsenfurt","-14 °C"]
[88416,"Ochsenhausen","-16 °C"]
[88418,"Ochsenhausen","-16 °C"]
[31134,"Ochtersum","-14 °C"]
[61169,"Ockstadt","-14 °C"]
[85235,"Odelzhausen","-16 °C"]
[72531,"Ödenwaldstetten","-18 °C"]
[55571,"Odernheim","-12 °C"]
[2791,"Oderwitz","-16 °C"]
[21775,"Odisheim","-12 °C"]
[36404,"Oechsen","-16 °C"]
[91249,"Oed","-16 °C"]
[34399,"Oedelsheim","-12 °C"]
[9569,"Oederan","-14 °C"]
[74229,"Oedheim","-12 °C"]
[2625,"Oehna","-16 °C"]
[98704,"Oehrenstock","-16 °C"]
[38271,"Oelber a. weißen Wege","-14 °C"]
[59302,"Oelde","-12 °C"]
[8606,"Oelsnitz","-16 °C"]
[9376,"Oelsnitz","-14 °C"]
[45739,"Oer-Erkenschwick","-10 °C"]
[65375,"Oestrich-Winkel","-12 °C"]
[86732,"Oettingen","-16 °C"]
["5975x","Oeventrop","-14 °C"]
[53501,"Oeverich","-14 °C"]
[52477,"Ofden","-12 °C"]
[74254,"Offenau","-12 °C"]
[76877,"Offenbach","-12 °C"]
["6307x","Offenbach/Main","-12 °C"]
[67749,"Offenbach-Hundheim","-14 °C"]
["7765x","Offenburg","-12 °C"]
[91238,"Offenhausen","-16 °C"]
[65555,"Offheim","-12 °C"]
[89362,"Offingen","-16 °C"]
[79664,"Öflingen","-12 °C"]
[72131,"Ofterdingen","-16 °C"]
[68723,"Oftersheim","-12 °C"]
[88448,"Oggelsbeuren","-16 °C"]
[88422,"Oggelshausen","-16 °C"]
[89522,"Oggenhausen","-16 °C"]
[21220,"Ohlendorf","-12 °C"]
[77797,"Ohlsbach","-12 °C"]
[73275,"Ohmden","-16 °C"]
[72770,"Ohmenhausen","-16 °C"]
[72813,"Ohnastetten","-18 °C"]
[1896,"Ohorn","-14 °C"]
[74613,"Öhringen","-14 °C"]
[74613,"Ohrnberg","-14 °C"]
[49626,"Ohrtermersch","-12 °C"]
[27337,"Oiste","-12 °C"]
[65795,"Okriftel","-12 °C"]
[1458,"Okrilla","-14 °C"]
[9526,"Olbernhau","-16 °C"]
[2785,"Olbersdorf","-16 °C"]
[9432,"Olbersdorf","-16 °C"]
[75248,"Ölbronn-Dürrn","-14 °C"]
[82140,"Olching","-16 °C"]
[29313,"Oldau","-12 °C"]
["2613x","Oldenburg/Oldb.","-10 °C"]
[29320,"Oldendorf","-14 °C"]
[33719,"Oldentrup","-12 °C"]
[26802,"Oldersum","-10 °C"]
[53937,"Olef","-14 °C"]
[59399,"Olfen","-12 °C"]
[37635,"Ölkassen","-14 °C"]
[74249,"Olnhausen","-14 °C"]
[57462,"Olpe","-14 °C"]
[88427,"Olzreute","-16 °C"]
[77855,"Önsbach","-12 °C"]
[72458,"Onstmettingen","-18 °C"]
[88145,"Opfenbach","-16 °C"]
[97241,"Opferbaum","-14 °C"]
[79112,"Opfingen","-12 °C"]
["79xxx","Opfingen","-12 °C"]
[89614,"Öpfingen","-14 °C"]
["513xx","Opladen","-10 °C"]
[2736,"Oppach","-16 °C"]
[77728,"Oppenau","-16 °C"]
[71570,"Oppenweiler","-14 °C"]
[6785,"Oranienbaum","-14 °C"]
[16515,"Oranienburg","-14 °C"]
[54298,"Orenhofen","-14 °C"]
[34474,"Orpethal","-14 °C"]
[77972,"Orschweier","-12 °C"]
[88477,"Orsenhausen","-16 °C"]
[78359,"Orsingen-Nenzingen","-14 °C"]
[95233,"Ort","-18 °C"]
[63683,"Ortenberg","-12 °C"]
[77799,"Ortenberg","-12 °C"]
[94496,"Ortenburg","-16 °C"]
[86647,"Ortlfingen","-16 °C"]
[86678,"Ortlfingen","-16 °C"]
[1990,"Ortrand","-16 °C"]
[31167,"Ortshausen","-14 °C"]
[4758,"Oschatz","-14 °C"]
[71126,"Öschelbronn","-16 °C"]
[75223,"Öschelbronn","-14 °C"]
[72116,"Öschingen","-18 °C"]
[6184,"Osmünde","-14 °C"]
["4908x","Osnabrück","-12 °C"]
[99510,"Oßmannstedt","-14 °C"]
[48346,"Ostbevern","-12 °C"]
[72336,"Ostdorf","-16 °C"]
[75395,"Ostelsheim","-16 °C"]
[39606,"Osterburg","-14 °C"]
[74706,"Osterburken","-14 °C"]
[94486,"Osterhofen","-18 °C"]
[83104,"Ostermünchen","-16 °C"]
[37520,"Osterode/Harz","-16 °C"]
[31020,"Osterwald","-14 °C"]
[39171,"Osterweddingen","-14 °C"]
[87662,"Osterzell","-16 °C"]
[73760,"Ostfildern","-14 °C"]
[67574,"Osthofen","-12 °C"]
[39343,"Ostingersleben","-14 °C"]
[59510,"Östinghausen","-12 °C"]
[88356,"Ostrach","-14 °C"]
[4749,"Ostrau","-14 °C"]
[76684,"Östringen","-12 °C"]
[null,"Ostrittrum","-12 °C"]
[2899,"Ostritz","-16 °C"]
[18375,"Ostseebad Prerow","-10 °C"]
[76470,"Ötigheim","-12 °C"]
[75443,"Ötisheim","-14 °C"]
[37671,"Ottbergen","-14 °C"]
[73113,"Ottenbach","-16 °C"]
[75382,"Ottenbronn","-14 °C"]
[75382,"Ottenbronn","-16 °C"]
[9648,"Ottendorf","-14 °C"]
[2708,"Ottenhain","-16 °C"]
[75334,"Ottenhausen","-14 °C"]
[77963,"Ottenheim","-12 °C"]
[77883,"Ottenhöfen","-14 °C"]
[31868,"Ottenstein","-14 °C"]
[48683,"Ottenstein","-10 °C"]
[67697,"Otterberg","-12 °C"]
[83624,"Otterfing","-16 °C"]
[21762,"Otterndorf","-10 °C"]
[31535,"Otternhagen","-14 °C"]
[28870,"Ottersberg","-12 °C"]
[85652,"Ottersberg","-16 °C"]
[68723,"Ottersheim","-12 °C"]
[28870,"Otterstedt","-12 °C"]
[88427,"Otterswang","-16 °C"]
[77833,"Ottersweier","-14 °C"]
[4668,"Otterwisch","-14 °C"]
[4720,"Ottewig","-14 °C"]
[86316,"Ottmaring","-16 °C"]
[94533,"Ottmaring","-18 °C"]
[48308,"Ottmarsbocholt","-12 °C"]
[86536,"Ottmarshausen","-16 °C"]
[87724,"Ottobeuren","-16 °C"]
[85521,"Ottobrunn","-16 °C"]
[66564,"Ottweiler","-12 °C"]
[41363,"Otzenrath","-10 °C"]
[94563,"Otzing","-18 °C"]
[29313,"Ovelgönne","-12 °C"]
[37671,"Ovenhausen","-14 °C"]
[51491,"Overath","-12 °C"]
[51491,"Overrath","-12 °C"]
[73277,"Owen","-16 °C"]
[72401,"Owingen","-16 °C"]
[88696,"Owingen","-12 °C"]
[24811,"Owschlag","-12 °C"]
[89335,"Oxenbronn","-16 °C"]
[28876,"Oyten - Bassen","-12 °C"]
[38836,"Pabstorf","-14 °C"]
[4886,"Packisch","-16 °C"]
["3310x","Paderborn","-12 °C"]
[4603,"Pähnitz","-14 °C"]
[7580,"Paitzdorf","-14 °C"]
[76133,"Palmbach","-14 °C"]
[54439,"Palzem","-12 °C"]
[19075,"Pampow","-12 °C"]
[4451,"Panitzsch","-14 °C"]
[16341,"Panketal","-14 °C"]
[1920,"Panschwitz","-16 °C"]
[54531,"Pantenburg","-14 °C"]
[37696,"Papenhöfen","-14 °C"]
[89136,"Pappelau","-14 °C"]
[9661,"Pappendorf","-14 °C"]
[39291,"Parchau","-14 °C"]
[19370,"Parchim","-14 °C"]
[14669,"Paretz","-14 °C"]
[39317,"Parey","-14 °C"]
[92331,"Parsberg/Oberfr.","-16 °C"]
[85599,"Parsdorf","-16 °C"]
[55288,"Partenheim","-12 °C"]
[19073,"Parum","-12 °C"]
[19243,"Parum","-12 °C"]
[4769,"Paschkowitz","-14 °C"]
[17309,"Pasewalk","-14 °C"]
["9403x","Passau","-14 °C"]
[18184,"Pastow","-10 °C"]
[30982,"Pattensen","-14 °C"]
[85307,"Paunzhausen","-16 °C"]
[7952,"Pausa","-16 °C"]
[1616,"Paußnitz","-16 °C"]
[91352,"Pautzfeld","-16 °C"]
[95701,"Pechbrunn","-18 °C"]
[8485,"Pechtelsgrün","-16 °C"]
[34439,"Peckelsheim","-14 °C"]
[4523,"Pegau","-14 °C"]
[91257,"Pegnitz","-16 °C"]
[1945,"Peickwitz","-16 °C"]
["3122x","Peine","-14 °C"]
[4460,"Peißen","-14 °C"]
[82380,"Peißenberg","-16 °C"]
[3185,"Peitz","-16 °C"]
[54331,"Pellingen","-12 °C"]
[25849,"Pellworm","-10 °C"]
[93482,"Pemfling","-18 °C"]
[17328,"Penkun","-14 °C"]
[82377,"Penzberg","-18 °C"]
[91126,"Penzendorf","-16 °C"]
[86929,"Penzing","-16 °C"]
[94366,"Perasdorf","-18 °C"]
[82319,"Perchting","-16 °C"]
[66706,"Perl","-12 °C"]
[71277,"Perouse","-16 °C"]
[91580,"Petersaurach","-16 °C"]
[17268,"Petersdorf","-14 °C"]
[15236,"Petershagen","-16 °C"]
[15370,"Petershagen","-14 °C"]
[32469,"Petershagen","-12 °C"]
[85238,"Petershausen","-16 °C"]
[89423,"Peterswörth","-16 °C"]
[78112,"Peterzell","-16 °C"]
[31079,"Petze","-14 °C"]
[84066,"Pfaffenberg","-18 °C"]
[87772,"Pfaffenhausen","-16 °C"]
[85276,"Pfaffenhofen","-16 °C"]
[89284,"Pfaffenhofen","-16 °C"]
[76359,"Pfaffenrot","-14 °C"]
[79292,"Pfaffenweier","-14 °C"]
[79292,"Pfaffenweiler","-14 °C"]
[72119,"Pfäffingen","-16 °C"]
[9526,"Pfaffroda","-16 °C"]
[73479,"Pfahlheim","-16 °C"]
[56291,"Pfalzfeld","-14 °C"]
[72285,"Pfalzgrafenweiler","-16 °C"]
[84347,"Pfarrkirchen","-16 °C"]
[93102,"Pfatter","-18 °C"]
[67547,"Pfeddersheim","-12 °C"]
[74629,"Pfedelbach","-14 °C"]
[99869,"Pferdingsleben","-14 °C"]
[76327,"Pfinztal","-12 °C"]
[75334,"Pfinzweiler","-14 °C"]
[86926,"Pflaumdorf","-16 °C"]
[86946,"Pflugdorf","-16 °C"]
[71636,"Pflugfelden","-12 °C"]
[78166,"Pfohren","-18 °C"]
["7517x","Pforzheim","-12 °C"]
[75181,"Pforzheim - Huchenfeld","-14 °C"]
[83064,"Pfraundorf","-18 °C"]
[92536,"Pfreimd","-16 °C"]
[72074,"Pfrondorf","-16 °C"]
[72539,"Pfronstetten","-16 °C"]
[87459,"Pfronten","-18 °C"]
[88271,"Pfrungen","-14 °C"]
[89233,"Pfuhl","-14 °C"]
[88630,"Pfullendorf","-14 °C"]
[72793,"Pfullingen","-16 °C"]
[64319,"Pfungstadt","-12 °C"]
[76661,"Philippsburg","-12 °C"]
[94158,"Philippsreut","-18 °C"]
[36269,"Philippsthal","-14 °C"]
[83451,"Piding","-16 °C"]
[66809,"Piesbach","-12 °C"]
[54498,"Piesport","-10 °C"]
[75446,"Pinache","-14 °C"]
[25421,"Pinneberg","-12 °C"]
["6695x","Pirmasens","-12 °C"]
[1796,"Pirna","-14 °C"]
[1920,"Piskowitz","-16 °C"]
[83132,"Pittenhart","-16 °C"]
[56637,"Plaidt","-14 °C"]
[55545,"Planig","-12 °C"]
[8606,"Planschwitz","-16 °C"]
[19086,"Plate","-12 °C"]
[70794,"Plattenhardt","-14 °C"]
[94447,"Plattling","-18 °C"]
[99338,"Plaue","-14 °C"]
[8527,"Plauen","-16 °C"]
[91287,"Plech","-16 °C"]
[74385,"Pleidelsheim","-12 °C"]
[91785,"Pleinfeld","-16 °C"]
[9246,"Pleißa","-14 °C"]
[86971,"Pleiting","-16 °C"]
[4928,"Plessa","-16 °C"]
[58840,"Plettenberg","-12 °C"]
[72124,"Pliezhausen","-16 °C"]
[73207,"Plochingen","-16 °C"]
[8228,"Plohn","-16 °C"]
[24306,"Plön","-12 °C"]
[6667,"Plotha","-14 °C"]
[7907,"Plothen","-16 °C"]
[39245,"Plötzky","-14 °C"]
[73655,"Plüdershausen","-16 °C"]
[9496,"Pobershau","-16 °C"]
[9509,"Pockau","-16 °C"]
[18516,"Poggendorf","-12 °C"]
[19243,"Pogreß","-12 °C"]
[8543,"Pöhl","-16 °C"]
[1906,"Pohla","-16 °C"]
[8352,"Pöhla","-16 °C"]
[31867,"Pohle","-14 °C"]
[35415,"Pohlheim","-14 °C"]
[85586,"Poing","-16 °C"]
[18059,"Pölchow","-12 °C"]
[1844,"Polenz","-14 °C"]
[6408,"Poley","-14 °C"]
[54340,"Pölich","-10 °C"]
[92334,"Pollanten","-16 °C"]
[37647,"Polle","-12 °C"]
[6295,"Polleben","-14 °C"]
[82398,"Polling","-16 °C"]
[84570,"Polling","-16 °C"]
[92318,"Pölling","-16 °C"]
[91805,"Polsingen","-16 °C"]
[72119,"Poltringen","-16 °C"]
[19303,"Polz","-12 °C"]
[91224,"Pommelsbrunn","-14 °C"]
[39249,"Pömmelte","-14 °C"]
[96178,"Pommersfelden","-16 °C"]
[4668,"Pomßen","-14 °C"]
[4639,"Ponitz","-14 °C"]
[18184,"Poppendorf","-12 °C"]
[97490,"Poppenhausen","-16 °C"]
[92284,"Poppenricht","-16 °C"]
[71642,"Poppenweiler","-12 °C"]
[4769,"Poppitz","-14 °C"]
[94501,"Pörndorf","-16 °C"]
[1833,"Porschendorf","-14 °C"]
[52525,"Porselen","-10 °C"]
[32457,"Porta Westfalica","-12 °C"]
["506xx","Porz","-10 °C"]
[8606,"Posseck","-18 °C"]
[97346,"Possenheim","-16 °C"]
[7381,"Pößneck","-14 °C"]
["1448x","Potsdam","-14 °C"]
[91278,"Pottenstein","-16 °C"]
[86554,"Pöttmes","-16 °C"]
[24253,"Prasdorf","-10 °C"]
[1594,"Prausitz","-16 °C"]
[3185,"Preilack","-16 °C"]
[17291,"Prenzlau","-14 °C"]
[18375,"Prerow","-10 °C"]
[4849,"Pressel","-14 °C"]
[91362,"Pretzfeld","-16 °C"]
[39245,"Pretzien","-14 °C"]
[6909,"Pretzsch","-14 °C"]
[1774,"Pretzschendorf","-16 °C"]
[97357,"Prichsenstadt","-16 °C"]
[83209,"Prien","-16 °C"]
[6909,"Priesitz","-14 °C"]
[4651,"Prießnitz","-14 °C"]
[4509,"Priester","-14 °C"]
[66620,"Primstal","-12 °C"]
[19300,"Prislich","-14 °C"]
[6667,"Prittitz","-14 °C"]
[86931,"Prittriching","-16 °C"]
[17440,"Pritzier","-12 °C"]
[7330,"Probstzella","-18 °C"]
[39264,"Prödel","-14 °C"]
[18455,"Prohn","-10 °C"]
[23968,"Proseken","-10 °C"]
[97279,"Prosselsheim","-14 °C"]
[15345,"Prötzel","-14 °C"]
[18356,"Pruchten","-10 °C"]
[54595,"Prüm","-14 °C"]
[83134,"Prutting","-16 °C"]
[82256,"Puch (Post FFB)","-16 °C"]
[92715,"Püchersreuth","-18 °C"]
[82178,"Puchheim","-16 °C"]
[52499,"Puffendorf","-12 °C"]
[50259,"Pulheim","-12 °C"]
[1896,"Pulsnitz","-14 °C"]
[56862,"Pünderich","-12 °C"]
[86932,"Pürgen","-16 °C"]
[6925,"Purzien","-14 °C"]
[3159,"Pusack","-16 °C"]
[90617,"Puschendorf","-16 °C"]
[2699,"Puschwitz","-16 °C"]
[1877,"Putzkau","-16 °C"]
[6484,"Quedlinburg","-14 °C"]
[66851,"Queidersbach","-12 °C"]
[6386,"Quellendorf","-14 °C"]
[6333,"Quenstedt","-14 °C"]
[37235,"Quentel","-14 °C"]
[77694,"Querbach","-12 °C"]
[4769,"Querbitzsch","-14 °C"]
[25712,"Quickborn Post Burg","-12 °C"]
[66287,"Quierschied","-12 °C"]
[66909,"Quirnbach","-12 °C"]
[19065,"Raben Steinfeld","-12 °C"]
[1920,"Rächelwitz","-16 °C"]
[2997,"Rachlau","-16 °C"]
[21449,"Radbruch","-12 °C"]
[3226,"Raddusch","-16 °C"]
[1454,"Radeberg","-14 °C"]
[1445,"Radebeul","-14 °C"]
[4509,"Radefeld","-14 °C"]
[89173,"Radelstetten","-16 °C"]
[42477,"Radevormwald","-12 °C"]
[2627,"Radibor","-16 °C"]
[36399,"Radmühl","-14 °C"]
[78315,"Radolfzell","-12 °C"]
[46348,"Raesfeld","-10 °C"]
[4668,"Ragewitz","-14 °C"]
[14806,"Ragösen","-14 °C"]
[6779,"Raguhn","-14 °C"]
[22147,"Rahlstedt","-12 °C"]
[12589,"Rahnsdorf","-14 °C"]
[72622,"Raidwangen","-16 °C"]
[86641,"Rain","-16 °C"]
[73492,"Rainau","-16 °C"]
[9074,"Raitersaich","-16 °C"]
[18516,"Rakow","-12 °C"]
[1920,"Ralbitz","-16 °C"]
[54310,"Ralingen","-12 °C"]
[65207,"Rambach","-12 °C"]
[76857,"Ramberg","-12 °C"]
[23966,"Rambow","-12 °C"]
[83561,"Ramerberg","-16 °C"]
[53359,"Ramershoven","-14 °C"]
[31303,"Ramlingen","-14 °C"]
[86871,"Rammingen","-16 °C"]
[89192,"Rammingen","-16 °C"]
[19067,"Rampe","-12 °C"]
[83486,"Ramsau","-18 °C"]
[91785,"Ramsberg","-16 °C"]
[46342,"Ramsdorf","-10 °C"]
[97236,"Randersacker","-14 °C"]
[72414,"Rangendingen","-16 °C"]
[15834,"Rangsdorf","-14 °C"]
[7389,"Ranis","-14 °C"]
[56235,"Ransbach-Baumbach","-14 °C"]
[76829,"Ranschbach","-12 °C"]
[25980,"Rantum/Sylt","-10 °C"]
[4420,"Räpitz","-14 °C"]
[17509,"Rappenhagen","-12 °C"]
[54497,"Rapperath","-14 °C"]
[8352,"Raschau","-16 °C"]
[76437,"Rastatt","-12 °C"]
[26180,"Rastede","-12 °C"]
[19077,"Rastow","-12 °C"]
[52385,"Rath","-14 °C"]
[41836,"Ratheim","-10 °C"]
[4657,"Rathendorf","-14 °C"]
[14712,"Rathenow","-14 °C"]
[91080,"Rathsberg","-16 °C"]
[16259,"Rathsdorf","-14 °C"]
["4088x","Ratingen","-10 °C"]
[72365,"Ratshausen","-18 °C"]
[83064,"Raubling","-18 °C"]
[69231,"Rauenberg","-12 °C"]
[9366,"Raum","-16 °C"]
[65479,"Raunheim","-12 °C"]
[1920,"Rauschwitz","-16 °C"]
[31177,"Rautenberg","-14 °C"]
[38126,"Rautheim","-14 °C"]
["8821x","Ravensburg","-14 °C"]
[74747,"Ravenstein","-14 °C"]
[8209,"Rebesgrün","-16 °C"]
[53506,"Rech / Ahr","-14 °C"]
[73529,"Rechberg","-16 °C"]
[73098,"Rechberghausen","-16 °C"]
[76889,"Rechtenbach","-12 °C"]
[14778,"Reckahn","-14 °C"]
[45665,"Recklinghausen","-10 °C"]
[4720,"Redemitz","-14 °C"]
[23946,"Redewisch","-10 °C"]
[91126,"Rednitzhembach","-16 °C"]
[46459,"Rees","-10 °C"]
[73495,"Regelsweiler","-16 °C"]
[94209,"Regen","-18 °C"]
[93197,"Regendorf","-16 °C"]
[93059,"Regensburg","-16 °C"]
[93128,"Regenstauf","-16 °C"]
[89165,"Regglisweiler","-16 °C"]
[4565,"Regis - Breitingen","-14 °C"]
[4565,"Regis-Breitingen","-14 °C"]
[95194,"Regnitzlosau","-18 °C"]
[95111,"Rehau","-18 °C"]
[55592,"Rehborn","-12 °C"]
[31547,"Rehburg","-14 °C"]
[1773,"Rehefeld","-16 °C"]
[25593,"Reher","-12 °C"]
[86508,"Rehling","-16 °C"]
[66780,"Rehlingen","-12 °C"]
[19217,"Rehna","-12 °C"]
[57462,"Rehringhausen","-14 °C"]
[6786,"Rehsen","-14 °C"]
[66907,"Rehweiler","-12 °C"]
[4509,"Reibitz","-14 °C"]
[4229,"Reichardtshausen","-14 °C"]
[74934,"Reichartshausen","-12 °C"]
[64385,"Reichelsheim","-14 °C"]
[61203,"Reichelsheim i. d. Wetterau","-12 °C"]
[1762,"Reichenau","-16 °C"]
[1936,"Reichenau","-16 °C"]
[2894,"Reichenbach","-16 °C"]
[73463,"Reichenbach","-16 °C"]
[77933,"Reichenbach","-14 °C"]
[78564,"Reichenbach","-18 °C"]
[99947,"Reichenbach","-14 °C"]
[73072,"Reichenbach (Donzdorf)","-16 °C"]
[73262,"Reichenbach an der Fils","-16 °C"]
[8468,"Reichenbach/Vogtland","-16 °C"]
[97234,"Reichenberg","-14 °C"]
[76593,"Reichental","-14 °C"]
[83677,"Reichersbeuern","-18 °C"]
[85293,"Reichertshausen","-16 °C"]
[51580,"Reichshof","-12 °C"]
[94428,"Reichstorf","-16 °C"]
[6116,"Reideburg","-14 °C"]
[66507,"Reifenberg","-12 °C"]
[9514,"Reifland","-16 °C"]
[74889,"Reihen","-14 °C"]
[68799,"Reilingen","-12 °C"]
[86756,"Reimlingen","-16 °C"]
[21465,"Reinbek","-12 °C"]
[32609,"Reineberg","-12 °C"]
[23858,"Reinfeld","-12 °C"]
[1814,"Reinhardtsdorf","-16 °C"]
[1768,"Reinhardtsgrimma","-14 °C"]
[64354,"Reinheim","-14 °C"]
[9629,"Reinsberg","-14 °C"]
[6896,"Reinsdorf","-14 °C"]
[54421,"Reinsfeld","-14 °C"]
[88416,"Reinstetten","-16 °C"]
[94419,"Reisbach","-16 °C"]
[85462,"Reisen","-16 °C"]
[89321,"Reisensburg","-16 °C"]
[83242,"Reit im Winkl","-18 °C"]
[94419,"Reith","-16 °C"]
[69242,"Reitigheim","-12 °C"]
[9249,"Reitzenhain","-14 °C"]
[48734,"Reken","-10 °C"]
[25462,"Rellingen","-12 °C"]
[53424,"Remagen","-12 °C"]
[75196,"Remchingen","-14 °C"]
["L-5515","Remich (Luxemburg)","-12 °C"]
[72149,"Remmingsheim","-16 °C"]
["4285x","Remscheid","-12 °C"]
[8373,"Remse","-14 °C"]
[71686,"Remseck","-12 °C"]
[73630,"Remshalden","-14 °C"]
[77871,"Renchen","-12 °C"]
[61184,"Rendel","-12 °C"]
[24768,"Rendsburg","-10 °C"]
[72172,"Renfrizhausen","-16 °C"]
[37318,"Rengelrode","-16 °C"]
[97980,"Rengershausen","-14 °C"]
[90602,"Rengersricht","-16 °C"]
[56579,"Rengsdorf","-12 °C"]
[56477,"Rennerod","-14 °C"]
[71272,"Renningen","-16 °C"]
[78603,"Renquishausen","-16 °C"]
[96184,"Rentweinsdorf","-14 °C"]
[45892,"Resse","-10 °C"]
[27336,"Rethem","-12 °C"]
[31319,"Rethmar","-14 °C"]
[18211,"Rethwisch","-10 °C"]
[87549,"Rettenberg","-18 °C"]
[69242,"Rettigheim","-12 °C"]
[17279,"Retzow","-14 °C"]
[97282,"Retzstadt","-14 °C"]
[77871,"Reuchen","-12 °C"]
[72622,"Reudern","-14 °C"]
[96158,"Reundorf","-16 °C"]
[96215,"Reundorf","-16 °C"]
[72119,"Reusten","-16 °C"]
[79276,"Reute","-12 °C"]
[88339,"Reute","-16 °C"]
[88441,"Reute","-16 °C"]
[17153,"Reuterstadt","-14 °C"]
[8496,"Reuth","-16 °C"]
[8538,"Reuth","-18 °C"]
[72275,"Reutin","-16 °C"]
[72760,"Reutlingen","-16 °C"]
[72160,"Rexingen","-16 °C"]
[33378,"Rheda-Wiedenbrück","-12 °C"]
[46414,"Rhede","-10 °C"]
[53859,"Rheidt","-12 °C"]
[68219,"Rheinau","-12 °C"]
[77866,"Rheinau","-12 °C"]
[77866,"Rheinau-Linx","-12 °C"]
[53359,"Rheinbach","-14 °C"]
[47495,"Rheinberg","-10 °C"]
[77866,"Rheinbischoffsheim","-12 °C"]
[55494,"Rheinböllen","-14 °C"]
[53619,"Rheinbreitbach","-12 °C"]
[56598,"Rheinbrohl","-12 °C"]
[41179,"Rheindahlen","-10 °C"]
[48429,"Rheine","-12 °C"]
[79618,"Rheinfelden","-12 °C"]
["CH","Rheinfelden / Schweiz (PLZ 4310)","-12 °C"]
[67067,"Rheingönheim","-12 °C"]
[68794,"Rheinhausen","-12 °C"]
[79365,"Rheinhausen /Breisgau","-12 °C"]
[47169,"Rheinhausen/Niederrh.","-10 °C"]
[79790,"Rheinheim","-12 °C"]
["4744x","Rheinkamp","-10 °C"]
[77836,"Rheinmünster","-12 °C"]
[16831,"Rheinsberg","-14 °C"]
[76661,"Rheinsheim","-12 °C"]
[76287,"Rheinstetten","-12 °C"]
[79415,"Rheinweiler","-12 °C"]
[76764,"Rheinzabern","-12 °C"]
[47509,"Rheurdt","-10 °C"]
["4106x","Rheydt","-10 °C"]
[37434,"Rhumspringe","-16 °C"]
[18311,"Ribnitz-Damgarten","-10 °C"]
[79736,"Rickenbach","-14 °C"]
[99334,"Riechheim","-14 °C"]
[68642,"Ried","-12 °C"]
[78176,"Riedböhringen","-16 °C"]
[70619,"Riedenberg","-14 °C"]
[93339,"Riedenburg","-16 °C"]
[72585,"Riederich","-16 °C"]
[79777,"Riedern","-14 °C"]
[78247,"Riedheim","-12 °C"]
[89340,"Riedheim","-16 °C"]
[94566,"Riedlhütte","-18 °C"]
[88499,"Riedlingen","-14 °C"]
[86637,"Riedsend","-16 °C"]
[64560,"Riedstadt","-12 °C"]
[79359,"Riegel","-12 °C"]
[78239,"Rielasingen-Worblingen","-12 °C"]
[71672,"Rielingshausen","-14 °C"]
[97794,"Rieneck","-14 °C"]
["0159x","Riesa","-16 °C"]
[66509,"Rieschweiler-Mühlbach","-12 °C"]
[24354,"Rieseby","-10 °C"]
[48477,"Riesenbeck","-12 °C"]
[6786,"Riesigk","-14 °C"]
[33397,"Rietberg","-12 °C"]
[78604,"Rietheim-Weilheim","-18 °C"]
[99195,"Riethnordhausen","-14 °C"]
[2956,"Rietschen","-16 °C"]
[14778,"Riewend","-14 °C"]
[84326,"Rimbach","-16 °C"]
[93485,"Rimbach","-18 °C"]
[64668,"Rimbach / Odw","-14 °C"]
[83253,"Rimsting","-16 °C"]
[73479,"Rindelbach","-16 °C"]
[53501,"Ringen","-14 °C"]
[46499,"Ringenberg","-10 °C"]
[1904,"Ringenhain","-16 °C"]
[9648,"Ringethal","-14 °C"]
[88605,"Ringgenbach","-14 °C"]
[72393,"Ringingen","-18 °C"]
[89155,"Ringingen","-14 °C"]
[88400,"Ringschnait","-16 °C"]
[77975,"Ringsheim","-12 °C"]
[48317,"Rinkerode","-12 °C"]
[31737,"Rinteln","-12 °C"]
[32676,"Rischenau","-14 °C"]
[88400,"Rißegg","-16 °C"]
[89584,"Rißtissen","-14 °C"]
[27721,"Ritterhude","-12 °C"]
[8355,"Rittersgrün","-18 °C"]
[35716,"Rittershausen","-14 °C"]
[37130,"Rittmarshausen","-16 °C"]
[4749,"Rittmitz","-14 °C"]
[89290,"Ritzisried","-16 °C"]
[9322,"Rochsburg","-14 °C"]
[6686,"Röcken","-14 °C"]
[92361,"Röckersbühl","-16 °C"]
[4808,"Röcknitz","-14 °C"]
[96476,"Rodach","-16 °C"]
[66976,"Rodalben","-12 °C"]
[64401,"Rodau","-14 °C"]
[17268,"Röddelin","-12 °C"]
[63517,"Rodenbach","-12 °C"]
[67688,"Rodenbach","-12 °C"]
[31552,"Rodenberg","-14 °C"]
["5067x","Rodenkirchen","-10 °C"]
[1619,"Röderau","-16 °C"]
[63322,"Rödermark","-12 °C"]
[1561,"Rödern","-16 °C"]
[8538,"Rodersdorf","-16 °C"]
[31637,"Rodewald","-12 °C"]
[8228,"Rodewisch","-16 °C"]
[63110,"Rodgau","-12 °C"]
[4838,"Rödgen","-14 °C"]
[93142,"Roding","-16 °C"]
[93426,"Roding","-16 °C"]
[52445,"Rödingen","-12 °C"]
[51709,"Rodt","-12 °C"]
[39326,"Rogätz","-14 °C"]
[89297,"Roggenburg","-16 °C"]
[17039,"Roggenhagen","-14 °C"]
[17252,"Roggentin","-14 °C"]
[18230,"Roggow","-10 °C"]
[73479,"Röhlingen","-16 °C"]
[70565,"Rohr","-14 °C"]
[91189,"Rohr","-16 °C"]
[71116,"Rohrau","-16 °C"]
[74889,"Rohrbach","-12 °C"]
[72184,"Rohrdorf","-16 °C"]
[72229,"Rohrdorf","-16 °C"]
[83101,"Rohrdorf","-18 °C"]
[88605,"Rohrdorf","-14 °C"]
[99310,"Röhrensee","-14 °C"]
[85244,"Röhrmoos","-16 °C"]
[1665,"Röhrsdorf","-14 °C"]
[9247,"Röhrsdorf","-14 °C"]
[31627,"Rohrsen","-12 °C"]
[38836,"Rohrsheim","-14 °C"]
[53332,"Roisdorf","-12 °C"]
[23948,"Rolofshagen","-10 °C"]
[67354,"Römerberg","-12 °C"]
[72587,"Römerstein","-18 °C"]
[98631,"Römhild","-16 °C"]
[72768,"Rommelsbach","-16 °C"]
[71394,"Rommelshausen","-14 °C"]
[41569,"Rommerskirchen","-12 °C"]
[30952,"Ronnenberg","-14 °C"]
[36124,"Rönshausen","-14 °C"]
[37124,"Rosdorf","-16 °C"]
[21514,"Roseburg","-12 °C"]
[73494,"Rosenberg","-16 °C"]
[74749,"Rosenberg","-16 °C"]
[91622,"Rosenberg","-16 °C"]
[31840,"Rosenbusch","-14 °C"]
[72348,"Rosenfeld","-16 °C"]
[21224,"Rosengarten","-12 °C"]
["8302x","Rosenheim/Oberbay.","-16 °C"]
[17091,"Rosenow","-14 °C"]
[19205,"Rosenow","-12 °C"]
[1920,"Rosenthal","-16 °C"]
[4617,"Rositz","-14 °C"]
[51503,"Rösrath","-12 °C"]
[67752,"Roßbach","-12 °C"]
[94439,"Roßbach","-16 °C"]
[64380,"Roßdorf","-12 °C"]
[31171,"Rössing","-14 °C"]
[6862,"Roßlau","-14 °C"]
[6571,"Roßleben","-14 °C"]
[8527,"Rößnitz","-16 °C"]
[90574,"Roßtal","-16 °C"]
[71665,"Roßwag","-14 °C"]
[73061,"Roßwälden","-16 °C"]
[72336,"Roßwangen","-18 °C"]
[4741,"Roßwein","-14 °C"]
["1805x","Rostock","-10 °C"]
[88430,"Rot a.d. Rot","-16 °C"]
[74585,"Rot am See","-16 °C"]
[75394,"Rötenbach","-16 °C"]
[78733,"Rötenberg","-16 °C"]
[52159,"Rötgen/Eifel","-12 °C"]
[91154,"Roth","-16 °C"]
[4571,"Rötha","-14 °C"]
[37688,"Rothe","-14 °C"]
[7922,"Rothenacker","-18 °C"]
[56459,"Rothenbach","-14 °C"]
[1744,"Röthenbach","-16 °C"]
[63584,"Rothenbergen","-14 °C"]
[91284,"Rothenbruck","-16 °C"]
[91541,"Rothenburg ob der Tauber","-14 °C"]
[8237,"Rothenkirchen","-16 °C"]
[4924,"Rothstein","-16 °C"]
[95336,"Rothwind","-16 °C"]
[8468,"Rotschau","-16 °C"]
[52159,"Rott","-14 °C"]
[82216,"Rottbach","-16 °C"]
[99444,"Rottdorf","-14 °C"]
[6295,"Rottelsdorf","-14 °C"]
[91341,"Röttenbach","-16 °C"]
[72108,"Rottenburg","-16 °C"]
[36275,"Rotterterode","-14 °C"]
[94094,"Rotthalmünster","-16 °C"]
[45884,"Rotthausen","-10 °C"]
[14793,"Rottstock","-14 °C"]
[78628,"Rottweil","-16 °C"]
[92444,"Rötz","-18 °C"]
[17094,"Rowa","-14 °C"]
[56070,"Rübenach","-14 °C"]
[3238,"Rückersdorf","-16 °C"]
[24960,"Rüde","-10 °C"]
[73635,"Rudersberg","-14 °C"]
[15562,"Rüdersdorf","-14 °C"]
[94161,"Ruderting","-16 °C"]
[65385,"Rüdesheim","-12 °C"]
[91438,"Rüdisbronn","-16 °C"]
[7407,"Rudolstadt","-14 °C"]
[19069,"Rugensee","-12 °C"]
[23970,"Rüggow","-10 °C"]
[91622,"Rügland","-16 °C"]
[99842,"Ruhla","-16 °C"]
[1945,"Ruhland","-16 °C"]
[6917,"Ruhlsdorf","-14 °C"]
[79639,"Rührberg","-12 °C"]
[94099,"Ruhstorf","-16 °C"]
[26969,"Ruhwarden","-10 °C"]
[75015,"Ruit","-14 °C"]
[88512,"Rulfingen","-14 °C"]
[79595,"Rümmingen","-12 °C"]
[93486,"Runding","-18 °C"]
[88448,"Rupertshofen","-16 °C"]
[56558,"Ruppenrod","-14 °C"]
[35325,"Ruppertenrod","-14 °C"]
[67152,"Ruppertsberg","-12 °C"]
[8435,"Ruppertsgrün","-16 °C"]
[8543,"Ruppertsgrün","-16 °C"]
[65779,"Ruppertshain","-14 °C"]
[73577,"Ruppertshofen","-16 °C"]
[66957,"Ruppertsweiler","-12 °C"]
[53809,"Ruppichteroth","-12 °C"]
[88410,"Rupprechts","-16 °C"]
[52152,"Rurberg","-14 °C"]
[55776,"Ruschberg","-14 °C"]
[65428,"Rüsselsheim","-12 °C"]
[91320,"Rüssenbach","-16 °C"]
[18230,"Russow","-10 °C"]
[79733,"Rüßwihl","-14 °C"]
[77977,"Rust","-12 °C"]
[71277,"Rutesheim","-14 °C"]
[67752,"Rutsweiler","-12 °C"]
[94339,"Rutzenbach","-18 °C"]
[18317,"Saal","-10 °C"]
[7318,"Saalfeld/Saale","-14 °C"]
[15806,"Saalow","-14 °C"]
[66115,"Saarbrücken","-12 °C"]
[66701,"Saarfels","-12 °C"]
[66740,"Saarlouis","-12 °C"]
[66793,"Saarwellingen","-12 °C"]
[32816,"Sabbenhausen","-14 °C"]
[34513,"Sachsenhausen","-14 °C"]
[89537,"Sachsenhausen","-16 °C"]
[74343,"Sachsenheim","-12 °C"]
[83679,"Sachsenkam","-18 °C"]
[1561,"Sacka","-16 °C"]
[17099,"Sadelkow","-14 °C"]
[21493,"Sahms","-12 °C"]
[21272,"Sahrendorf","-14 °C"]
[73084,"Salach","-16 °C"]
[57290,"Salchendorf","-14 °C"]
[94330,"Salching","-18 °C"]
[94163,"Saldenburg","-16 °C"]
[88682,"Salem","-14 °C"]
[3238,"Sallgast","-16 °C"]
[72393,"Salmendingen","-18 °C"]
[54528,"Salmtal","-14 °C"]
[63628,"Salmünster","-14 °C"]
[97616,"Salz","-14 °C"]
[2627,"Salzenforst","-16 °C"]
[38226,"Salzgitter","-14 °C"]
[31020,"Salzhemmendorf","-14 °C"]
[33154,"Salzkotten","-12 °C"]
[72178,"Salzstetten","-16 °C"]
[29410,"Salzwedel","-14 °C"]
[94121,"Salzweg","-16 °C"]
[39326,"Samswegen","-14 °C"]
[34308,"Sand","-14 °C"]
[77731,"Sand","-12 °C"]
[39524,"Sandau","-14 °C"]
[16559,"Sandberge","-14 °C"]
[33106,"Sande","-12 °C"]
[6792,"Sandersdorf","-14 °C"]
[34266,"Sandershausen","-12 °C"]
[6456,"Sandersleben","-14 °C"]
[23898,"Sandesneben","-12 °C"]
[76532,"Sandweier ( Baden-Baden)","-12 °C"]
[6526,"Sangerhausen","-14 °C"]
[18190,"Sanitz","-12 °C"]
[37444,"Sankt Andreasberg","-16 °C"]
[53757,"Sankt Augustin","-12 °C"]
[79837,"Sankt Blasien","-16 °C"]
[21357,"Sankt Dionys","-12 °C"]
[78112,"Sankt Georgen","-16 °C"]
[56346,"Sankt Goarshausen","-12 °C"]
[66383,"Sankt Ingbert","-12 °C"]
[56727,"Sankt Johann","-14 °C"]
[72813,"Sankt Johann","-16 °C"]
[68789,"Sankt Leon-Rot","-12 °C"]
[79274,"Sankt Märgen","-18 °C"]
[9618,"Sankt Michaelis","-16 °C"]
[25826,"Sankt Peter-Ording","-10 °C"]
[66606,"Sankt Wendel","-12 °C"]
[23719,"Sarau","-12 °C"]
[2627,"Särka","-16 °C"]
[31157,"Sarstedt","-14 °C"]
[77880,"Sasbach","-12 °C"]
[79361,"Sasbach","-12 °C"]
[77887,"Sasbachwalden","-14 °C"]
[48336,"Sassenberg","-12 °C"]
[18546,"Saßnitz","-10 °C"]
[18239,"Satow","-12 °C"]
[74589,"Satteldorf","-16 °C"]
[82054,"Sauerlach","-16 °C"]
[88524,"Sauggart","-14 °C"]
[94344,"Saulburg","-18 °C"]
[88605,"Sauldorf","-14 °C"]
[88348,"Saulgau","-14 °C"]
[82442,"Saulgrub","-18 °C"]
[78078,"Schabenhausen","-16 °C"]
[37318,"Schachtebich","-16 °C"]
[39343,"Schackensleben","-14 °C"]
[6449,"Schadeleben","-14 °C"]
[36358,"Schadges","-14 °C"]
[24980,"Schafflund","-10 °C"]
[71263,"Schafhausen","-16 °C"]
[76744,"Schaidt","-12 °C"]
[58579,"Schalckmühle","-12 °C"]
[96528,"Schalkau","-16 °C"]
[53426,"Schalkenbach","-14 °C"]
[58579,"Schalksmühle","-12 °C"]
[79227,"Schallstadt","-14 °C"]
[83547,"Schambach","-16 °C"]
[38162,"Schandelah","-14 °C"]
[77776,"Schapbach","-16 °C"]
["2368x","Scharbeutz","-10 °C"]
[1665,"Scharfenberg","-14 °C"]
[59929,"Scharfenberg","-14 °C"]
[33154,"Scharmede","-12 °C"]
[69168,"Schatthausen","-12 °C"]
[31737,"Schaumburg","-14 °C"]
[24960,"Schausende","-10 °C"]
[83135,"Schechen","-16 °C"]
[73579,"Schechingen","-16 °C"]
[37127,"Scheden","-14 °C"]
[8056,"Schedewitz","-14 °C"]
[72516,"Scheer","-14 °C"]
[27383,"Scheeßel","-12 °C"]
[74850,"Schefflenz","-14 °C"]
[9481,"Scheibenberg","-16 °C"]
[4460,"Scheidens","-14 °C"]
[56379,"Scheidt","-12 °C"]
[91443,"Scheinfeld","-16 °C"]
[79235,"Schelingen","-12 °C"]
[89601,"Schelklingen","-16 °C"]
[75242,"Schellbronn","-14 °C"]
[1776,"Schellerhau","-16 °C"]
[31174,"Schellerten","-14 °C"]
[8301,"Schelma","-16 °C"]
[88433,"Schemmerberg","-16 °C"]
[88433,"Schemmerhofen","-16 °C"]
[4509,"Schenkenberg","-14 °C"]
[3172,"Schenkendöbern","-16 °C"]
[77773,"Schenkenzell","-14 °C"]
[36288,"Schenklengsfeld","-14 °C"]
[46514,"Schermbeck","-10 °C"]
[86872,"Scherstetten","-16 °C"]
[96110,"Scheßlitz","-16 °C"]
[53572,"Scheuren","-12 °C"]
[85298,"Scheyern","-16 °C"]
[32816,"Schieder-Schwalenberg","-14 °C"]
["652xx","Schierstein","-12 °C"]
[27619,"Schiffdorf","-12 °C"]
[67105,"Schifferstadt","-12 °C"]
[3253,"Schilda","-16 °C"]
[4889,"Schildau","-16 °C"]
[16552,"Schildow","-14 °C"]
[91583,"Schillingsfürst","-16 °C"]
[74744,"Schillingstadt","-16 °C"]
[77761,"Schiltach","-16 °C"]
[2681,"Schirgiswalde","-16 °C"]
[4435,"Schkeuditz","-14 °C"]
[4420,"Schkölen","-14 °C"]
[6258,"Schkopau","-14 °C"]
[52372,"Schlagstein","-14 °C"]
[4749,"Schlagwitz","-14 °C"]
[72667,"Schlaitdorf","-16 °C"]
[33189,"Schlangen","-14 °C"]
[65388,"Schlangenbad","-14 °C"]
[29459,"Schlannau","-14 °C"]
[6785,"Schleesen","-14 °C"]
[54340,"Schleich","-10 °C"]
[52457,"Schleiden","-12 °C"]
[53937,"Schleiden","-14 °C"]
[53937,"Schleiden/Efel","-14 °C"]
[7907,"Schleiz","-16 °C"]
[24837,"Schleswig","-10 °C"]
[41470,"Schlicherum","-10 °C"]
[73614,"Schlichten","-16 °C"]
[4936,"Schlieben","-16 °C"]
[79418,"Schliengen","-12 °C"]
[88281,"Schlier","-14 °C"]
[63636,"Schlierbach","-12 °C"]
[74706,"Schlierstadt","-16 °C"]
[36110,"Schlitz","-14 °C"]
[7646,"Schlöben","-14 °C"]
[33758,"Schloß Holte","-12 °C"]
[33104,"Schloß Neuhaus","-12 °C"]
[30826,"Schloss Ricklingen","-14 °C"]
[73441,"Schloßberg","-16 °C"]
[9439,"Schlößchen","-14 °C"]
[99195,"Schloßvippach","-14 °C"]
[79859,"Schluchsee","-18 °C"]
[36381,"Schlüchtern","-14 °C"]
[32469,"Schlüsselburg","-12 °C"]
[96132,"Schlüsselfeld","-16 °C"]
[27804,"Schlüte","-10 °C"]
[76275,"Schluttenbach","-14 °C"]
[57392,"Schmallenberg","-14 °C"]
[6295,"Schmalzerode","-14 °C"]
[98530,"Schmeheim","-16 °C"]
[95336,"Schmeilsdorf","-16 °C"]
[66839,"Schmelz","-12 °C"]
[4895,"Schmerkendorf","-16 °C"]
[14776,"Schmerzke","-14 °C"]
[52385,"Schmidt","-14 °C"]
[55758,"Schmidthachenbach","-14 °C"]
[53949,"Schmidtheim","-14 °C"]
[89601,"Schmiechen","-16 °C"]
[98711,"Schmiedefeld","-16 °C"]
[99518,"Schmiedehausen","-14 °C"]
[77971,"Schmieheim","-12 °C"]
[99094,"Schmira","-14 °C"]
[61389,"Schmitten","-16 °C"]
[17506,"Schmoldow","-12 °C"]
[4828,"Schmölen","-14 °C"]
[4626,"Schmölln","-14 °C"]
[17291,"Schmölln","-14 °C"]
[71384,"Schnait","-14 °C"]
[91220,"Schnaittach","-16 °C"]
[92253,"Schnaittenbach","-16 °C"]
[32609,"Schnathorst","-12 °C"]
[67699,"Schneckenhausen","-12 °C"]
[8289,"Schneeberg","-16 °C"]
[29465,"Schnega","-14 °C"]
[34286,"Schnellrode","-14 °C"]
[29640,"Schneverdingen","-14 °C"]
[96215,"Schney","-16 °C"]
[89194,"Schnürpflingen","-16 °C"]
[6179,"Schochwitz","-14 °C"]
[35641,"Schöffengrund","-14 °C"]
[27305,"Scholen","-12 °C"]
[63825,"Schöllkrippen","-14 °C"]
[94508,"Schöllnach","-18 °C"]
[72290,"Schömberg","-14 °C"]
[72355,"Schömberg","-18 °C"]
[75328,"Schömberg","-16 °C"]
[4838,"Schöna","-14 °C"]
[71101,"Schönaich","-16 °C"]
[8121,"Schönau","-14 °C"]
[69250,"Schönau","-12 °C"]
[79677,"Schönau","-16 °C"]
[83471,"Schönau","-18 °C"]
[84337,"Schönau","-16 °C"]
[2708,"Schönbach","-16 °C"]
[8496,"Schönbach","-16 °C"]
[17349,"Schönbeck","-14 °C"]
[23923,"Schönberg","-10 °C"]
[94513,"Schönberg","-18 °C"]
[1465,"Schönborn","-14 °C"]
[56370,"Schönborn","-14 °C"]
[71557,"Schönbronn","-16 °C"]
[72218,"Schönbronn","-16 °C"]
[8485,"Schönbrunn","-16 °C"]
[8606,"Schönbrunn","-18 °C"]
[86938,"Schondorf","-16 °C"]
[7924,"Schöndorf","-16 °C"]
[39218,"Schönebeck/Elbe","-14 °C"]
[88477,"Schönebürg","-16 °C"]
[8261,"Schöneck","-18 °C"]
[61137,"Schöneck","-12 °C"]
[12529,"Schönefeld","-14 °C"]
[17291,"Schönermark","-14 °C"]
[9569,"Schönerstadt","-14 °C"]
[4703,"Schönerstädt","-14 °C"]
[86676,"Schönesberg","-16 °C"]
[19205,"Schönfeld","-12 °C"]
[8115,"Schönfels","-16 °C"]
[15326,"Schönfließ","-14 °C"]
[16567,"Schönfließ","-14 °C"]
[86956,"Schongau","-16 °C"]
[37170,"Schönhagen","-14 °C"]
[73574,"Schönhardt","-16 °C"]
[39524,"Schönhausen","-14 °C"]
[3130,"Schönheide","-16 °C"]
[8304,"Schönheide","-16 °C"]
[37170,"Schoningen","-14 °C"]
[16321,"Schönow","-14 °C"]
[92539,"Schönsee","-18 °C"]
[83137,"Schonstett","-16 °C"]
[74214,"Schöntal","-14 °C"]
[1471,"Schönteichen","-16 °C"]
[1920,"Schönteichen","-16 °C"]
[78141,"Schönwald","-18 °C"]
[14621,"Schönwalde","-14 °C"]
[79650,"Schopfheim","-12 °C"]
[72296,"Schopfloch","-16 °C"]
[67707,"Schopp","-12 °C"]
[38170,"Schöppenstedt","-14 °C"]
[37627,"Schorborn","-14 °C"]
[73614,"Schornbach","-16 °C"]
[93489,"Schorndorf","-18 °C"]
[73614,"Schorndorf- Schlichten","-16 °C"]
[73614,"Schorndorf/Württ.","-16 °C"]
[55288,"Schornsheim","-12 °C"]
[6369,"Schortewitz","-14 °C"]
[72355,"Schörzingen","-18 °C"]
[19073,"Schossin","-12 °C"]
[63679,"Schotten/Hessen","-12 °C"]
[null,"Schottland (Durris)","-12 °C"]
[null,"Schottland (Newtonmore)","-12 °C"]
[4928,"Schraden","-16 °C"]
[78713,"Schramberg","-16 °C"]
[4720,"Schrebitz","-14 °C"]
[8233,"Schreiersgrün","-16 °C"]
[73479,"Schrezheim","-16 °C"]
[69198,"Schriesheim","-12 °C"]
[86529,"Schrobenhausen","-18 °C"]
[24850,"Schuby","-12 °C"]
[54586,"Schüller","-14 °C"]
[15732,"Schulzendorf","-14 °C"]
[77948,"Schuttern","-12 °C"]
[77978,"Schuttertal","-14 °C"]
[77746,"Schutterwald","-12 °C"]
[77746,"Schutterwald-Höfen","-12 °C"]
[53894,"Schützendorf","-14 °C"]
[18258,"Schwaan","-12 °C"]
[91126,"Schwabach","-16 °C"]
[74626,"Schwabbach","-14 °C"]
[85247,"Schwabhausen","-16 °C"]
["7352x","Schwäbisch Gmünd","-16 °C"]
[74523,"Schwäbisch Hall","-16 °C"]
[86830,"Schwabmünchen","-16 °C"]
[86987,"Schwabsoien","-16 °C"]
[90571,"Schwaig","-16 °C"]
[74193,"Schwaigern","-14 °C"]
[71409,"Schwaikheim","-14 °C"]
[65824,"Schwalbach","-14 °C"]
[66773,"Schwalbach","-12 °C"]
[72108,"Schwalldorf","-16 °C"]
[34613,"Schwalmstadt","-14 °C"]
[36318,"Schwalmtal","-14 °C"]
[41366,"Schwalmtal","-10 °C"]
[77963,"Schwanau","-12 °C"]
[8538,"Schwand","-16 °C"]
[8538,"Schwand","-16 °C"]
[90596,"Schwand","-16 °C"]
[92421,"Schwandorf","-16 °C"]
[14806,"Schwanebeck","-14 °C"]
[16341,"Schwanebeck","-14 °C"]
[41812,"Schwanenberg","-10 °C"]
[28790,"Schwanewede","-10 °C"]
[97523,"Schwanfeld","-14 °C"]
[75334,"Schwann","-14 °C"]
[99195,"Schwansee","-14 °C"]
[90596,"Schwanstetten","-16 °C"]
[29690,"Schwarmstedt","-12 °C"]
[74869,"Schwarzach","-12 °C"]
[92548,"Schwarzach","-16 °C"]
[94491,"Schwarzach","-18 °C"]
[95126,"Schwarzenbach/Saale","-18 °C"]
[21493,"Schwarzenbek","-12 °C"]
[75328,"Schwarzenberg","-16 °C"]
[93458,"Schwarzenberg","-18 °C"]
[8340,"Schwarzenberg/Erzgeb.","-16 °C"]
[90592,"Schwarzenbruck","-16 °C"]
[92521,"Schwarzenfeld","-16 °C"]
[2977,"Schwarzkollm","-16 °C"]
[24229,"Schwedeneck","-10 °C"]
[16303,"Schwedt/Oder","-16 °C"]
[54338,"Schweich","-10 °C"]
[76889,"Schweigen","-12 °C"]
[77978,"Schweighausen","-14 °C"]
[76889,"Schweighofen","-12 °C"]
[9326,"Schweikertshain","-14 °C"]
[97422,"Schweinfurt","-14 °C"]
[88454,"Schweinhausen","-16 °C"]
[6928,"Schweinitz","-14 °C"]
[58332,"Schwelm","-12 °C"]
[88477,"Schwendi","-16 °C"]
[72477,"Schwenningen","-16 °C"]
["780xx","Schwenningen/Neckar","-16 °C"]
[1936,"Schwepnitz","-16 °C"]
[53909,"Schwerfen","-14 °C"]
[15755,"Schwerin","-14 °C"]
["1906x","Schwerin","-12 °C"]
[99634,"Schwerstedt","-14 °C"]
[58239,"Schwerte/Ruhr","-12 °C"]
[6188,"Schwerz","-14 °C"]
[4769,"Schweta","-14 °C"]
[68723,"Schwetzingen","-12 °C"]
[71701,"Schwieberdingen","-14 °C"]
[86940,"Schwifting","-16 °C"]
[84419,"Schwindegg","-16 °C"]
[6295,"Schwittersdorf","-14 °C"]
[86754,"Schwörsheim","-16 °C"]
[79739,"Schwörstadt","-12 °C"]
[31311,"Schwüblingsen","-14 °C"]
[38179,"Schwülper","-14 °C"]
[96247,"Schwürbitz","-16 °C"]
[1855,"Sebnitz","-16 °C"]
[71566,"Sechselberg","-14 °C"]
[53332,"Sechtem","-12 °C"]
[74743,"Seckach","-14 °C"]
[77889,"Seebach","-16 °C"]
[17420,"Seebad Heringsdorf","-12 °C"]
[72108,"Seebronn","-16 °C"]
[83358,"Seebruck","-16 °C"]
[37136,"Seeburg","-16 °C"]
[39307,"Seedorf","-14 °C"]
[39319,"Seedorf","-14 °C"]
[78655,"Seedorf","-16 °C"]
[82229,"Seefeld","-16 °C"]
[6888,"Seegrehna","-14 °C"]
[39615,"Seehausen","-14 °C"]
[82418,"Seehausen","-16 °C"]
[77960,"Seelbach","-14 °C"]
[1909,"Seeligstadt","-14 °C"]
[4687,"Seeligstädt","-14 °C"]
[4769,"Seelitz","-14 °C"]
[9306,"Seelitz","-14 °C"]
[53819,"Seelscheid","-12 °C"]
[30926,"Seelze","-14 °C"]
[38723,"Seesen","-14 °C"]
[86925,"Seestall","-16 °C"]
["212xx","Seevetal","-12 °C"]
[21217,"Seevetal - Over","-12 °C"]
[72297,"Seewald","-16 °C"]
[79733,"Segeten","-16 °C"]
[31196,"Sehlem","-16 °C"]
[54518,"Sehlem","-14 °C"]
[9465,"Sehma","-16 °C"]
[31319,"Sehnde","-14 °C"]
[88410,"Seibranz","-16 °C"]
[9548,"Seiffen","-16 °C"]
[7389,"Seisla","-14 °C"]
[89143,"Seißen","-16 °C"]
[78606,"Seitingen - Oberflacht","-18 °C"]
[95100,"Selb","-18 °C"]
[52538,"Selfkant","-10 °C"]
[63500,"Seligenstadt","-12 °C"]
[98593,"Seligenthal","-16 °C"]
[24884,"Selk","-12 °C"]
[4626,"Selka","-14 °C"]
[18586,"Sellin","-10 °C"]
[27619,"Sellstedt","-12 °C"]
[59379,"Selm","-12 °C"]
[23923,"Selmsdorf","-10 °C"]
[27446,"Selsingen","-12 °C"]
[65618,"Selters","-14 °C"]
[55278,"Selzen","-12 °C"]
[48308,"Senden","-12 °C"]
[89250,"Senden","-16 °C"]
[48324,"Sendenhorst","-12 °C"]
[1968,"Senftenberg","-16 °C"]
[92369,"Sengenthal","-16 °C"]
[56820,"Senheim","-12 °C"]
[33659,"Senne I","-12 °C"]
[33102,"Sennelager","-12 °C"]
[6193,"Sennewitz","-14 °C"]
[97526,"Sennfeld","-14 °C"]
[15754,"Senzig","-14 °C"]
[4668,"Sermuth","-14 °C"]
[18292,"Serrahn","-12 °C"]
[75446,"Serres","-14 °C"]
[54455,"Serrig","-12 °C"]
[74372,"Sersheim","-12 °C"]
[16230,"Serwest","-14 °C"]
[56244,"Sessenhausen","-14 °C"]
[37124,"Settmarshausen","-16 °C"]
[92358,"Seubersdorf","-16 °C"]
[90556,"Seukendorf","-16 °C"]
[37136,"Seulingen","-16 °C"]
[79350,"Sexau","-14 °C"]
[31079,"Sibbesse","-14 °C"]
[72379,"Sickingen","-16 °C"]
[38173,"Sickte","-14 °C"]
[76833,"Siebeldingen","-12 °C"]
[9634,"Siebenlehn","-14 °C"]
[6308,"Siebigerode","-14 °C"]
[1920,"Siebitz","-16 °C"]
[17089,"Siedenbollentin","-14 °C"]
[35768,"Siegbach","-14 °C"]
[53721,"Siegburg","-12 °C"]
[74936,"Siegelsbach","-12 °C"]
["5707x","Siegen","-12 °C"]
[93354,"Siegenburg","-18 °C"]
["5384x","Sieglar","-12 °C"]
[6420,"Sieglitz","-14 °C"]
[83313,"Siegsdorf","-16 °C"]
[70794,"Sielmingen","-14 °C"]
[3055,"Sielow","-16 °C"]
[52457,"Siersdorf","-12 °C"]
[29664,"Sieverdingen","-12 °C"]
[27607,"Sievern","-10 °C"]
[23936,"Sievershagen","-10 °C"]
[31275,"Sievershausen","-14 °C"]
[19376,"Siggelkow","-14 °C"]
[72488,"Sigmaringen","-14 °C"]
[72517,"Sigmaringendorf","-14 °C"]
[72172,"Sigmarswangen","-16 °C"]
[37603,"Silberborn","-14 °C"]
[6493,"Silberhütte","-16 °C"]
[24887,"Silberstedt","-12 °C"]
[8121,"Silberstraße","-14 °C"]
[37345,"Silkerode","-16 °C"]
[94436,"Simbach","-16 °C"]
[91245,"Simmelsdorf","-16 °C"]
[52152,"Simmerath","-14 °C"]
[55469,"Simmern","-14 °C"]
[35713,"Simmersbach","-14 °C"]
[3149,"Simmersdorf","-16 °C"]
[72226,"Simmersfeld","-16 °C"]
[97215,"Simmershofen","-16 °C"]
[55618,"Simmertal","-14 °C"]
[75397,"Simmozheim","-16 °C"]
[79263,"Simonswald","-18 °C"]
[4720,"Simselwitz","-14 °C"]
[71063,"Sindelfingen","-14 °C"]
[82404,"Sindelsdorf","-18 °C"]
[75196,"Singen","-14 °C"]
["7820x","Singen-Hohentwiel","-14 °C"]
[50259,"Sinnersdorf","-12 °C"]
[74889,"Sinsheim","-12 °C"]
[21079,"Sinstorf (Hamburg)","-12 °C"]
[76545,"Sinzheim","-12 °C"]
[76547,"Sinzheim","-12 °C"]
[53489,"Sinzig","-12 °C"]
[67729,"Sippersfeld","-12 °C"]
[7557,"Sirbis","-14 °C"]
[72574,"Sirchingen","-16 °C"]
[23898,"Sirksfelde","-12 °C"]
[4703,"Sitten","-14 °C"]
[27419,"Sittensen","-12 °C"]
[4889,"Sitzenroda","-16 °C"]
[1561,"Skäßchen","-16 °C"]
[83139,"Söchtenau","-16 °C"]
[82319,"Söcking","-16 °C"]
[63834,"Soden","-14 °C"]
[59494,"Soest/Westf.","-12 °C"]
[89077,"Söflingen","-14 °C"]
[49751,"Sögel","-12 °C"]
[8626,"Sohl","-18 °C"]
[2689,"Sohland","-16 °C"]
[31185,"Söhlde","-14 °C"]
[79294,"Sölden","-16 °C"]
["426xx","Solingen","-12 °C"]
[18445,"Solkendorf","-10 °C"]
[6774,"Söllichau","-14 °C"]
[76327,"Söllingen","-12 °C"]
[2633,"Sollschwitz","-16 °C"]
[99759,"Sollstedt","-14 °C"]
[35606,"Solms","-12 °C"]
[29614,"Soltau","-12 °C"]
[99610,"Sömmerda","-14 °C"]
[72766,"Sondelfingen","-16 °C"]
[99706,"Sondershausen","-14 °C"]
[94146,"Sonndorf","-18 °C"]
[96515,"Sonneberg","-16 °C"]
[32683,"Sonneborn","-14 °C"]
[31634,"Sonnenborstel","-12 °C"]
[72820,"Sonnenbühl","-18 °C"]
[3249,"Sonnenwalde","-16 °C"]
[47665,"Sonsbeck","-10 °C"]
[89555,"Sontheim","-16 °C"]
[89567,"Sontheim","-16 °C"]
[4769,"Sornitz-Ablaß","-14 °C"]
[4769,"Sornzig","-14 °C"]
[4769,"Sornzig","-14 °C"]
[31134,"Sorsum","-14 °C"]
[8326,"Sosa","-16 °C"]
[27367,"Sottrum","-12 °C"]
[67620,"Soufflenheim (Frankreich)","-12 °C"]
[27619,"Spaden","-12 °C"]
[78549,"Spaichingen","-18 °C"]
[54529,"Spangdahlem","-14 °C"]
[34286,"Spangenberg","-14 °C"]
[95234,"Sparneck","-18 °C"]
[73066,"Sparwiesen","-16 °C"]
[82447,"Spatzenhausen","-16 °C"]
[74937,"Spechbach","-12 °C"]
[16250,"Spechthausen","-14 °C"]
[34355,"Speele","-12 °C"]
[54662,"Speicher","-14 °C"]
[15848,"Speichrow","-16 °C"]
[48480,"Spelle","-12 °C"]
[32139,"Spenge","-12 °C"]
[41363,"Spenrath","-12 °C"]
[16348,"Sperlingsaue","-14 °C"]
[76275,"Spessart","-14 °C"]
[75365,"Speßhardt","-16 °C"]
[67346,"Speyer","-12 °C"]
[94518,"Spiegelau","-18 °C"]
[71579,"Spiegelberg","-14 °C"]
[52445,"Spiel","-12 °C"]
[74343,"Spielberg","-14 °C"]
[76307,"Spielberg","-14 °C"]
[2794,"Spitzkunnersdorf","-16 °C"]
[17039,"Sponholz","-14 °C"]
[46399,"Spork","-10 °C"]
[19372,"Spornitz","-14 °C"]
[73565,"Spraitbach","-16 °C"]
[29365,"Sprakensehl","-14 °C"]
[15528,"Spreenhagen","-14 °C"]
[3130,"Spremberg","-16 °C"]
[31832,"Springe","-14 °C"]
[45549,"Sprockhövel","-12 °C"]
[4838,"Sprotta","-14 °C"]
[96155,"Stackendorf","-16 °C"]
["2165x","Stade","-10 °C"]
[61197,"Staden","-12 °C"]
[86946,"Stadl","-16 °C"]
[35260,"Stadtallendorf","-14 °C"]
[86391,"Stadtbergen","-16 °C"]
[99326,"Stadtilm","-14 °C"]
[54589,"Stadtkyll","-14 °C"]
[26953,"Stadtland","-10 °C"]
[97488,"Stadtlauringen","-16 °C"]
[48703,"Stadtlohn","-10 °C"]
[37627,"Stadtoldendorf","-14 °C"]
[97909,"Stadtprozelten","-14 °C"]
[7646,"Stadtroda","-14 °C"]
[96231,"Staffelstein","-16 °C"]
[96231,"Staffelstein","-16 °C"]
[88441,"Stafflangen","-16 °C"]
[76297,"Staffort","-12 °C"]
[37671,"Stahle","-12 °C"]
[56412,"Stahlhofen","-14 °C"]
[14532,"Stahnsdorf","-14 °C"]
[89195,"Staig","-16 °C"]
[75365,"Stammheim","-14 °C"]
[82319,"Starnberg","-16 °C"]
[17252,"Starsow","-14 °C"]
[72181,"Starzach","-16 °C"]
[39418,"Staßfurt","-14 °C"]
[86316,"Stätzling","-16 °C"]
[86641,"Staudheim","-16 °C"]
[79219,"Staufen","-14 °C"]
[89428,"Staufen","-16 °C"]
[34355,"Staufenberg","-12 °C"]
[17039,"Staven","-14 °C"]
[56276,"Stebach","-14 °C"]
[75050,"Stebbach","-14 °C"]
[4936,"Stechau","-16 °C"]
[96135,"Stegaurach","-16 °C"]
[39517,"Stegelitz","-14 °C"]
[79252,"Stegen","-16 °C"]
[12163,"Steglitz","-14 °C"]
[88633,"Steigen","-14 °C"]
[31634,"Steimbke","-12 °C"]
[57614,"Steimel","-14 °C"]
[74196,"Stein am Kocher","-12 °C"]
[90547,"Stein b. Nbg.","-16 °C"]
[1920,"Steina","-16 °C"]
[4703,"Steina","-14 °C"]
[77790,"Steinach","-14 °C"]
[94377,"Steinach","-18 °C"]
[36396,"Steinau a.d. Straße","-14 °C"]
[4567,"Steinbach","-14 °C"]
[9477,"Steinbach","-16 °C"]
[37308,"Steinbach","-16 °C"]
[97900,"Steinbach","-14 °C"]
[97500,"Steinbach bei Eltmann","-14 °C"]
[98587,"Steinbach-Hallenberg","-16 °C"]
[16259,"Steinbeck","-14 °C"]
[29646,"Steinbeck","-14 °C"]
[92449,"Steinberg","-16 °C"]
[75242,"Steinegg","-14 °C"]
[79585,"Steinen","-12 °C"]
[71144,"Steinenbronn","-16 °C"]
[79395,"Steinenstadt","-12 °C"]
[49439,"Steinfeld","-12 °C"]
[97854,"Steinfeld","-14 °C"]
[65529,"Steinfischbach","-14 °C"]
[48565,"Steinfurt","-12 °C"]
[33803,"Steinhagen","-12 °C"]
[88416,"Steinhausen","-16 °C"]
[88427,"Steinhausen","-16 °C"]
[32839,"Steinheim","-14 °C"]
[87700,"Steinheim","-16 °C"]
[89555,"Steinheim","-16 °C"]
[71711,"Steinheim an der Murr","-12 °C"]
[72406,"Steinhofen","-18 °C"]
[29367,"Steinhorst","-14 °C"]
[31515,"Steinhude","-14 °C"]
[1904,"Steinigtwolmsdorf","-16 °C"]
[29416,"Steinitz","-14 °C"]
[39319,"Steinitz","-14 °C"]
[38275,"Steinlah","-14 °C"]
[76479,"Steinmauern","-12 °C"]
[17391,"Steinmocker","-12 °C"]
[8432,"Steinpleis (Werdau)","-16 °C"]
[8538,"Steins","-16 °C"]
[56379,"Steinsberg","-12 °C"]
[93128,"Steinsberg","-16 °C"]
[8547,"Steinsdorf","-16 °C"]
[97539,"Steinsfeld","-14 °C"]
[74889,"Steinsfurt","-12 °C"]
[76872,"Steinweiler","-12 °C"]
[21435,"Stelle","-12 °C"]
[7922,"Stelzen","-18 °C"]
[32351,"Stemwede","-12 °C"]
[39576,"Stendal","-14 °C"]
[16306,"Stendell","-14 °C"]
[8144,"Stenn","-14 °C"]
[4769,"Stennschütz","-14 °C"]
[46145,"Sterkrade","-10 °C"]
[46147,"Sterkrade","-10 °C"]
[19406,"Sternberg","-12 °C"]
[75447,"Sternenfels","-14 °C"]
[35094,"Sterzhausen","-12 °C"]
[70771,"Stetten","-14 °C"]
[72379,"Stetten","-16 °C"]
[78570,"Stetten","-16 °C"]
[78658,"Stetten","-16 °C"]
[88480,"Stetten","-16 °C"]
[72393,"Stetten ( Burladingen )","-18 °C"]
[72510,"Stetten am kalten Markt","-16 °C"]
[70771,"Stetten auf den Fildern","-14 °C"]
[86462,"Stettenhofen","-16 °C"]
[31593,"Steyerberg","-12 °C"]
[27476,"Stickenbüttel","-10 °C"]
[88167,"Stiefenhofen","-18 °C"]
[74597,"Stimpfach","-16 °C"]
[23795,"Stipsdorf","-10 °C"]
[72810,"Stockach","-16 °C"]
[85235,"Stockach","-16 °C"]
[82131,"Stockdorf","-16 °C"]
[32617,"Stockelsdorf","-12 °C"]
[37154,"Stöckheim","-16 °C"]
[79697,"Stockmatt","-16 °C"]
[71543,"Stocksberg","-14 °C"]
[31638,"Stöckse","-12 °C"]
[63811,"Stockstadt","-12 °C"]
[64589,"Stockstadt","-12 °C"]
[73495,"Stödtlen","-16 °C"]
[24321,"Stöfs","-10 °C"]
[6547,"Stolberg","-16 °C"]
[52222,"Stolberg","-12 °C"]
["5220x","Stolberg/Rheinl.","-12 °C"]
[9366,"Stollberg","-14 °C"]
[52224,"Stollberg - Werth","-12 °C"]
[77836,"Stollhofen","-12 °C"]
[1833,"Stolpen","-14 °C"]
[16348,"Stolzenhagen","-14 °C"]
[4916,"Stolzenhain","-14 °C"]
[50259,"Stommeln","-12 °C"]
[31167,"Störy","-14 °C"]
[91793,"Störzelbach","-16 °C"]
[87677,"Stöttwang","-16 °C"]
[53881,"Stotzheim","-14 °C"]
[6896,"Straach","-14 °C"]
[41542,"Straberg","-10 °C"]
[47638,"Straelen","-10 °C"]
[2747,"Strahwalde","-16 °C"]
[19073,"Stralendorf","-12 °C"]
["1840x","Stralsund","-10 °C"]
[8527,"Straßberg","-16 °C"]
[72479,"Straßberg","-16 °C"]
[73529,"Straßdorf","-16 °C"]
[56587,"Straßenhaus","-14 °C"]
[1936,"Strassgräbchen","-16 °C"]
[94342,"Straßkirchen","-18 °C"]
[75334,"Straubenhardt","-14 °C"]
["9430x","Straubing","-18 °C"]
[15913,"Straupitz","-16 °C"]
[15344,"Strausberg","-14 °C"]
[1616,"Strehla","-16 °C"]
[72336,"Streichen","-18 °C"]
[54597,"Strickscheid","-14 °C"]
[9661,"Striegistal","-14 °C"]
[3046,"Ströbitz","-16 °C"]
[4703,"Strocken","-14 °C"]
[77723,"Strohbach","-14 °C"]
[4720,"Strölla","-14 °C"]
[83489,"Strub","-16 °C"]
[96129,"Strullendorf","-16 °C"]
[71384,"Strümpfelbach","-14 °C"]
[69429,"Strümpfelbrunn","-14 °C"]
[1796,"Struppen","-14 °C"]
[96231,"Stublang","-16 °C"]
[79778,"Stühlingen","-14 °C"]
[28816,"Stuhr","-12 °C"]
[27211,"Stühren","-12 °C"]
[33758,"Stukenbrock","-12 °C"]
[76297,"Stutensee","-12 °C"]
["7xxxx","Stuttgart","-12 °C"]
[8328,"Stützengrün","-16 °C"]
[41749,"Süchteln","-10 °C"]
[18273,"Suckow","-12 °C"]
[26203,"Süd Moslesfehn","-12 °C"]
[26624,"Südbrookmerland","-10 °C"]
[29556,"Suderburg","-12 °C"]
[18516,"Süderholz","-12 °C"]
[46354,"Südlohn","-10 °C"]
[46354,"Südlohn","-10 °C"]
[98527,"Suhl","-16 °C"]
[98529,"Suhl","-16 °C"]
["9850x","Suhl","-16 °C"]
[38442,"Sülfeld","-14 °C"]
[78713,"Sulgen","-16 °C"]
[27232,"Sulingen","-12 °C"]
[88437,"Sulmingen","-16 °C"]
[72218,"Sulz","-16 °C"]
[77933,"Sulz","-12 °C"]
[72172,"Sulz am Neckar","-16 °C"]
[63834,"Sulzbach","-12 °C"]
[76316,"Sulzbach","-12 °C"]
[86551,"Sulzbach","-16 °C"]
[74429,"Sulzbach - Laufen","-16 °C"]
[92237,"Sulzbach - Rosenberg","-16 °C"]
[66280,"Sulzbach/Saar","-12 °C"]
[65843,"Sulzbach/Taunus","-14 °C"]
[71560,"Sulzbach-Murr","-14 °C"]
[79295,"Sulzburg","-14 °C"]
[97528,"Sulzdorf an der Lederhecke","-16 °C"]
[85254,"Sulzemoos","-16 °C"]
[97262,"Sulzwiesen","-14 °C"]
[93104,"Sünching","-18 °C"]
[59846,"Sundern","-14 °C"]
[39343,"Süplingen","-14 °C"]
[89150,"Suppingen","-16 °C"]
[4860,"Süptitz","-16 °C"]
[24229,"Surendorf","-10 °C"]
[3226,"Suschow","-16 °C"]
[73079,"Süßen","-16 °C"]
[83250,"Süssen","-18 °C"]
[21398,"Süttorf","-12 °C"]
[53913,"Swisttal","-14 °C"]
[16230,"Sydower Fließ","-14 °C"]
[28857,"Syke","-12 °C"]
[6333,"Sylda","-14 °C"]
[89428,"Syrgenstein","-16 °C"]
[72348,"Täbingen","-16 °C"]
[86356,"Täfertingen","-16 °C"]
[71126,"Tailfingen","-16 °C"]
[72461,"Tailfingen","-18 °C"]
[69242,"Tairnbach","-12 °C"]
[74541,"Talberg","-16 °C"]
[72116,"Talheim","-18 °C"]
[74388,"Talheim","-12 °C"]
[78607,"Talheim","-18 °C"]
[71732,"Tamm","-12 °C"]
[39590,"Tangermünde","-14 °C"]
[36251,"Tann","-14 °C"]
[36142,"Tann/Rhön","-16 °C"]
[38875,"Tanne","-16 °C"]
[79400,"Tannenkirch","-12 °C"]
[92723,"Tännesberg","-18 °C"]
[88459,"Tannheim","-16 °C"]
[54296,"Tarforst","-12 °C"]
[27412,"Tarmstedt","-12 °C"]
[1906,"Taschendorf","-16 °C"]
[25881,"Tating","-10 °C"]
[2991,"Tätschwitz","-16 °C"]
[97941,"Tauberbischofsheim","-14 °C"]
[85114,"Tauberfeld","-16 °C"]
[97285,"Tauberrettersheim","-16 °C"]
[4425,"Taucha","-14 °C"]
[82024,"Taufkirchen","-16 °C"]
[84574,"Taufkirchen","-16 °C"]
[84416,"Taufkirchen / Vils","-16 °C"]
[65232,"Taunusstein","-14 °C"]
[1561,"Tauscha","-16 °C"]
[54456,"Tawern","-12 °C"]
[85235,"Taxa","-16 °C"]
[19288,"Techentin","-14 °C"]
[2625,"Technitz","-16 °C"]
[93105,"Tegernheim","-16 °C"]
[4617,"Tegkwitz","-14 °C"]
[7407,"Teichröda","-14 °C"]
[83317,"Teisendorf","-16 °C"]
[94241,"Teisnach-Arnetsried","-18 °C"]
[37339,"Teistungen","-16 °C"]
[48291,"Telgte","-12 °C"]
[56858,"Tellig","-14 °C"]
[14513,"Teltow","-14 °C"]
[89160,"Temmenhausen","-16 °C"]
[16230,"Tempelfelde","-14 °C"]
[17268,"Templin","-14 °C"]
[32609,"Tengern","-12 °C"]
[79331,"Teningen","-12 °C"]
[78144,"Tennenbronn","-16 °C"]
[3139,"Terpe","-16 °C"]
[19243,"Tessin","-12 °C"]
[17166,"Teterow","-12 °C"]
[88069,"Tettnang","-14 °C"]
[92552,"Teunz","-18 °C"]
[15755,"Teupitz","-14 °C"]
[96358,"Teuschnitz","-18 °C"]
[32689,"Tevenhausen","-14 °C"]
[86943,"Thaining","-16 °C"]
[36157,"Thalau","-16 °C"]
[7616,"Thalbürgel","-14 °C"]
[6502,"Thale","-14 °C"]
[83629,"Thalham","-18 °C"]
[9380,"Thalheim","-14 °C"]
[86657,"Thalheim","-16 °C"]
[66871,"Thallichtenberg","-14 °C"]
[4808,"Thallwitz","-14 °C"]
[91177,"Thalmässing","-16 °C"]
[99947,"Thamsbrück","-14 °C"]
[72406,"Thanheim","-18 °C"]
[83101,"Thansau","-16 °C"]
[86470,"Thaunhausen","-16 °C"]
["CH","Thayngen/Schweiz  (PLZ 8240)","-12 °C"]
[33739,"Theesen","-12 °C"]
[39291,"Theeßen","-14 °C"]
[97711,"Theinfeld","-16 °C"]
[66871,"Theisbergstegen","-12 °C"]
[92245,"Theuern","-16 °C"]
[1561,"Thiendorf","-16 °C"]
[4567,"Thierbach","-14 °C"]
[6888,"Thießen","-14 °C"]
[96369,"Thonberg","-16 °C"]
[29308,"Thören","-12 °C"]
[54340,"Thörnich","-12 °C"]
[8538,"Thossen","-18 °C"]
[4552,"Thräna","-14 °C"]
[4683,"Threna","-14 °C"]
[97723,"Thulba","-14 °C"]
[33154,"Thüle","-12 °C"]
[9419,"Thum","-14 °C"]
[4668,"Thümmlitzwalde","-14 °C"]
[92703,"Thumsenreuth","-16 °C"]
[97711,"Thundorf","-16 °C"]
[56743,"Thür","-14 °C"]
[94169,"Thurmannsbang","-18 °C"]
[76684,"Tiefenbach","-12 °C"]
[88422,"Tiefenbach","-16 °C"]
[89257,"Tiefenbach","-16 °C"]
[94113,"Tiefenbach","-16 °C"]
[75233,"Tiefenbronn","-14 °C"]
[8626,"Tiefenbrunn ü. Adorf/Vogtland","-18 °C"]
[79862,"Tiefenhäusern","-16 °C"]
[16259,"Tiefensee","-14 °C"]
[77704,"Tiergarten","-14 °C"]
[72469,"Tieringen","-18 °C"]
[37115,"Tiftlingerode","-16 °C"]
[24644,"Timmaspe","-12 °C"]
[26629,"Timmel","-10 °C"]
[23669,"Timmendorfer Strand","-10 °C"]
[25917,"Tinningstedt","-10 °C"]
[7546,"Tinz","-14 °C"]
[8606,"Tirpersdorf","-16 °C"]
[95643,"Tirschenreuth","-18 °C"]
[72636,"Tischardt","-16 °C"]
[79822,"Titisee-Neustadt","-18 °C"]
[94104,"Tittling","-16 °C"]
[84529,"Tittmoning","-16 °C"]
[52445,"Titz","-12 °C"]
[8538,"Tobertitz","-16 °C"]
[19230,"Toddin","-12 °C"]
[79682,"Todtmoos","-16 °C"]
[79674,"Todtnau","-16 °C"]
[84513,"Töging","-16 °C"]
[4720,"Töllschütz","-14 °C"]
[6231,"Tollwitz","-14 °C"]
[47918,"Tönisvorst","-10 °C"]
[99958,"Tonna","-14 °C"]
[15755,"Töpchin","-14 °C"]
[9306,"Topfseifersdorf","-14 °C"]
[4860,"Torgau","-16 °C"]
[17192,"Torgelow","-12 °C"]
[88212,"Torkenweiler","-14 °C"]
[6774,"Tornau","-14 °C"]
[25436,"Tornesch","-10 °C"]
[39249,"Tornitz","-14 °C"]
[2991,"Torno","-16 °C"]
[16230,"Tornow","-14 °C"]
[21255,"Tostedt","-12 °C"]
[56841,"Traben - Trarbach","-12 °C"]
[96257,"Trainau","-16 °C"]
[17449,"Trassenheide","-12 °C"]
[92283,"Traunfeld","-16 °C"]
[83278,"Traunstein","-16 °C"]
[4749,"Trebanitz","-14 °C"]
[14959,"Trebbin","-14 °C"]
[2959,"Trebendorf","-16 °C"]
[14822,"Trebitz","-14 °C"]
[19249,"Trebs","-12 °C"]
[92699,"Trebsau","-16 °C"]
[89558,"Treffelhausen","-16 °C"]
[34388,"Trendelburg","-14 °C"]
[15236,"Treplin","-14 °C"]
[8233,"Treuen","-16 °C"]
[1561,"Treugeböhla","-16 °C"]
[34613,"Treysa","-14 °C"]
[78098,"Triberg","-18 °C"]
[8606,"Triebel","-18 °C"]
[54294,"Trier","-10 °C"]
[54311,"Trierweiler","-12 °C"]
[84371,"Triftern","-16 °C"]
[72401,"Trillfingen","-16 °C"]
[67705,"Trippstadt","-12 °C"]
[7819,"Triptis","-14 °C"]
[54349,"Trittenheim","-10 °C"]
[3253,"Tröbitz","-16 °C"]
[72818,"Trochtelfingen","-18 °C"]
[95183,"Trogen","-18 °C"]
[6729,"Tröglitz","-14 °C"]
[53840,"Troisdorf","-12 °C"]
[91793,"Trommertsheim","-16 °C"]
[4880,"Trossin","-16 °C"]
[78647,"Trossingen","-18 °C"]
[98646,"Trostadt","-16 °C"]
[81825,"Trudering","-16 °C"]
[66957,"Trulben","-12 °C"]
[87779,"Trunkelsberg","-16 °C"]
[8428,"Trunzig","-14 °C"]
[98596,"Trusetal","-16 °C"]
[34613,"Trutzhain","-14 °C"]
[3130,"Tschernitz","-16 °C"]
["7207x","Tübingen","-16 °C"]
[90587,"Tuchenbach","-16 °C"]
[52538,"Tüddern","-10 °C"]
["795xx","Tüllingen","-12 °C"]
[99947,"Tüngeda","-14 °C"]
[78609,"Tuningen","-18 °C"]
[79189,"Tunsel","-14 °C"]
[83104,"Tuntenhausen","-16 °C"]
[99610,"Tunzenhausen","-14 °C"]
[82299,"Türkenfeld","-16 °C"]
[86842,"Türkheim","-16 °C"]
[66625,"Türkismühle","-14 °C"]
[3185,"Turnow","-16 °C"]
[29482,"Tüschau","-14 °C"]
[84577,"Tüßling","-16 °C"]
[84577,"Tüssling","-16 °C"]
[78532,"Tuttlingen","-16 °C"]
[17091,"Tützpatz","-14 °C"]
[49767,"Twist","-10 °C"]
[27239,"Twistringen","-12 °C"]
[52531,"Übach-Palenberg","-12 °C"]
[82216,"Überacker","-16 °C"]
[86641,"Überacker","-16 °C"]
[87463,"Überbach","-16 °C"]
[88662,"Überlingen","-12 °C"]
[83236,"Übersee","-16 °C"]
[76698,"Ubstadt","-12 °C"]
[31600,"Uchte","-12 °C"]
[97532,"Üchtelhausen","-16 °C"]
[39599,"Uchtspringe","-14 °C"]
[45886,"Ückendorf","-10 °C"]
[53773,"Uckerath","-12 °C"]
[4938,"Uebigau","-16 °C"]
[17373,"Ueckermünde","-12 °C"]
[47589,"Uedem","-10 °C"]
[91486,"Uehlfeld","-16 °C"]
[49843,"Uelsen","-10 °C"]
[29525,"Uelzen","-14 °C"]
[59071,"Uentrop","-12 °C"]
[31311,"Uetze","-14 °C"]
[97215,"Uffenheim","-16 °C"]
[82449,"Uffing","-16 °C"]
[73066,"Uhingen","-16 °C"]
[70329,"Uhlbach","-12 °C"]
[79777,"Ühlingen","-14 °C"]
[2999,"Uhyst","-16 °C"]
[88527,"Uingendorf","-14 °C"]
[32584,"Ulenburg","-12 °C"]
[2906,"Ullersdorf","-16 °C"]
[77871,"Ulm","-12 °C"]
["8907x","Ulm/Donau","-14 °C"]
[66887,"Ulmet","-14 °C"]
[6543,"Ulzigerode","-14 °C"]
["33xxx","Ummeln","-12 °C"]
[39365,"Ummendorf","-14 °C"]
[88444,"Ummendorf","-16 °C"]
[55278,"Undenheim","-12 °C"]
[53572,"Unkel","-12 °C"]
[88527,"Unlingen","-14 °C"]
["5942x","Unna","-12 °C"]
[69518,"Unterabtsteinach","-12 °C"]
[79774,"Unteralpfen","-14 °C"]
[78073,"Unterbaldingen","-16 °C"]
[89437,"Unterbechingen","-16 °C"]
[86657,"Unterbissingen","-16 °C"]
[87782,"Unteregg","-16 °C"]
[97247,"Untereisenheim","-14 °C"]
[74257,"Untereisesheim","-12 °C"]
[72669,"Unterensingen","-14 °C"]
[77736,"Unterentersbach","-14 °C"]
[88454,"Unteressendorf","-16 °C"]
[89278,"Unterfalheim","-14 °C"]
[74924,"Untergimpern","-12 °C"]
[94107,"Untergriesbach","-18 °C"]
[74177,"Untergriesheim","-12 °C"]
[76646,"Untergrombach","-12 °C"]
[73453,"Untergröningen","-16 °C"]
[74199,"Untergruppenbach","-12 °C"]
[96173,"Unterhaid","-16 °C"]
[91227,"Unterhaidelbach","-16 °C"]
[75378,"Unterhaugstett ( Bad Liebenzell )","-14 °C"]
[72805,"Unterhausen","-18 °C"]
[74199,"Unterheinriet","-14 °C"]
[79256,"Unteribental","-18 °C"]
[97340,"Unterickelsheim","-16 °C"]
[72070,"Unterjesingen","-16 °C"]
[71131,"Unterjettingen","-16 °C"]
[6721,"Unterkaka","-14 °C"]
[89171,"Unterkirchberg","-16 °C"]
[89331,"Unterknöringen","-16 °C"]
[75394,"Unterkollbach","-16 °C"]
[7922,"Unterkoskau","-16 °C"]
[75328,"Unterlengenhardt","-16 °C"]
[73252,"Unterlenningen","-16 °C"]
[85410,"Untermarchenbach","-16 °C"]
[91171,"Untermässing","-16 °C"]
[86929,"Untermühlhausen","-16 °C"]
[74547,"Untermünkheim","-16 °C"]
[79244,"Untermünstertal","-18 °C"]
[76703,"Unteröwisheim","-12 °C"]
[82110,"Unterpfaffenhofen","-16 °C"]
[86871,"Unterrammingen","-16 °C"]
[75339,"Unterreichenbach","-14 °C"]
[89299,"Unterroth","-16 °C"]
[85716,"Unterschleißheim","-16 °C"]
[73485,"Unterschneidheim","-16 °C"]
[74869,"Unterschwarzach","-12 °C"]
[88410,"Unterschwarzach","-16 °C"]
[96253,"Untersiemau","-14 °C"]
[82395,"Untersöchering","-16 °C"]
[74423,"Untersontheim","-16 °C"]
[89619,"Unterstadion","-14 °C"]
[96154,"Untersteinach","-16 °C"]
[74629,"Untersteinbach","-16 °C"]
[88471,"Untersulmetingen","-16 °C"]
[72160,"Untertalheim","-16 °C"]
[70327,"Untertürkheim","-12 °C"]
[97654,"Unterwaldbehrungen","-16 °C"]
[79780,"Unterwangen","-14 °C"]
[71554,"Unterweissach","-14 °C"]
[86519,"Unterwiesenbach","-16 °C"]
[83246,"Unterwössen","-16 °C"]
[23936,"Upahl","-10 °C"]
[72813,"Upfingen","-18 °C"]
[73660,"Urbach","-16 °C"]
[99765,"Urbach","-14 °C"]
["5xxxx","Urbach","-12 °C"]
[56182,"Urbar","-12 °C"]
[50389,"Urfeld","-12 °C"]
[77767,"Urloffen","-12 °C"]
[88693,"Urnau","-14 °C"]
[86513,"Ursberg","-16 °C"]
[91710,"Ursberg","-16 °C"]
[61250,"Usingen","-14 °C"]
[37170,"Uslar","-14 °C"]
[88524,"Uttenweiler","-14 °C"]
[54619,"Üttfeld","-14 °C"]
[86919,"Utting/Ammersee","-16 °C"]
[97292,"Üttingen","-12 °C"]
[79694,"Utzenfeld","-16 °C"]
[73577,"Utzstetten","-16 °C"]
[54579,"Üxheim","-14 °C"]
[90768,"Vach","-16 °C"]
[98617,"Vachdorf","-16 °C"]
[83620,"Vagen","-18 °C"]
[70563,"Vaihingen","-14 °C"]
[71665,"Vaihingen an der Enz","-14 °C"]
[33397,"Varensell","-12 °C"]
[76534,"Varnhalt","-14 °C"]
[49377,"Vechta","-12 °C"]
[38871,"Veckenstedt","-14 °C"]
[16866,"Vehlow","-14 °C"]
[90587,"Veitsbronn","-16 °C"]
[42549,"Velbert","-12 °C"]
[42553,"Velbert (Neviges)","-12 °C"]
[92355,"Velburg","-16 °C"]
[91235,"Velden","-16 °C"]
[84149,"Velden/Vils","-16 °C"]
[46342,"Velen","-10 °C"]
[34246,"Vellmar","-14 °C"]
[55578,"Vendersheim","-12 °C"]
[27283,"Verden","-12 °C"]
[72519,"Veringenstadt","-16 °C"]
[33415,"Verl","-12 °C"]
[33775,"Versmold","-12 °C"]
[3226,"Vetschau","-16 °C"]
[53560,"Vettelschoß","-12 °C"]
[52391,"Vettweiß","-12 °C"]
[94234,"Viechtach","-18 °C"]
[8149,"Vielau","-14 °C"]
[16835,"Vielitz","-14 °C"]
[38690,"Vienenburg","-14 °C"]
[2894,"Vierkirchen","-16 °C"]
[68519,"Viernheim","-12 °C"]
[17509,"Vierow","-12 °C"]
[16306,"Vierraden","-16 °C"]
["417xx","Viersen","-10 °C"]
[19230,"Viez","-12 °C"]
[86946,"Vilgertshofen","-16 °C"]
[86637,"Villenbach","-16 °C"]
["7805x","Villingen/Schwarzw.","-16 °C"]
[78667,"Villingendorf","-16 °C"]
[84149,"Vils","-16 °C"]
[84137,"Vilsbiburg","-16 °C"]
[92249,"Vilseck","-16 °C"]
[84186,"Vilsheim","-16 °C"]
[94474,"Vilshofen","-16 °C"]
[72514,"Vilsingen","-16 °C"]
[66957,"Vinningen","-12 °C"]
[32839,"Vinsebeck","-14 °C"]
[39599,"Vinzelberg","-14 °C"]
[56729,"Virneburg","-14 °C"]
[53909,"Virnich","-14 °C"]
[18565,"Vitte/Hiddensee","-10 °C"]
[32602,"Vlotho","-12 °C"]
[47506,"Vluyn","-10 °C"]
[6786,"Vockerode","-14 °C"]
[46562,"Voerde/Niederrhein","-10 °C"]
[37574,"Vogelbeck","-16 °C"]
[4880,"Vogelgesang","-16 °C"]
[99610,"Vogelsberg","-14 °C"]
[8209,"Vogelsgrün zw.Auerbach/Schönheide","-16 °C"]
[79379,"Vögisheim","-12 °C"]
[88267,"Vogt","-16 °C"]
[79235,"Vogtsburg","-12 °C"]
[85088,"Vohburg","-18 °C"]
[34516,"Vöhl","-14 °C"]
[72189,"Vöhringen","-16 °C"]
[89269,"Vöhringen","-16 °C"]
[72189,"Vöhringen-Wittershausen","-16 °C"]
[97332,"Völkach","-14 °C"]
[37124,"Volkerode","-14 °C"]
[37308,"Volkerode","-16 °C"]
[76316,"Völkersbach","-14 °C"]
[76857,"Völkersweiler","-12 °C"]
[78269,"Volkertshausen","-14 °C"]
[66333,"Völklingen","-12 °C"]
[6295,"Volkstedt","-14 °C"]
[72202,"Vollmaringen","-16 °C"]
[34253,"Vollmarshausen","-14 °C"]
[74736,"Vollmersdorf","-14 °C"]
[35625,"Vollnkirchen","-14 °C"]
[58300,"Volmastein","-12 °C"]
[39393,"Völpke","-14 °C"]
[41179,"Voosen","-10 °C"]
[18258,"Vorbeck","-12 °C"]
[49434,"Vörden","-12 °C"]
[25554,"Vorder Neuendorf","-10 °C"]
[57271,"Vormwald","-14 °C"]
[91247,"Vorra","-16 °C"]
[38440,"Vorsfelde","-14 °C"]
[47918,"Vorst","-10 °C"]
[79279,"Vörstetten","-12 °C"]
[37632,"Vorwohle","-14 °C"]
[48691,"Vreden","-10 °C"]
[37136,"Waake","-16 °C"]
[83666,"Waakirchen","-18 °C"]
[86875,"Waal","-16 °C"]
[34590,"Wabern","-14 °C"]
[1454,"Wachau","-14 °C"]
[53894,"Wachendorf","-14 °C"]
[72181,"Wachendorf","-16 °C"]
[67157,"Wachenheim","-12 °C"]
[53343,"Wachtberg","-14 °C"]
[47669,"Wachtendonk","-10 °C"]
[47669,"Wachterdonk","-10 °C"]
[63607,"Wächtersbach","-14 °C"]
[1306,"Wachwitz","-14 °C"]
[25596,"Wacken","-12 °C"]
[55263,"Wackernheim","-12 °C"]
[92442,"Wackersdorf","-16 °C"]
[66687,"Wadern","-12 °C"]
[59329,"Wadersloh","-12 °C"]
[66787,"Wadgassen","-12 °C"]
[66687,"Wadrill","-14 °C"]
[74838,"Wagenschwend","-14 °C"]
[79336,"Wagenstadt","-12 °C"]
[68753,"Waghäusel","-12 °C"]
[37194,"Wahlsburg","-12 °C"]
[4924,"Wahrenbrück","-16 °C"]
[23923,"Wahrsow","-10 °C"]
[18059,"Wahrstorf","-12 °C"]
["7133x","Waiblingen","-12 °C"]
[74915,"Waibstadt","-12 °C"]
[92726,"Waidhaus","-18 °C"]
[39356,"Walbeck","-14 °C"]
[53332,"Walberberg","-12 °C"]
[88639,"Walbertsweiler","-14 °C"]
[37235,"Walburg","-14 °C"]
[94501,"Walchsing","-16 °C"]
[53902,"Wald","-14 °C"]
[88639,"Wald","-14 °C"]
[93192,"Wald","-16 °C"]
[72178,"Waldachtal","-16 °C"]
[55425,"Waldalgesheim","-14 °C"]
[74889,"Waldangelloch","-12 °C"]
[74626,"Waldbach","-14 °C"]
[51545,"Waldbröl","-12 °C"]
[76337,"Waldbronn","-14 °C"]
[69429,"Waldbrunn","-14 °C"]
[88289,"Waldburg","-14 °C"]
[97297,"Waldbüttelbrunn","-14 °C"]
[72213,"Walddorf","-16 °C"]
[72141,"Walddorfhäslach","-16 °C"]
[34513,"Waldeck/Hessen","-14 °C"]
[65529,"Waldems","-14 °C"]
[71111,"Waldenbuch","-16 °C"]
[8396,"Waldenburg","-14 °C"]
[74638,"Waldenburg","-16 °C"]
[6844,"Waldersee","-14 °C"]
[52525,"Waldfeucht","-10 °C"]
[67714,"Waldfischbach","-12 °C"]
[35633,"Waldgirmes","-12 °C"]
[4736,"Waldheim","-14 °C"]
[69151,"Waldhilsbach","-12 °C"]
[37284,"Waldkappel","-14 °C"]
[79183,"Waldkirch","-14 °C"]
[8485,"Waldkirchen","-16 °C"]
[84478,"Waldkraiburg","-16 °C"]
[55444,"Waldlaubersheim","-12 °C"]
[69483,"Wald-Michelbach","-12 °C"]
[66914,"Waldmohr","-12 °C"]
[78713,"Waldmössingen","-16 °C"]
[74842,"Waldmühlbach","-14 °C"]
[53498,"Waldorf","-14 °C"]
[71522,"Waldrems","-14 °C"]
[75305,"Waldrennach","-14 °C"]
[8393,"Waldsachsen","-14 °C"]
[67165,"Waldsee","-12 °C"]
[79761,"Waldshut - Tiengen","-12 °C"]
[4821,"Waldsteinberg","-14 °C"]
[73550,"Waldstetten","-16 °C"]
[74931,"Waldwimmersbach","-12 °C"]
[74399,"Walheim","-12 °C"]
[64546,"Walldorf","-12 °C"]
[69190,"Walldorf","-12 °C"]
[74731,"Walldürn","-16 °C"]
[49134,"Wallenhorst","-12 °C"]
[94522,"Wallersdorf","-18 °C"]
[86757,"Wallerstein","-16 °C"]
[55578,"Wallertheim","-12 °C"]
[82499,"Wallgau","-18 °C"]
[66917,"Wallhalben","-12 °C"]
[65510,"Wallrabenstein","-14 °C"]
[6193,"Wallwitz","-14 °C"]
[88487,"Walpertshofen","-16 °C"]
[85469,"Walpertskirchen","-16 °C"]
[29664,"Walsrode","-12 °C"]
["4716x","Walsum","-10 °C"]
[2799,"Waltersdorf","-16 °C"]
[99880,"Waltershausen","-16 °C"]
["79xxx","Waltershofen","-12 °C"]
[45731,"Waltrop","-12 °C"]
[75045,"Walzbachtal","-12 °C"]
[65388,"Wambach","-14 °C"]
[17498,"Wampen","-12 °C"]
[56729,"Wanderath","-14 °C"]
[24997,"Wanderup","-10 °C"]
[37281,"Wanfried","-16 °C"]
[85368,"Wang","-16 °C"]
[37627,"Wangelstedt","-14 °C"]
[70327,"Wangen","-14 °C"]
[73117,"Wangen","-16 °C"]
[88239,"Wangen","-16 °C"]
[26486,"Wangerooge","-10 °C"]
[72127,"Wankheim","-16 °C"]
["4465x","Wanne-Eickel","-10 °C"]
[39638,"Wannefeld","-14 °C"]
[37627,"Wanngelnstedt","-14 °C"]
[72827,"Wannweil","-16 °C"]
[14641,"Wansdorf","-14 °C"]
[39164,"Wanzleben","-14 °C"]
[37640,"Warbsen","-12 °C"]
[26203,"Wardenburg","-12 °C"]
[17192,"Waren","-12 °C"]
[48231,"Warendorf","-12 °C"]
[19417,"Warin","-12 °C"]
[19288,"Warlow","-14 °C"]
[95485,"Warmensteinach","-18 °C"]
[18119,"Warnemünde","-10 °C"]
[83627,"Warngau","-18 °C"]
[19057,"Warnitz","-12 °C"]
[23948,"Warnkenhausen","-10 °C"]
[18249,"Warnow","-12 °C"]
[14662,"Warsow","-14 °C"]
[72213,"Wart","-16 °C"]
[85456,"Wartenberg","-16 °C"]
[88447,"Warthausen","-16 °C"]
[97797,"Wartmannsroth","-14 °C"]
[31061,"Warzen","-14 °C"]
[73116,"Wäschenbeuren","-16 °C"]
[56370,"Wasenbach","-14 °C"]
[79241,"Wasenweiler","-12 °C"]
[56653,"Wassenach","-14 °C"]
[41849,"Wassenberg","-10 °C"]
[73433,"Wasseralfingen","-16 °C"]
[41849,"Wasserberg","-10 °C"]
["L-6618","Wasserbillig (Luxemburg)","-12 °C"]
[83512,"Wasserburg am Inn","-16 °C"]
[null,"Wasserkuppe","-16 °C"]
[54332,"Wasserliesch","-12 °C"]
[91717,"Wassertrüdingen","-16 °C"]
[96196,"Wattendorf","-16 °C"]
["4478x","Wattenscheid","-10 °C"]
[35415,"Watzenborn-Steinberg","-14 °C"]
[66424,"Websweiler","-12 °C"]
["Frankrx","Wecholsheim","-12 °C"]
[22880,"Wedel/Holstein","-10 °C"]
[30900,"Wedemark","-14 °C"]
[23795,"Weede-Söhren","-10 °C"]
[47652,"Weeze","-10 °C"]
[41844,"Wegberg","-10 °C"]
[38828,"Wegeleben","-14 °C"]
[15345,"Wegendorf","-14 °C"]
[78564,"Wehingen","-18 °C"]
[37339,"Wehnde","-16 °C"]
[52538,"Wehr","-10 °C"]
[79664,"Wehr","-12 °C"]
[49152,"Wehrendorf","-12 °C"]
[61273,"Wehrheim","-14 °C"]
[91798,"Weiboldshausen","-16 °C"]
[9775,"Weicherdange/Luxembourg","-14 °C"]
[85258,"Weichs","-16 °C"]
[85258,"Weichs-Aufhausen","-16 °C"]
[7570,"Weida","-14 °C"]
[89134,"Weidach","-16 °C"]
[91550,"Weidelsbach","-16 °C"]
[92637,"Weiden","-16 °C"]
[54570,"Weidenbach","-14 °C"]
[91746,"Weidenbach","-16 °C"]
[4860,"Weidenhain","-16 °C"]
[77654,"Weierbach","-12 °C"]
[91249,"Weigendorf","-16 °C"]
[78056,"Weigheim","-18 °C"]
[2733,"Weigsdorf-Köblitz","-16 °C"]
[91629,"Weihenzell","-16 °C"]
[90513,"Weiherhof","-16 °C"]
[84107,"Weihmichl","-16 °C"]
[88477,"Weihungszell","-16 °C"]
[97990,"Weikersheim","-16 °C"]
[78250,"Weil","-16 °C"]
[79576,"Weil","-12 °C"]
[79576,"Weil am Rhein","-12 °C"]
[71263,"Weil der Stadt","-16 °C"]
[71093,"Weil im Schönbuch","-16 °C"]
[35781,"Weilburg","-12 °C"]
[72367,"Weilen unter den Rinnen","-18 °C"]
[72108,"Weiler","-16 °C"]
[73492,"Weiler","-16 °C"]
[74889,"Weiler","-12 °C"]
[73529,"Weiler in den Bergen","-16 °C"]
[71397,"Weiler zum Stein","-14 °C"]
[91365,"Weilersbach","-16 °C"]
[53919,"Weilerswist","-12 °C"]
[72379,"Weilheim","-16 °C"]
[82362,"Weilheim","-16 °C"]
[73235,"Weilheim a.d.Teck","-16 °C"]
[35789,"Weilmünster","-14 °C"]
[72336,"Weilstetten","-18 °C"]
[34292,"Weimar","-14 °C"]
[35096,"Weimar","-12 °C"]
["9942x","Weimar","-14 °C"]
[1689,"Weinböhla","-14 °C"]
[76356,"Weingarten","-12 °C"]
[88250,"Weingarten","-14 °C"]
[99869,"Weingarten","-14 °C"]
[91358,"Weingarts","-16 °C"]
[88214,"Weingartshof","-14 °C"]
[69469,"Weinheim/Bergstraße","-10 °C"]
[90518,"Weinhof","-16 °C"]
[74189,"Weinsberg","-14 °C"]
[71384,"Weinstadt","-14 °C"]
[8538,"Weischlitz","-16 °C"]
[75175,"Weisen","-12 °C"]
[76599,"Weisenbach","-14 °C"]
[91085,"Weisendorf","-16 °C"]
[67273,"Weisenheim","-12 °C"]
[66709,"Weiskirchen","-12 °C"]
[71287,"Weissach","-14 °C"]
[71554,"Weissach im Tal","-14 °C"]
[71554,"Weissach im Tal","-14 °C"]
[1920,"Weißbach","-16 °C"]
[1936,"Weißbach","-16 °C"]
[9439,"Weißbach","-14 °C"]
[95237,"Weißdorf","-18 °C"]
[2627,"Weissenberg","-16 °C"]
[9600,"Weißenborn","-16 °C"]
[91560,"Weissenbronn","-16 °C"]
[91227,"Weißenbrunn","-16 °C"]
[91781,"Weissenburg in Bayern","-16 °C"]
[6667,"Weißenfels","-14 °C"]
[89264,"Weissenhorn","-16 °C"]
[89264,"Weißenhorn","-16 °C"]
[93444,"Weißenregen","-18 °C"]
[2999,"Weißkollm","-16 °C"]
[2628,"Weissnaußlitz","-16 °C"]
[2943,"Weißwasser","-16 °C"]
[79367,"Weisweil","-12 °C"]
[23968,"Weitendorf","-10 °C"]
[23999,"Weitendorf  ( Insel Poel )","-10 °C"]
[78247,"Weiterdingen","-14 °C"]
[1909,"Weitersdorf","-16 °C"]
[64331,"Weiterstadt","-12 °C"]
[17033,"Weitin","-14 °C"]
[72184,"Weitingen","-16 °C"]
[87480,"Weitnau","-16 °C"]
[96479,"Weitramsdorf","-16 °C"]
[1108,"Weixdorf","-14 °C"]
[79780,"Weizen","-14 °C"]
[6333,"Welbsleben","-14 °C"]
[86465,"Welden","-16 °C"]
[21261,"Welle","-12 °C"]
[78669,"Wellendingen","-18 °C"]
[4758,"Wellerswalde","-14 °C"]
[56729,"Welschenbach","-14 °C"]
[77790,"Welschensteinach","-14 °C"]
[56412,"Welschneudorf","-14 °C"]
[75365,"Weltenschwann","-16 °C"]
[59514,"Welver","-12 °C"]
[1561,"Welxande","-16 °C"]
[73642,"Welzheim","-16 °C"]
[38176,"Wendeburg","-14 °C"]
[99988,"Wendehausen","-16 °C"]
[55234,"Wendelsheim","-12 °C"]
[72108,"Wendelsheim","-16 °C"]
[90530,"Wendelstein/Mittelfr.","-16 °C"]
[57482,"Wenden","-14 °C"]
[1683,"Wendischbora","-14 °C"]
[4746,"Wendishain","-14 °C"]
[73240,"Wendlingen","-14 °C"]
[38448,"Wendschott","-14 °C"]
[84187,"Weng","-18 °C"]
[94086,"Weng","-16 °C"]
[54516,"Wengerohr","-14 °C"]
[88416,"Wennedach","-16 °C"]
[30974,"Wennigsen","-14 °C"]
[93173,"Wenzenbach","-18 °C"]
[21279,"Wenzendorf","-12 °C"]
[4460,"Werben","-14 °C"]
[39615,"Werben","-14 °C"]
[2956,"Werda","-16 °C"]
[8233,"Werda","-16 °C"]
[8412,"Werdau","-16 °C"]
[14542,"Werder/Havel","-14 °C"]
[58791,"Werdohl","-12 °C"]
[59457,"Werl","-12 °C"]
[49757,"Werlte","-12 °C"]
[42929,"Wermelskirchen","-12 °C"]
[4779,"Wermsdorf","-14 °C"]
[92533,"Wernberg-Köblitz","-16 °C"]
[59368,"Werne a.d. Lippe","-12 °C"]
[16356,"Werneuchen","-14 °C"]
[91174,"Wernfels","-16 °C"]
[38855,"Wernigerode","-16 °C"]
[9509,"Wernsdorf bei Marienberg","-14 °C"]
[56414,"Weroth","-14 °C"]
[57614,"Weroth","-14 °C"]
[64395,"Wersau","-14 °C"]
[53520,"Wershofen","-14 °C"]
[40591,"Werste","-10 °C"]
[97877,"Wertheim","-14 °C"]
[33824,"Werther","-12 °C"]
[86637,"Wertingen","-16 °C"]
[46325,"Weseke","-10 °C"]
[46483,"Wesel","-10 °C"]
[46485,"Wesel","-10 °C"]
[19288,"Weselsdorf","-14 °C"]
[39249,"Wespen","-14 °C"]
[50389,"Wesseling/Rheinl.","-10 °C"]
[72406,"Wessingen","-18 °C"]
[82234,"Weßling","-16 °C"]
[4889,"Weßnig","-16 °C"]
[48291,"Westbevern","-12 °C"]
[6449,"Westdorf","-14 °C"]
[39448,"Westenegeln","-14 °C"]
[59199,"Westerbönen","-12 °C"]
[56457,"Westerburg","-14 °C"]
[32130,"Westerenger","-12 °C"]
[21394,"Westergellersen","-12 °C"]
[83620,"Westerham","-18 °C"]
[49324,"Westerhausen","-12 °C"]
[72589,"Westerheim","-18 °C"]
[37589,"Westerhof","-16 °C"]
[73463,"Westerhofen","-16 °C"]
[24977,"Westerholz","-10 °C"]
[89198,"Westerstetten","-16 °C"]
[73463,"Westhausen","-16 °C"]
[91747,"Westheim","-16 °C"]
[97478,"Westheim","-16 °C"]
[67593,"Westhofen","-12 °C"]
[26810,"Westoverledingen","-10 °C"]
[91757,"Wettelsheim","-16 °C"]
[35435,"Wettenberg-Launsbach","-14 °C"]
[58300,"Wetter","-12 °C"]
[6722,"Wetterzeube","-14 °C"]
[85139,"Wettstetten","-16 °C"]
[93444,"Wettzell","-18 °C"]
["3557x","Wetzlar","-12 °C"]
[35583,"Wetzlar - Garbenheim","-12 °C"]
[33106,"Wewer","-12 °C"]
[83629,"Weyarn","-18 °C"]
[56357,"Weyer","-12 °C"]
[28844,"Weyhe","-12 °C"]
[89079,"Wiblingen","-14 °C"]
[58769,"Wiblingwerde","-12 °C"]
[19055,"Wickendorf","-12 °C"]
[65439,"Wicker","-12 °C"]
[41189,"Wickrathberg","-10 °C"]
[52156,"Widdau","-14 °C"]
[74259,"Widdern","-14 °C"]
[79650,"Wiechs","-12 °C"]
[53577,"Wied","-14 °C"]
[87534,"Wiedemannsdorf","-18 °C"]
[33378,"Wiedenbrück","-12 °C"]
[85259,"Wiedenzhausen","-16 °C"]
[4938,"Wiederau","-16 °C"]
[4158,"Wiederitzsch","-14 °C"]
[2994,"Wiednitz","-16 °C"]
[26215,"Wiefelstede","-12 °C"]
[6571,"Wiehe","-14 °C"]
[51674,"Wiehl","-12 °C"]
[18556,"Wiek auf Rügen","-10 °C"]
[74523,"Wielandsweiler","-16 °C"]
[82407,"Wielenbach","-16 °C"]
[59939,"Wiemeringhausen","-14 °C"]
[29342,"Wienhausen","-14 °C"]
[75446,"Wiernsheim","-14 °C"]
[95676,"Wiesau","-18 °C"]
[65183,"Wiesbaden","-10 °C"]
[69257,"Wiesenbach","-12 °C"]
[74572,"Wiesenbach","-16 °C"]
[86519,"Wiesenbach","-16 °C"]
[97355,"Wiesenbronn","-16 °C"]
[65599,"Wiesenroth","-14 °C"]
[73349,"Wiesensteig","-18 °C"]
[93109,"Wiesent","-18 °C"]
[68753,"Wiesental","-12 °C"]
[91346,"Wiesenttal","-16 °C"]
[69168,"Wiesloch","-12 °C"]
[49835,"Wietmarschen","-10 °C"]
[29323,"Wietze","-12 °C"]
[29649,"Wietzendorf","-14 °C"]
[73732,"Wiflingshausen","-14 °C"]
[91634,"Wilburgstetten","-16 °C"]
[15745,"Wildau","-14 °C"]
[8301,"Wildbach","-16 °C"]
[75323,"Wildbad im Schwarzwald","-14 °C"]
[17091,"Wildberg","-14 °C"]
[72218,"Wildberg","-16 °C"]
[8237,"Wildenau","-16 °C"]
[8134,"Wildenfels","-14 °C"]
[4539,"Wildenhain","-14 °C"]
[41844,"Wildenrath","-10 °C"]
[27793,"Wildeshausen","-12 °C"]
[7980,"Wildetaube","-16 °C"]
[4924,"Wildgrube","-16 °C"]
[87499,"Wildpoldsreid","-16 °C"]
[65719,"Wildsachsen","-14 °C"]
[4838,"Wildschütz","-14 °C"]
[75196,"Wilferdingen","-14 °C"]
[88515,"Wilfingen","-14 °C"]
[57234,"Wilgersdorf","-14 °C"]
[88271,"Wilhelmsdorf","-14 °C"]
[69259,"Wilhelmsfeld","-12 °C"]
[26389,"Wilhelmshaven","-10 °C"]
[17291,"Wilhelmshayn","-14 °C"]
[14557,"Wilhelmshorst","-14 °C"]
[88263,"Wilhelmskirch","-14 °C"]
[91452,"Wilhermsdorf","-16 °C"]
[8112,"Wilkau-Haßlau","-14 °C"]
[34439,"Willebadessen","-14 °C"]
[47877,"Willich    ","-10 °C"]
[47877,"Willich - Wekeln","-10 °C"]
[34508,"Willingen/Upland","-14 °C"]
[72820,"Willmandingen","-18 °C"]
[97647,"Willmars","-16 °C"]
[93497,"Willmering","-18 °C"]
[3053,"Willmersdorf","-16 °C"]
[86574,"Willprechtszell","-16 °C"]
[74182,"Willsbach","-14 °C"]
[77731,"Willstätt","-12 °C"]
[3053,"Wilmersdorf","-16 °C"]
[57234,"Wilnsdorf","-14 °C"]
[1833,"Wilschdorf","-14 °C"]
[1723,"Wilsdruff","-14 °C"]
[72818,"Wilsingen","-16 °C"]
[6449,"Wilsleben","-14 °C"]
[27412,"Wilstedt","-12 °C"]
[54459,"Wiltingen","-12 °C"]
[75365,"Wimberg","-14 °C"]
[71299,"Wimsheim","-14 °C"]
[54457,"Wincheringen","-12 °C"]
[86949,"Windach","-16 °C"]
[51570,"Windeck","-12 °C"]
[61276,"Winden","-14 °C"]
[79297,"Winden i. E.","-16 °C"]
[37539,"Windhausen","-16 °C"]
[92670,"Windischeschenbach","-16 °C"]
[99102,"Windischholzhausen","-14 °C"]
[4603,"Windischleuba","-14 °C"]
[91575,"Windsbach","-16 °C"]
[77652,"Windschläg","-12 °C"]
[65232,"Wingsbach","-14 °C"]
[21789,"Wingst","-10 °C"]
[57664,"Winkelbach","-14 °C"]
[71364,"Winnenden","-14 °C"]
[56333,"Winningen","-12 °C"]
[30890,"Winninghausen","-14 °C"]
[67722,"Winnweiler","-12 °C"]
[29308,"Winsen","-12 °C"]
[21423,"Winsen (Luhe)","-12 °C"]
[73650,"Winterbach","-16 °C"]
[59955,"Winterberg","-16 °C"]
[72474,"Winterlingen","-16 °C"]
[88400,"Winterreute","-16 °C"]
[54310,"Wintersdorf","-12 °C"]
[88299,"Winterstetten","-16 °C"]
[88456,"Winterstettendorf","-16 °C"]
[88456,"Winterstettenstadt","-16 °C"]
[31088,"Winzenburg","-16 °C"]
[73072,"Winzingen","-16 °C"]
[97537,"Wipfeld","-14 °C"]
[85414,"Wippenhausen","-16 °C"]
[51688,"Wipperfürth","-12 °C"]
[89134,"Wippingen","-14 °C"]
[56422,"Wirges","-14 °C"]
[39596,"Wischer","-14 °C"]
[6647,"Wischroda","-14 °C"]
[23966,"Wismar","-10 °C"]
[31061,"Wispenstein","-16 °C"]
[73550,"Wißgoldingen","-16 °C"]
[53879,"Wißkirchen","-14 °C"]
[77960,"Wittelbach","-14 °C"]
[58454,"Witten","-12 °C"]
[6886,"Wittenberg","-14 °C"]
[16515,"Wittenberg","-14 °C"]
[19322,"Wittenberge","-14 °C"]
[19243,"Wittenburg","-12 °C"]
[19243,"Wittendörp","-12 °C"]
[19073,"Wittenförden","-12 °C"]
[88693,"Wittenhofen","-14 °C"]
[77963,"Wittenweier","-12 °C"]
[99189,"Witterda","-14 °C"]
[66399,"Wittersheim","-12 °C"]
[7768,"Wittersroda","-14 °C"]
[9228,"Wittgensdorf","-14 °C"]
[2997,"Wittichenau","-16 °C"]
[29378,"Wittingen","-14 °C"]
[89426,"Wittislingen","-16 °C"]
[40489,"Wittlaer","-10 °C"]
[72250,"Wittlensweiler","-16 °C"]
[79599,"Wittlingen","-12 °C"]
[72574,"Wittlingen  ( Bad Urach )","-16 °C"]
[26409,"Wittmund","-10 °C"]
[16909,"Wittstock","-14 °C"]
["3721x","Witzenhausen","-14 °C"]
[37213,"Witzenhausen / Unterrieden ","-14 °C"]
[42799,"Witzhelden","-10 °C"]
[94104,"Witzmannsberg","-16 °C"]
[32816,"Wöbbel","-14 °C"]
[52152,"Woffelsbach","-14 °C"]
[4874,"Wohlau","-16 °C"]
[48167,"Wolbeck","-12 °C"]
[17091,"Wolde","-14 °C"]
[77709,"Wolfach","-14 °C"]
[76227,"Wolfartsweier","-12 °C"]
[88364,"Wolfegg","-16 °C"]
[6766,"Wolfen","-14 °C"]
["3830x","Wolfenbüttel","-14 °C"]
[35789,"Wolfenhausen","-14 °C"]
[72149,"Wolfenhausen","-16 °C"]
[63654,"Wolferborn","-14 °C"]
[78166,"Wolferdingen","-18 °C"]
[6295,"Wolferode","-14 °C"]
[35260,"Wolferode","-14 °C"]
[36266,"Wölfershausen","-14 °C"]
[61200,"Wölfersheim","-14 °C"]
[53940,"Wolfert     Unterw./Oberw.","-14 °C"]
[53937,"Wolfgarten","-14 °C"]
[91639,"Wolframs - Eschenbach","-16 °C"]
[82515,"Wolfratshausen","-16 °C"]
[92269,"Wolfring","-16 °C"]
["3844x","Wolfsburg","-14 °C"]
[99819,"Wolfsburg-Unkeroda","-16 °C"]
[72649,"Wolfschlugen","-14 °C"]
[93195,"Wolfsegg","-16 °C"]
[3130,"Wolfshain","-16 °C"]
[64560,"Wolfskehlen","-12 °C"]
[37290,"Wolfterode","-14 °C"]
[17438,"Wolgast","-12 °C"]
[91126,"Wolkersdorf","-16 °C"]
[84166,"Wollkofen","-16 °C"]
[4720,"Wollsdorf","-14 °C"]
[55597,"Wöllstein","-12 °C"]
[39326,"Wolmirstedt","-14 °C"]
[16259,"Wölsickendorf","-14 °C"]
[4519,"Wolteritz","-14 °C"]
[31099,"Woltershausen","-16 °C"]
[97539,"Wonfurt","-14 °C"]
[55599,"Wonsheim","-12 °C"]
[37339,"Worbis","-16 °C"]
[4880,"Wörblitz","-16 °C"]
[87789,"Woringen","-16 °C"]
[6786,"Wörlitz","-14 °C"]
[57392,"Wormbach","-14 °C"]
[53359,"Wormersdorf","-14 °C"]
[1994,"Wormlage","-16 °C"]
[3205,"Wormlage","-16 °C"]
["6755x","Worms","-12 °C"]
[55286,"Wörrstadt","-12 °C"]
[73499,"Wört","-16 °C"]
[76744,"Wörth","-12 °C"]
[85457,"Wörth","-16 °C"]
[93086,"Wörth a.d. Donau","-18 °C"]
[84109,"Wörth an der Isar","-16 °C"]
[82237,"Wörthsee","-16 °C"]
[76327,"Wöschbach","-12 °C"]
[31079,"Wrisbergholzen","-14 °C"]
[46286,"Wulfen","-10 °C"]
[32545,"Wulferdingen","-12 °C"]
[31008,"Wülfingen","-14 °C"]
[31832,"Wülfinghausen","-14 °C"]
[42489,"Wülfrath","-12 °C"]
[27628,"Wulsbüttel","-12 °C"]
[98704,"Wümbach","-16 °C"]
[9514,"Wünschendorf","-14 °C"]
[31515,"Wunstorf-Luthe","-14 °C"]
["4211x","Wuppertal","-12 °C"]
[42283,"Wuppertal - Barmen","-12 °C"]
[42111,"Wuppertal - Elberfeld","-12 °C"]
[42329,"Wuppertal - Vohwinkel","-12 °C"]
[52511,"Würm","-12 °C"]
[75181,"Würm","-14 °C"]
[75449,"Wurmberg","-14 °C"]
[76448,"Würmersheim","-12 °C"]
[72108,"Wurmlingen","-16 °C"]
[78573,"Wurmlingen","-16 °C"]
[1561,"Würschnitz","-16 °C"]
[52146,"Würselen","-12 °C"]
[82813,"Würtingen","-18 °C"]
[75394,"Würzbach","-16 °C"]
["9707x","Würzburg","-12 °C"]
[4808,"Wurzen","-14 °C"]
[39524,"Wust","-14 °C"]
[32108,"Wüsten","-12 °C"]
[9358,"Wüstenbrand","-14 °C"]
[73527,"Wustenriet","-16 °C"]
[71543,"Wüstenrot","-16 °C"]
[16868,"Wusterhausen","-14 °C"]
[17509,"Wusterhusen","-12 °C"]
[16818,"Wustrau","-14 °C"]
[29462,"Wustrow","-14 °C"]
[4749,"Wutzschwitz","-14 °C"]
[79369,"Wyhl","-12 °C"]
[4552,"Wyhra","-14 °C"]
[47559,"Wyler","-10 °C"]
[46509,"Xanten","-10 °C"]
[39307,"Zabakuck","-14 °C"]
[1561,"Zabeltitz","-16 °C"]
[74374,"Zaberfeld","-14 °C"]
[94239,"Zachenberg","-18 °C"]
[86573,"Zahling","-16 °C"]
[6895,"Zahna","-14 °C"]
[75378,"Zainen","-16 °C"]
[72587,"Zainingen","-18 °C"]
[89551,"Zang","-16 °C"]
[18195,"Zarnewanz","-12 °C"]
[19246,"Zarrentin","-12 °C"]
[39606,"Zedau","-14 °C"]
[7557,"Zedlitz","-14 °C"]
[4552,"Zedtlitz","-14 °C"]
[16792,"Zehdenick","-14 °C"]
[97475,"Zeil am Main","-14 °C"]
[67378,"Zeiskam","-12 °C"]
[1619,"Zeithain","-16 °C"]
[6712,"Zeitz","-14 °C"]
[73104,"Zell","-16 °C"]
[77736,"Zell","-14 °C"]
[95239,"Zell","-18 °C"]
[56856,"Zell - Barl","-12 °C"]
[77736,"Zell a.H.","-14 °C"]
[97299,"Zell am Main","-14 °C"]
[79669,"Zell i.W.","-14 °C"]
[73119,"Zell u. Aichelberg","-16 °C"]
[67308,"Zellertal","-12 °C"]
[77654,"Zell-Weierbach","-12 °C"]
[17459,"Zempin","-12 °C"]
[16341,"Zepernick","-14 °C"]
[39317,"Zerben","-14 °C"]
[39261,"Zerbst","-14 °C"]
[1920,"Zerna","-16 °C"]
[29499,"Zernien","-14 °C"]
[16845,"Zernitz","-14 °C"]
[15758,"Zernsdorf","-14 °C"]
[16348,"Zerpenschleuse","-14 °C"]
[2699,"Zescha","-16 °C"]
[26340,"Zetel","-10 °C"]
[9306,"Zetteritz","-14 °C"]
[93485,"Zettisch","-18 °C"]
[4758,"Zeuckritz","-16 °C"]
[7937,"Zeulenroda","-16 °C"]
[76698,"Zeutern","-12 °C"]
[15738,"Zeuthen","-14 °C"]
[19069,"Zickhusen","-12 °C"]
[7980,"Zickra","-14 °C"]
[6842,"Ziebigk","-14 °C"]
[34613,"Ziegenhain","-14 °C"]
[4720,"Ziegra","-14 °C"]
[17440,"Ziemitz","-14 °C"]
[79395,"Zienken","-12 °C"]
[23968,"Zierow","-10 °C"]
[89446,"Ziertheim","-16 °C"]
[14793,"Ziesar","-14 °C"]
[18059,"Ziesendorf","-12 °C"]
[72336,"Zillhausen","-18 °C"]
[88484,"Zillishausen","-16 °C"]
[54578,"Zilsdorf","-14 °C"]
[72406,"Zimmern","-18 °C"]
[78658,"Zimmern","-16 °C"]
[97828,"Zimmern","-14 °C"]
[72369,"Zimmern u.d.B.","-16 °C"]
[2906,"Zimpel","-16 °C"]
[18374,"Zingst Ostseebad","-10 °C"]
[15345,"Zinndorf","-14 °C"]
[17454,"Zinnowitz","-12 °C"]
[1773,"Zinnwald","-16 °C"]
[19063,"Zippendorf","-12 °C"]
[17419,"Zirchow","-12 °C"]
[86609,"Zirgesheim","-16 °C"]
[90513,"Zirndorf","-16 °C"]
[2763,"Zittau","-16 °C"]
[79379,"Zizingen","-12 °C"]
[4416,"Zöbigker","-16 °C"]
[73485,"Zöbingen","-16 °C"]
[9517,"Zöblitz","-16 °C"]
[2829,"Zodel","-16 °C"]
[78052,"Zollhaus","-18 °C"]
[85406,"Zolling","-16 °C"]
[15926,"Zöllmersdorf","-16 °C"]
[4703,"Zollschwitz","-14 °C"]
[6780,"Zörbig","-14 °C"]
[85604,"Zorneding","-16 °C"]
[89447,"Zöschingen","-16 °C"]
[89426,"Zöschlingsweiler","-16 °C"]
[15806,"Zossen","-14 °C"]
[4720,"Zschaitz","-14 °C"]
[4603,"Zschechwitz","-14 °C"]
[4720,"Zschepplitz","-14 °C"]
[4749,"Zschochau","-14 °C"]
[4703,"Zschockau","-14 °C"]
[9405,"Zschopau","-14 °C"]
[8321,"Zschorlau","-16 °C"]
[1920,"Zschornau","-16 °C"]
[4509,"Zschortau","-14 °C"]
[39240,"Zuchau","-14 °C"]
[85051,"Zuchering","-18 °C"]
[70435,"Zuffenhausen","-12 °C"]
[16515,"Zühlsdorf","-14 °C"]
[53909,"Zülpich ","-14 °C"]
["7765x","Zunsweier (Offenburg)","-12 °C"]
[79379,"Zunzingen","-14 °C"]
[86441,"Zusmarshausen","-16 °C"]
[17495,"Züssow","-12 °C"]
[85465,"Zustorf","-16 °C"]
[74219,"Züttlingen","-12 °C"]
[16306,"Zützen","-16 °C"]
[74939,"Zuzenhausen","-12 °C"]
[4451,"Zweefurth","-14 °C"]
[66482,"Zweibrücken","-12 °C"]
[74639,"Zweiflingen","-14 °C"]
[4442,"Zwenkau","-14 °C"]
[75389,"Zwerenberg","-16 °C"]
["0805x","Zwickau","-14 °C"]
[88529,"Zwiefalten","-14 °C"]
[94227,"Zwiesel","-18 °C"]
[69439,"Zwingenberg","-12 °C"]
[8297,"Zwönitz","-16 °C"]
[47559,"Zyfflich","-10 °C"]

{"sheet":"Vorlauftemperatur","index":5,"n_rows":60,"n_cols":18,"rows_kept":60,"cut":false,"hidden":true,"merged":[[4,2,4,3]]}
[]
[null,{"$f":"Translation!A91","v":"Vorlauftemperatur"}]
[]
[]
[null,null,{"$f":"Translation!A5","v":"Eingabewerte"}]
[]
[null,null,{"$f":"Translation!A92","v":"Raumsolltemperatur in °C"}]
[]
[null,null,{"$f":"Translation!A93","v":"Steigung Heizkurve"}]
[]
[null,null,{"$f":"Translation!A94","v":"Bivalenzpunkt (Gewählt)"}]
[]
[null,null,{"$f":"Translation!A95","v":"Temperaturspreizung (Gewählt)"}]
[]
[null,null,{"$f":"Translation!A96","v":"Rücklauftemperatur (Bivalenzpunkt)"}]
[]
[null,null,{"$f":"Translation!A97","v":"Vorlauftemperatur (Bivalenzpunkt)"}]
[]
[]
[]
[]
[]
[]
[null,null,null,null,null,null,null,"Comboboxen","Zahlenwert","Comboboxen","Zahlenwert","Auswahl","Zahlenwert","RL-Bivalenz","Auswahl","Zahlenwert","VL-Bivalenz","VL-Bivalenz"]
[null,null,null,null,null,null,null,"Raumsoll","Raumsoll","Steigung","Steigung","Bivalenzpunkt","Bivalenzpunkt","berechnet","Spreizung","Spreizung","berechnet","gerundet"]
[null,null,null,null,null,null,null,"15 °C",{"$f":"VLOOKUP(H26,H27:I43,2,FALSE)","v":15},"Standard FB-Heizung (0,3)",{"$f":"VLOOKUP(J26,J27:K48,2,FALSE)","v":0.3},{"$f":"Berechnung!I6","v":"-5 °C"},{"$f":"VLOOKUP(L26,L27:M48,2,FALSE)","v":-5},{"$f":"(I$26-M26)*$K$26*90/($I$26-M26+70)+$I$26","v":21},{"$f":"Berechnung!K6","v":"7 K"},{"$f":"VLOOKUP(O26,O27:P48,2,FALSE)","v":7},{"$f":"(($I$26-M26)*$K$26*90/($I$26-M26+70)+$I$26)+(-$P$26/40*M26+$P$26/2)","v":25.375},{"$f":"ROUND(Q26,0)","v":25}]
[null,null,null,null,null,null,null,{"$f":"Translation!A98&\" (20°C)\"","v":"Standardwert (20°C)"},20,{"$f":"Translation!A99","v":"Standard FB-Heizung (0,3)"},0.3,"-10 °C",-10,{"$f":"ROUND(N26,1)&\" °C\"","v":"21 °C"},"3 K",3,{"$f":"ROUND(Q26,1)&\" °C\"","v":"25,4 °C"},{"$f":"R26&\" °C\"","v":"25 °C"}]
[null,null,null,null,null,null,null,"15 °C",15,{"$f":"Translation!A100","v":"Standard Radiatoren (0,8)"},0.8,"-9 °C",-9,null,"4 K",4]
[null,null,null,null,null,null,null,"16 °C",16,"0,1",0.1,"-8 °C",-8,null,"5 K",5]
[null,null,null,null,null,null,null,"17 °C",17,"0,2",0.2,"-7 °C",-7,null,"6 K",6]
[null,null,null,null,null,null,null,"18 °C",18,"0,3",0.3,"-6 °C",-6,null,"7 K",7]
[null,null,null,null,null,null,null,"19 °C",19,"0,4",0.4,"-5 °C",-5,null,"8 K",8]
[null,null,null,null,null,null,null,"20 °C",20,"0,5",0.5,"-4 °C",-4,null,"9 K",9]
[null,null,null,null,null,null,null,"21 °C",21,"0,6",0.6,"-3 °C",-3,null,"10 K",10]
[null,null,null,null,null,null,null,"22 °C",22,"0,7",0.7,"-2 °C",-2]
[null,null,null,null,null,null,null,"23 °C",23,"0,8",0.8,"-1 °C",-1]
[null,null,null,null,null,null,null,"24 °C",24,"0,9",0.9,"  0 °C",0]
[null,null,{"$f":"Translation!A101&\" \"&O26&\")\"","v":"Heizkurve Vorlauf (Spreizung bei -20°C: 7 K)"},null,null,null,null,"25 °C",25,"1,0",1,"  1 °C",1]
[null,null,{"$f":"Translation!A102&\" \"&I26&\" °C | \"&Translation!A103&\": \"&K26&\")\"","v":"Heizkurve Rücklauf (Raumtemperatur: 15 °C | Steigung: 0,3)"},null,null,null,null,"26 °C",26,"1,1",1.1000000000000001,"  2 °C",2]
[null,null,null,null,null,null,null,"27 °C",27,"1,2",1.2,"  3 °C",3]
[null,null,null,null,null,null,null,"28 °C",28,"1,3",1.3,"  4 °C",4]
[null,null,null,null,null,null,null,"29 °C",29,"1,4",1.4,"  5 °C",5]
[null,null,null,null,null,null,null,"30 °C",30,"1,5",1.5]
[null,null,null,null,null,null,null,null,null,"1,6",1.6]
[null,null,null,null,null,null,null,null,null,"1,7",1.7]
[null,null,null,null,null,null,null,null,null,"1,8",1.8]
[null,null,null,null,null,null,null,null,null,"1,9",1.9]
[null,null,null,null,null,null,null,null,null,"2,0",2]
[]
[null,null,null,null,null,null,null,"Rücklauftemperaturkurve",null,null,null,"Bivalenzpunkt"]
[null,null,null,null,null,null,null,"Außentemp.","Rücklauftemp.","Vorlauftemp.",null,"Linie","X1","X2","Y1","Y2"]
[null,null,null,null,null,null,null,-20,{"$f":"($I$26-H52)*$K$26*90/($I$26-H52+70)+$I$26","v":24},{"$f":"(($I$26-H52)*$K$26*90/($I$26-H52+70)+$I$26)+(-$P$26/40*H52+$P$26/2)","v":31},null,"Horizontal",-20,{"$f":"M26","v":-5},{"$f":"Q26","v":25.375},{"$f":"Q26","v":25.375}]
[null,null,null,null,null,null,null,-15,{"$f":"($I$26-H53)*$K$26*90/($I$26-H53+70)+$I$26","v":23.1},{"$f":"(($I$26-H53)*$K$26*90/($I$26-H53+70)+$I$26)+(-$P$26/40*H53+$P$26/2)","v":29.225000000000001},null,"Vertikal",{"$f":"M26","v":-5},{"$f":"M26","v":-5},10,{"$f":"Q26","v":25.375}]
[null,null,null,null,null,null,null,-10,22.105263157894736,27.355263157894736]
[null,null,null,null,null,null,null,-5,21,25.375]
[null,null,null,null,null,null,null,0,19.764705882352942,23.264705882352942]
[null,null,null,null,null,null,null,5,18.375,21]
[null,null,null,null,null,null,null,10,16.8,18.55]
[null,null,null,null,null,null,null,15,15,15.875]
[null,null,null,null,null,null,null,20,12.923076923076923,12.923076923076923]

{"sheet":"Translation","index":6,"n_rows":551,"n_cols":6,"rows_kept":551,"cut":false,"hidden":true,"merged":[]}
[]
["Deutsch","Deutsch","English","Nederlands","Francais","Suomi"]
["Jahresarbeitszahl","Jahresarbeitszahl","Yearly COP","Jaar COP.","COP annuel","Vuotuinen COP"]
["VDI 4650 | TEIL 1","VDI 4650 | TEIL 1","VDI 4650 | PART 1","VDI 4650 | DEEL 1","VDI 4650 | PARTIE 1","VDI 4650 | OSA 1"]
["Eingabewerte","Eingabewerte","Input values","Ingevoerde waarden","valeurs d'entrée","Syötetyt arvot"]
["Wärmequelle","Wärmequelle","Heat source","Bron","source de chaleur","Lämmönlähde"]
["Anzahl | Typ Wärmepumpe","Anzahl | Typ Wärmepumpe","Quantity | Type heat pump","Aantal | Type warmtepomp","nombre | type de pompe à chaleur","Määrä | Lämpöpumpputyyppi"]
["Betriebsweise | Bivalenzpunkt","Betriebsweise | Bivalenzpunkt","Operation mode | Dual-mode point","Werkwijze | Bivalentiepunt","mode | bivalence","Käyttötapa | Rinnakkaiskäyttöpiste"]
["Vorlauftemperatur","Vorlauftemperatur","Flow temperature","Aanvoertemperatuur","température de départ","Virtauksen lämpötila"]
["Bivalenzpunkt","Bivalenzpunkt","Dual-mode point","Bivalentiepunt","point de bivalence","Rinnakkaiskäyttöpiste"]
["Temperaturspreizung Heizung","Temperaturspreizung Heizung","Temperature difference heating system","Temperatuurspreiding verwarming","écart de température chauffage","Lämmitysjärjestelmän lämpötilaero"]
["Heizgrenztemperatur","Heizgrenztemperatur","Heating treshold","Verwarmingsgrenstemperatuur","limite de chauffe","Lämmityskynnys"]
["Minimale Soleeintrittstemperatur","Minimale Soleeintrittstemperatur","Brine temperature","Minimale bronintrede temperatuur"," température minimale source","Liuoksen lämpötila"]
["Mittlere Quellentemperatur","Mittlere Quellentemperatur","Average source temperature","Gemiddelde brontemperatuur","température moyenne source","Lähdelämpötilan keskiarvo"]
["Norm-Außentemperatur Standort","Norm-Außentemperatur Standort","Outside temperature location","Standaard buitentemperatuur locatie","position température extérieure","Mitoitusulkolämpötila"]
["Leistungsaufnahme Solepumpe","Leistungsaufnahme Solepumpe","Elec. consumption source pump","Vermogensopname brinepomp","consommation pompe source","Liuospumpun sähkön kulutus"]
["Leistungsaufnahme Quellenpumpen","Leistungsaufnahme Quellenpumpen","Elec. consumption source pumps","Vermogensopname bronpompen","consommation pompes source","Liuospumppujen sähkön kulutus"]
["Leistungsaufnahme Quellenpumpe","Leistungsaufnahme Quellenpumpe","Elec. consumption source pump","Vermogensopname bronpomp","consommation pompe source","Liuospumpun sähkön kulutus"]
["Warmwasserbereitung","Warmwasserbereitung","Domestic hot water","Warm water bereiding","eau chaude sanitaire","Lämmin käyttövesi"]
["Warmwasser-Wärmepumpe","Warmwasser-Wärmepumpe","DHW heat pump","Warm water-Warmtepomp","ballon thermodynamique","Käyttövesilämpöpumppu"]
["Anteil Warmwasserbereitung","Anteil Warmwasserbereitung","DHW heating ratio","Aandeel warm water bereiding","proportion de l'eau chaude sanitaire","Käyttöveden lämmityssuhde"]
["Ergebnisse","Ergebnisse","Results","Resultaten","résultats","Tulokset"]
["Deckungsanteil Wärmepumpe","Deckungsanteil Wärmepumpe","Coverage of heat pump","Dekkingsaandeel warmtepomp","couverture PAC","Lämpöpumpun kattavuus"]
["Jahresarbeitszahl Heizung","Jahresarbeitszahl Heizung","Yearly COP Space heating","Jaarlijkse coëfficiënt verwarming","COP annuel chauffage","Lämmityksen vuotuinen COP"]
["Jahresarbeitszahl WWB","Jahresarbeitszahl WWB","Yearly COP DHW heating","Jaarlijkse coëfficiënt WWB","COP annuel sanitaire","Käyttöveden lämmityksen vuotuinen COP"]
["WWB","WWB","DHW","WWB","ECS","KV"]
["Gesamt-Jahresarbeitszahl","Gesamt-Jahresarbeitszahl","Total yearly COP","Totale jaarlijkse coëfficiënt","COP total annuel","Vuotuinen COP yhteensä"]
["Berechnung nach VDI 4650 | Teil 1 (März 2009). Irrtum und Technische Änderungen vorbehalten.","Berechnung nach VDI 4650 | Teil 1 (März 2009). Irrtum und Technische Änderungen vorbehalten."," ","Berekening volgens VDI 4650 | Deel 1 (maart 2009). Onder voorbehoud van technische wijzigingen.","Calcul selon la norme VDI 4650 | Partie 1 (Mars 2009). Sous réserve de modifications techniques."," "]
["Rechenwerte Heizungswärmepumpe","Rechenwerte Heizungswärmepumpe","Calculated values heat pump","Calculatiewaarde warmtepomp","Valeurs calculées PAC","Lämpöpumpun lasketut arvot"]
["Rechenwerte Heizung","Rechenwerte Heizung","Calculated values heating","Calculatiewaarde verwarming","Valeurs calculées chauffage","Lämmityksen lasketut arvot"]
["Temperaturdifferenz Prüfstand","Temperaturdifferenz Prüfstand","Temp. Diff. laboratory measurement","Temperatuurverschil-lab.meeting","Test de différence de température","Testattu lämpötilaero"]
["Leistungszahl","Leistungszahl","COP","COP","COP","COP"]
["Heizleistung","Heizleistung","Heating output","Verwarmingsvermogen","Capacité thermique","Lämmitysteho"]
["Leistungsaufnahme Verdichter","Leistungsaufnahme Verdichter","Power consumption compressor","Vermogensopname compressor","Puissance absorbée","Kompressorin energiankulutus"]
["Korrekturfaktor","Korrekturfaktor","Corection factor","Correctiefactor","Facteur de correction","Korjauskerroin"]
["Korrekturfaktor (Solepumpe)","Korrekturfaktor (Solepumpe)","Correction factor (Source pump)","Correctiefactor (brinepomp)","Facteur de correction (pompe source)","Korjauskerroin (Liuospumppu)"]
["Korrekturfaktor (Quellenpumpen)","Korrekturfaktor (Quellenpumpen)","Correction factor (Source pumps)","Correctiefactor (bronpompen)","Facteur de correction (pompes source)","Korjauskerroin (Liuospumput)"]
["Korrekturfaktor (Quellenpumpe)","Korrekturfaktor (Quellenpumpe)","Correction factor (Source pump)","Correctiefactor (bronpomp)","Facteur de correction (pompe source)","Korjauskerroin (Liuospumppu)"]
["Korrekturfaktor (Verdampfer)","Korrekturfaktor (Verdampfer)","Correction factor (evaporator)","Correctiefactor (verdamper)","Facteur de correction (évaporateur)","Korjauskerroin (Höyrystin)"]
["Korrekturfaktor (Verflüssiger)","Korrekturfaktor (Verflüssiger)","Correction factor (condenser)","Correctiefactor (condensor)","Facteur de correction (condensateur)","Korjauskerroin (Lauhdutin)"]
["Jahresarbeitszahl (Monovalent)","Jahresarbeitszahl (Monovalent)","Yearly COP (mono-mode)","Jaarlijkse COP (monovalent)","COP annuel monovalent","Vuotuinen COP (Monokäyttö)"]
["Rechenwerte Warmwasserbereitung","Rechenwerte Warmwasserbereitung","Calculated values domestic hot water","Calculatiewaarde  WW bereiding","Valeurs calculées sanitaire","Käyttöveden lasketut arvot"]
["Leistungszahl WW-Wärmepumpe","Leistungszahl WW-Wärmepumpe","COP DHW heat pump","Vermogen WW-warmtepomp","COP PAC sanitaire","Käyttövesilämpöpumpun COP"]
["WW-Temperatur Prüfstand","WW-Temperatur Prüfstand","DHW-temp. laboratory measurement","WW-temperatuur-lab.meeting","Sanitaire-température d'essai","Testattu käyttöveden lämpötila"]
["Korrekturfaktor (Prüfstand)","Korrekturfaktor (Prüfstand)","Correction factor (test stand)","Correctiefactor (lab.meeting)","Facteur de correction (banc d'essai)","Korjauskerroin (testattu)"]
["Korrekturfaktor (Wärmequelle WWB)","Korrekturfaktor (Wärmequelle WWB)","Correction factor (heat source DHW)","Correctiefactor (Bron WWB)","Facteur de correction (PAC sanitaire)","Korjauskerroin (käyttöveden lämmönlähde)"]
["Heizung","Heizung","Heating","Verwarming","Chauffage","Lämmitys"]
["Rechenwerte Warmwasser-Wärmepumpe","Rechenwerte Warmwasser-Wärmepumpe","Calculated values DHW-heat pump","Calculatiewaarde warm water warmtepomp","Valeurs calculées PAC sanitaire","Käyttövesilämpöpumpun lasketut arvot"]
["Berechnung läuft","Berechnung läuft","Calculating…","Calculatie loopt","Le calcul se fait…","Laskee…"]
["Außenluft","Außenluft","Air","Buitenlucht","Air","Ilma"]
["Erdreich","Erdreich","Brine","Brine","Sol","Liuos"]
["Grundwasser (Zwischen-WT)","Grundwasser (Zwischen-WT)","Water (heat exchanger)","Grondwater (Tussen-Wisselaar)","Eau (échangeur)","Vesi (lämmönvaihdin)"]
["Grundwasser","Grundwasser","Water","Grondwater","Eau","Vesi"]
["Wasser-Wasser-WP (Manuell)","Wasser-Wasser-WP (Manuell)","Manual input","Water-water warmtepomp (handmatig)","PAC eau/eau (manuel)","Käsisyöttö"]
["Luft-Wasser-WP (Manuell)","Luft-Wasser-WP (Manuell)","Manual input","Lucht-water warmtepomp (handmatig)","PAC air/eau (manuel)","Käsisyöttö"]
["Sole-Wasser-WP (Manuell)","Sole-Wasser-WP (Manuell)","Manual input","Brine-water warmtepomp (handmatig)","PAC eau glycolée/eau (manuel)","Käsisyöttö"]
["Warmwasser-WP (Manuell)","Warmwasser-WP (Manuell)","Manual input","Water-water warmtepomp (handmatig)","PAC eau/eau (manuel)","Käsisyöttö"]
["Monovalent","Monovalent","Mono-mode","Monovalent","mode monovalent","Monokäyttö (täysteho)"]
["Monoenergetisch","Monoenergetisch","Monoenergetic","Mono-energetisch","monoénergétiques","Monoenerginen (täystehoinen sähkötuella)"]
["Bivalent-Parallel","Bivalent-Parallel","Dual-mode-parallel","Bivalent-parallel","Bivalent - Parallèle","Rinnakkais-käyttö"]
["Bivalent-Alternativ","Bivalent-Alternativ","Dual-mode-alternative","Bivalent-alternatief","Bivalent - Alternatif","Rinnakkais-/vaihtoehtoiskäyttö"]
["Bivalent-Teilparallel","Bivalent-Teilparallel","Dual-mode-partially parallel","Bivalent-gedeeltelijk parallel","Bivalent -parallèle partiel","Osittainen rinnakkaiskäyttö"]
["Standard Sonde (2 °C)","Standard Sonde (2 °C)","Default probes (2 °C)","Standaard sonde (2 ° C)","Sonde standard (2 °C)","Oletusputket (2 °C)"]
["Standard Kollektor (0 °C)","Standard Kollektor (0 °C)","Default collector (0 °C)","Standaard collector (0 ° C)","Collecteur standard (0 °C)","Oletuskeräin (0 °C)"]
["Standardwert (10 °C)","Standardwert (10 °C)","Default value (10 °C)","Standaard waarde (10 ° C)","valeur par défaut (10 °C)","Oletusarvo (10 °C)"]
["Angabe wird nicht benötigt","Angabe wird nicht benötigt","Not required","Specificatie is niet vereist","Spécification pas nécessaire","Ei vaadittu"]
["Standard VDI 4650","Standard VDI 4650","Default VDI 4650","Standaard VDI 4650","Norme VDI 4650","Oletettu VDI 4650"]
["Eingabe [Watt]","Eingabe [Watt]","Input [Watt]","Ingave [Watt]","Entrée [Watts]","Ottoteho [Wattia]"]
["Mit Heizungs-Wärmepumpe","Mit Heizungs-Wärmepumpe","With heat pump for heating","Met warmtepomp voor verwarming","Avec PAC pour chauffage","Lämmitys lämpöpumpulla"]
["Warmwasser-Wärmepumpe","Warmwasser-Wärmepumpe","DHW heat pump","Warm water warmtepomp","Ballon thermodynamique","Käyttövesilämpöpumppu"]
["Sonstige Wärmeerzeuger","Sonstige Wärmeerzeuger","Other heating systems","Overige warmtebronnen","Autres sources de chaleur","Muut lämmitysjärjestelmät"]
["Keine Warmwasserbereitung","Keine Warmwasserbereitung","Without DHW","Geen warm water bereiding","Sans Sanitaire","Ilman käyttövettä"]
["Manuelle Eingabe","Manuelle Eingabe","Manual input","Handmatige invoer","saisie manuelle","Käsisyöttö"]
["Standardwert (18 %)","Standardwert (18 %)","Default value (18 %)","Standaard waarde (18%)","valeur par défaut (18%)","Oletusarvo (18%)"]
["Eingabe in %","Eingabe in %","Manual input in %","Ingave in %","Entrée en%","Käsisyöttö prosentuaalisesti"]
["Rechenwerte","Rechenwerte","Calculation","Calculatie waarde tonen","Montrer les valeurs calculées","Näytä lasketut arvot"]
["Drucken","Drucken","Printout","Resultaten printen","Imprimer les résultats","Tulosta tulokset"]
["Manuelle Eingabe","Manuelle Eingabe","Manual input","Handmatige invoer","Saisie manuelle","Käsisyöttö"]
["Luft-Wasser-Wärmepumpe","Luft-Wasser-Wärmepumpe","Air-water heat pump","Lucht-water warmtepomp","Pompe à chaleur air/eau","Ilma-vesilämpöpumppu"]
["Sole-Wasser-Wärmepumpe","Sole-Wasser-Wärmepumpe","Brine-water heat pump","Brine-water-warmtepomp","Pompe à chaleur eau glycolée/eau","Maalämpöpumppu"]
["Wasser-Wasser-Wärmepumpe","Wasser-Wasser-Wärmepumpe","Water-water heat pump","Water-water warmtepomp","Pompe à chaleur eau/eau","Vesi | Vesilämpöpumppu"]
["Leistungszahl Aufheizung von 15°C auf 50°C","Leistungszahl Aufheizung von 15°C auf 50°C","COP Heating up 15°C to 50°C","Verwarmingscoëfficiënt bij verwarmen van 15 ° C tot 50 ° C.","Coefficient de performance de chauffage de 15 °C à 50 °C","COP (15 °C:n lämmitys 50 °C:een)"]
["Wärmepumpen-Typ","Wärmepumpen-Typ","Type heat pump","Warmtepomp type","Type de pompe à chaleur","Lämpöpumpputyyppi"]
["Zurück zum Hauptfenster","Zurück zum Hauptfenster","Back to main window","Terug naar het hoofdvenster","Retour à la fenêtre principale","Takaisin päävalikkoon"]
["Bivalenzpunkt","Bivalenzpunkt","Dual-mode point","Bivalentiepunt","Point de bivalence","Rinnakkaiskäyttöpiste"]
["Norm-Heizlast Gebäude [KW]","Norm-Heizlast Gebäude [KW]","Heating capacity building [KW]","Norm-warmteverlies gebouw [KW] ","charge thermique du bâtiment [kW]","Rakennuksen lämmitystehontarve [kW]"]
["Kennlinie","Kennlinie","Characteristic","Kenmerk","caractéristique","Ominaisuudet"]
["Vorlauf","Vorlauf","Forward flow","Aanvoer","retour  ","Menovirtaus"]
["Soletemperatur","Soletemperatur","source temperature","Brine temperatuur","température de la source SOL","lähdelämpötila"]
["Grundwassertemperatur","Grundwassertemperatur","source temperature","Grondwater temperatuur","température de la source EAU","lähdelämpötila"]
["Vorlauftemperatur","Vorlauftemperatur","Forward flow","Aanvoertemperatuur.","TEMPÉRATURE DE DÉPART","MENOVIRTAUSLÄMPÖTILA"]
["Raumsolltemperatur in °C","Raumsolltemperatur in °C","Inside temperature [°C]","Gewenste ruimtetemperatuur in ° C","Température ambiante en °C","Sisälämpötila [°C]"]
["Steigung Heizkurve","Steigung Heizkurve","Gradient heating curve","Helling van de stooklijn","Graduation de la courbe de chauffage","Lämpökäyrän kaltevuus"]
["Bivalenzpunkt (Gewählt)","Bivalenzpunkt (Gewählt)","Dual-mode point (chosen)","Bivalentiepunt (gekozen)","Bivalence (choisie)","Rinnakkaiskäyttöpiste (valittu)"]
["Temperaturspreizung (Gewählt)","Temperaturspreizung (Gewählt)","Temperature spread (chosen)","Temperatuurspreiding (gekozen)","La différence de température (choisie)","Lämpötilaero (valittu)"]
["Rücklauftemperatur (Bivalenzpunkt)","Rücklauftemperatur (Bivalenzpunkt)","Return flow temp. (Dual-mode point)","Retourtemperatuur (bivalentiepunt)","Température de retour (bivalence)","Paluuvirtauksen lämpötila (rinn.pisteessä)"]
["Vorlauftemperatur (Bivalenzpunkt)","Vorlauftemperatur (Bivalenzpunkt)","Forward flow temp. (Dual-mode point)","Aanvoertemperatuur (bivalentiepunt)","Température de départ (bivalence)","Menovirtauksen lämpötila (rinn.pisteessä)"]
["Standardwert","Standardwert","Default value","Standaard waarde","Par défaut","Oletusarvo"]
["Standard FB-Heizung (0,3)","Standard FB-Heizung (0,3)","Default underfloor (0,3)","Standaard vloerverwarming (0,3)","Standard Chauffage sol (0,3)","Oletusarvo lattialämmitys (0,3)"]
["Standard Radiatoren (0,8)","Standard Radiatoren (0,8)","Default radiator (0,8)","Standaard Radiatoren (0,8)","Standard Radiateurs (0,8)","Oletusarvo patterilämmitys (0,8)"]
["Heizkurve Vorlauf (Spreizung bei -20°C:","Heizkurve Vorlauf (Spreizung bei -20°C:","Heating curve forward flow (temperature spread at -20°C:","Stooklijn aanvoer (spreiding bij -20 ° C:","Courbe de chauffe départ (écart de température à -20 °C:","Lämmityskäyrä, menovirtaus (lämpötilaero 20 °C:ssa"]
["Heizkurve Rücklauf (Raumtemperatur:","Heizkurve Rücklauf (Raumtemperatur:","Heating curve return flow (Inside temperature:","Stooklijn retour (kamertemperatuur:","courbe de chauffage retour (température ambiante:","Lämmityskäyrä, paluuvesi (sisälämpötila:"]
["Steigung","Steigung","Gradient","Helling","Pente","Kaltevuus"]
["Solepumpe","Solepumpe","Brine circulation pump","Brine circulatiepomp","Pompe de circulation source SOL","Liuospumppu"]
["Volumenstrom (soleseitig)","Volumenstrom (soleseitig)","Volume flow (brine side)","Volumestroom (bronzijdig)","Débit (côté source SOL)","Tilavuusvirta (keruuliuos)"]
["Auswahl Solepumpe","Auswahl Solepumpe","Selection circulation pump","Selectie bronpomp","Sélection de la pompe source SOL","Liuospumpun valinta"]
["Mittlere Leistungsaufnahme","Mittlere Leistungsaufnahme","Average power consumption","Gemiddeld opgenomen vermogen","consommation électrique moyenne","Keskimääräinen sähkön kulutus"]
["Empfehlung Solepumpe","Empfehlung Solepumpe","Recommendation pump","Aanbeveling bronpomp","Recommandation pompe Source SOL","Suositeltava liuospumppu"]
["Werte übernehmen","Werte übernehmen","Accept values","Waarde overnemen","Accepter les valeurs","Hyväksy arvot"]
["integriert","integriert","integrated","geïntegreerd","intégrés","integroitu"]
["Solepumpe nicht einsetzbar","Solepumpe nicht einsetzbar","Brine circulation pump not applicable","Bronpomp niet toepasbaar","Pompe source SOL pas d'application","Liuospumppua ei valittavissa"]
["ca.","ca.","about","Ongeveer","environ","noin"]
[]
[]
[]
[]
[]
[]
[]
[]
[]
[]
[]
[]
[]
[]
[]
[]
[]
[]
[]
[]
[]
[]
[]
[]
[]
[]
[]
["AUSLEGUNG WÄRMEPUMPE.","AUSLEGUNG WÄRMEPUMPE.","LAYOUT HEAT PUMP."]
["JAHRESHEIZARBEIT","JAHRESHEIZARBEIT","ANNUAL HEATING POWER"]
["LAUFZEITEN","LAUFZEITEN","RUNNING HOURS"]
["HÄUFIGKEIT AUSSENTEMPERATUR","HÄUFIGKEIT AUSSENTEMPERATUR","OUTSIDE TEMPERATURE"]
["NACH HEIZLAST | BIVALENZPUNKT","NACH HEIZLAST | BIVALENZPUNKT","HEAT DEMAND | DUAL MODE POINT"]
["Wärmequelle","Wärmequelle","Heat source"]
["Wärmepumpen-Typ","Wärmepumpen-Typ","Type Heat pump"]
["Standort | Außentemperatur","Standort | Außentemperatur","Location | Outside temperature"]
["* Nicht zur Dimensionierung der Wärmequelle ansetzbar","* Nicht zur Dimensionierung der Wärmequelle ansetzbar","* Not suitable for heat-source dimensioning"]
["Heizgrenze | Gebäudeart","Heizgrenze | Gebäudeart","Heating treshold | Building type"]
["EVU-Sperrzeiten","EVU-Sperrzeiten","Switch off time"]
["Vorlauf-Temperatur","Vorlauf-Temperatur","Forward flow temperature"]
["Betriebsweise","Betriebsweise","Operating mode"]
["Betriebsweise | Bivalenzpunkt","Betriebsweise | Bivalenzpunkt","Operation mode | Dual-mode point"]
["Norm-Heizlast Gebäude [KW]","Norm-Heizlast Gebäude [KW]","Heating capacity [KW]"]
["Jahresheizperiode (h/a)","Jahresheizperiode (h/a)","Heating season [h/a]"]
["Heizarbeit Wärmepumpe*","Heizarbeit Wärmepumpe*","Heating power heat pump*"]
["Bivalenzpunkt Wärmepumpe","Bivalenzpunkt Wärmepumpe","Dual-mode point"]
["Laufzeit Wärmepumpe*","Laufzeit Wärmepumpe*","Running time heat pump*"]
["Maximale Gebäudeheizlast","Maximale Gebäudeheizlast","Max. Heat demand building"]
["Bivalenzpunkt der Wärmepumpe ermitteln","Bivalenzpunkt der Wärmepumpe ermitteln","Determine dual-mode point of heat pump"]
["Maximale Gebäudeheizlast ermitteln","Maximale Gebäudeheizlast ermitteln","Determine max. heat demand building"]
["Jahresheizarbeit der Wärmepumpe ermitteln","Jahresheizarbeit der Wärmepumpe ermitteln","Determine annual heating power heat pump"]
["Laufzeiten der Wärmepumpe ermitteln","Laufzeiten der Wärmepumpe ermitteln","Determine running hours of heat pump"]
["Temperaturverlauf des Standortes anzeigen","Temperaturverlauf des Standortes anzeigen","Show climate data of chosen location"]
["Standort Wärmepumpe | Gebäude festlegen","Standort Wärmepumpe | Gebäude festlegen","Choose location of building/heat pump"]
["Bivalente Anlage (mit Öl- oder Gaskessel)","Bivalente Anlage (mit Öl- oder Gaskessel)","Bivalent system (with oil/gas)"]
["Mehrere Wärmepumpen (Kaskade)","Mehrere Wärmepumpen (Kaskade)","Several heat pumps (cascade)"]
["Außenluft","Außenluft","Air"]
["Erdreich","Erdreich","Brine"]
["Grundwasser","Grundwasser","Water"]
["12 °C | Neubau EnEV 2009","12 °C | Neubau EnEV 2009","12 °C | New building"]
["12 °C | Altbau EnEV 2009","12 °C | Altbau EnEV 2009","12 °C | Renovated old building"]
["15 °C | Altbau unsaniert","15 °C | Altbau unsaniert","15 °C | Not-renovated building"]
["10 °C | Passivhaus","10 °C | Passivhaus","10 °C | Passive house"]
["10 °C | KfW-Effizienzhaus 40","10 °C | KfW-Effizienzhaus 40","-"]
["10 °C | KfW-Effizienzhaus 55","10 °C | KfW-Effizienzhaus 55","-"]
["10 °C | KfW-Effizienzhaus 70","10 °C | KfW-Effizienzhaus 70","-"]
["12 °C | KfW-Effizienzhaus 85","12 °C | KfW-Effizienzhaus 85","-"]
["12 °C | KfW-Effizienzhaus 100","12 °C | KfW-Effizienzhaus 100","-"]
["12 °C | KfW-Effizienzhaus 115","12 °C | KfW-Effizienzhaus 115","-"]
["12 °C | Minergie Haus","12 °C | Minergie Haus","-"]
["10 °C | Minergie-P Haus","10 °C | Minergie-P Haus","-"]
["Platzhalter für weitere Haustypen","Platzhalter für weitere Haustypen","-"]
["Platzhalter für weitere Haustypen","Platzhalter für weitere Haustypen","-"]
["Platzhalter für weitere Haustypen","Platzhalter für weitere Haustypen","-"]
["Platzhalter für weitere Haustypen","Platzhalter für weitere Haustypen","-"]
["Platzhalter für weitere Haustypen","Platzhalter für weitere Haustypen","-"]
["Platzhalter für weitere Haustypen","Platzhalter für weitere Haustypen","-"]
["Platzhalter für weitere Haustypen","Platzhalter für weitere Haustypen","-"]
["Platzhalter für weitere Haustypen","Platzhalter für weitere Haustypen","-"]
["Platzhalter für weitere Haustypen","Platzhalter für weitere Haustypen","-"]
["Platzhalter für weitere Haustypen","Platzhalter für weitere Haustypen","-"]
["Platzhalter für weitere Haustypen","Platzhalter für weitere Haustypen","-"]
["Platzhalter für weitere Haustypen","Platzhalter für weitere Haustypen","-"]
["Platzhalter für weitere Haustypen","Platzhalter für weitere Haustypen","-"]
["Keine Sperrzeiten","Keine Sperrzeiten","No switch off times"]
["1 x 1 h/Tag","1 x 1 h/Tag","1 x 1 h/day"]
["1 x 2 h/Tag","1 x 2 h/Tag","1 x 2 h/day"]
["2 x 2 h/Tag","2 x 2 h/Tag","2 x 2 h/day"]
["3 x 1 h/Tag","3 x 1 h/Tag","3 x 1 h/day"]
["3 x 2 h/Tag","3 x 2 h/Tag","3 x 2 h/day"]
["Platzhalter für weitere Sperrzeiten","Platzhalter für weitere Sperrzeiten","-"]
["Platzhalter für weitere Sperrzeiten","Platzhalter für weitere Sperrzeiten","-"]
["Platzhalter für weitere Sperrzeiten","Platzhalter für weitere Sperrzeiten","-"]
["Platzhalter für weitere Sperrzeiten","Platzhalter für weitere Sperrzeiten","-"]
["Platzhalter für weitere Sperrzeiten","Platzhalter für weitere Sperrzeiten","-"]
["Platzhalter für weitere Sperrzeiten","Platzhalter für weitere Sperrzeiten","-"]
["Platzhalter für weitere Sperrzeiten","Platzhalter für weitere Sperrzeiten","-"]
["Platzhalter für weitere Sperrzeiten","Platzhalter für weitere Sperrzeiten","-"]
["Platzhalter für weitere Sperrzeiten","Platzhalter für weitere Sperrzeiten","-"]
["Platzhalter für weitere Sperrzeiten","Platzhalter für weitere Sperrzeiten","-"]
["Platzhalter für weitere Sperrzeiten","Platzhalter für weitere Sperrzeiten","-"]
["Platzhalter für weitere Sperrzeiten","Platzhalter für weitere Sperrzeiten","-"]
["Platzhalter für weitere Sperrzeiten","Platzhalter für weitere Sperrzeiten","-"]
["Monovalent","Monovalent","Monovalent"]
["Monoenergetisch","Monoenergetisch","Monoenergetic"]
["Bivalent-Parallel","Bivalent-Parallel","Bivalent-parallel"]
["Deutschland","Deutschland","Germany"]
["Österreich","Österreich","Austria"]
["Schweiz","Schweiz","Switzerland"]
["Großbritannien","Großbritannien","Great Britain"]
["Finnland","Finnland","Finland"]
["Europa","Europa","Europe"]
["Manuelle Eingabe Norm-Außentemperatur","Manuelle Eingabe Norm-Außentemperatur","Manual input design temperature"]
["Für einen wirtschaftlichen Betrieb sollte ein Bivalenzpunkt zwischen -3°C und -7°C gewählt werden.","Für einen wirtschaftlichen Betrieb sollte ein Bivalenzpunkt zwischen -3°C und -7°C gewählt werden.","For economical reasons the dual-mode point should be between -3°C and -7°C."]
["Für einen wirtschaftlichen Betrieb sollte die Sole-Wasser-Wärmepumpe monovalent betrieben werden.","Für einen wirtschaftlichen Betrieb sollte die Sole-Wasser-Wärmepumpe monovalent betrieben werden.","For economical reasons brine/water heat pumps should run in monovalent mode."]
["Für einen wirtschaftlichen Betrieb sollte die Wasser-Wasser-Wärmepumpe monovalent betrieben werden.","Für einen wirtschaftlichen Betrieb sollte die Wasser-Wasser-Wärmepumpe monovalent betrieben werden.","For economical reasons water/water heat pumps should run in monovalent mode."]
[" KW Elektrozusatzheizung"," KW Elektrozusatzheizung"," KW electric heating support"]
["Die maximale Heizleistung der ","Die maximale Heizleistung der ","Maximum heat load of "]
[" bei "," bei "," at "]
[" °C Außentemperatur beträgt inklusive "," °C Außentemperatur beträgt inklusive "," °C outside temperature is including "]
[" KW elektrischer Zusatzheizung "," KW elektrischer Zusatzheizung "," KW electric heating suppport "]
[" KW. Größere Heizlasten können von der gewählten Wärmepumpe im monoenergetischen Betrieb nicht abgedeckt werden."," KW. Größere Heizlasten können von der gewählten Wärmepumpe im monoenergetischen Betrieb nicht abgedeckt werden."," KW. In monoenergetic mode the heat pump can only cover this heat demand."]
[" beträgt bei "," beträgt bei "," is at "]
["°C Außentemperatur ","°C Außentemperatur ","°C outside temperature "]
[" KW. Größere Heizlasten können von der gewählten Wärmepumpe im monovalenten Betrieb nicht abgedeckt werden, d.h. ein zweiter Wärmeerzeuger ist einzusetzen (Bivalente Betriebsweise)"," KW. Größere Heizlasten können von der gewählten Wärmepumpe im monovalenten Betrieb nicht abgedeckt werden, d.h. ein zweiter Wärmeerzeuger ist einzusetzen (Bivalente Betriebsweise)"," KW. The chosen heat pump can not cover a higher heat demand in mono mode. A second heat source is needed (bivalent mode)."]
["Monovalente Betriebsweise","Monovalente Betriebsweise","Mono mode"]
["Bivalenzpunkt: ","Bivalenzpunkt: ","Dual-mode point: "]
[" KW (Max WP+DHC)"," KW (Max WP+DHC)"," KW (max. HP + DHC)"]
["Heizleistung ","Heizleistung ","Heating capacity "]
[" Vorlauf"," Vorlauf"," flow temperature"]
[" | 0°C Sole)"," | 0°C Sole)"," | 0°C brine)"]
[" | 10°C Wasser | 7°C Sole)"," | 10°C Wasser | 7°C Sole)"," | 10°C water | 7°C brine)"]
["Kennlinie maximale Heizlast","Kennlinie maximale Heizlast","Heat demand building"]
["Kennlinie Norm-Heizlast","Kennlinie Norm-Heizlast","Heat demand building"]
["Heizlast mit Sperrzeitenfaktor ","Heizlast mit Sperrzeitenfaktor ","Heat demand with switch off time factor "]
["Klimadaten Meteonorm 6.1 (gemittelt 1996-2005)","Klimadaten Meteonorm 6.1 (gemittelt 1996-2005)","Climate data Meteonorm 6.1 (Average 1996-2005)"]
["0°C Soletemperatur","0°C Soletemperatur","0°C brine temperature"]
["10°C Grundwassertemperatur","10°C Grundwassertemperatur","10°C temperature"]
["Detaillierte Ergebnisse Jahresheizarbeit anzeigen","Detaillierte Ergebnisse Jahresheizarbeit anzeigen","Show detailed results annual heating power"]
["Bivalent-Parallele Betriebsweise","Bivalent-Parallele Betriebsweise","Bivalent-parallel mode"]
["Bivalent-Alternative Betriebsweise","Bivalent-Alternative Betriebsweise","Bivalent-alternative mode"]
["Bivalent-Teilparallele Betriebsweise","Bivalent-Teilparallele Betriebsweise","Bivalent-part priority mode"]
["Abschaltung WP: ","Abschaltung WP: ","Switch off point: "]
["Heizarbeit 2. Wärmeerzeuger","Heizarbeit 2. Wärmeerzeuger","Heating power 2. heat source"]
["Heizarbeit Wärmepumpe","Heizarbeit Wärmepumpe","Heating power Heat pump"]
["* Für die Bestimmung der Heizarbeit werden Heizlast (ohne Sperrzeitenzuschlag), Wärmepumpen-Leistung ","* Für die Bestimmung der Heizarbeit werden Heizlast (ohne Sperrzeitenzuschlag), Wärmepumpen-Leistung ","*The determination of the heating power is a calculation of heat demand (without switch off times),"]
["   und Jahresstunden für jede Außentemperatur in Ansatz gebracht. Interne & solare Wärmegewinne,","   und Jahresstunden für jede Außentemperatur in Ansatz gebracht. Interne & solare Wärmegewinne,"," heat pump capacity and annual hours for each outside temperature. Internal & solar gains,"]
["   Absenk- und Sperrzeiten sowie die Warmwasserbereitung sind nicht berücksichtigt.","   Absenk- und Sperrzeiten sowie die Warmwasserbereitung sind nicht berücksichtigt."," set-back periods, switch-off times and domestic hot water are not considered."]
["Stunden pro Jahr bei Außentemperatur","Stunden pro Jahr bei Außentemperatur","Yearly hours with temperature"]
["Summe Stunden pro Jahr mit Temperaturen < Außentemperatur","Summe Stunden pro Jahr mit Temperaturen < Außentemperatur","Sum of yearly hours with temperatures < outside temperature"]
[" (Wetterstation: "," (Wetterstation: "," (Weather station: "]
["Summe Laufzeit Wärmepumpe","Summe Laufzeit Wärmepumpe","Sum running hours heat pump"]
["Summe Laufzeit 2. Wärmeerzeuger","Summe Laufzeit 2. Wärmeerzeuger","Sum running hours 2. heat source"]
["Bitte nur Zahlenwerte eingeben.","Bitte nur Zahlenwerte eingeben.","Please insert numerical values only"]
[]
["Geben Sie hier den Ortsnamen ein","Geben Sie hier den Ortsnamen ein","Please insert name of location"]
["Außentemperatur","Außentemperatur","Air temperature"]
["Heizlast","Heizlast","Heat demand"]
["Heizleistung WP","Heizleistung WP","Heat capacity HP"]
["Jahresstunden","Jahresstunden","Yearly hours"]
["Heizwärmebedarf","Heizwärmebedarf","Annual heat demand"]
["Heizarbeit WP","Heizarbeit WP","Heating power HP"]
["Heizarbeit 2. WE","Heizarbeit 2. WE","Heating power 2. HS"]
["Standortauswahl","Standortauswahl","Choose location"]
["LUFT | WASSER WÄRMEPUMPE","LUFT | WASSER WÄRMEPUMPE","AIR | WATER HEAT PUMP"]
["SOLE | WASSER WÄRMEPUMPE","SOLE | WASSER WÄRMEPUMPE","BRINE | WATER HEAT PUMP"]
["WASSER | WASSER WÄRMEPUMPE","WASSER | WASSER WÄRMEPUMPE","WATER | WATER HEAT PUMP"]
["Heizgrenztemperatur","Heizgrenztemperatur","Heating treshold"]
["Gebäude-Heizlast","Gebäude-Heizlast","Heat demand building"]
["Bivalenzpunkt","Bivalenzpunkt","Bivalent point"]
["Bivalent-Alternativ","Bivalent-Alternativ","Bivalent-alternativ"]
["Bivalent-Teilparallel","Bivalent-Teilparallel","Bivalent-part priority mode"]
["Heizarbeit 2. Wärmeerzeuger*","Heizarbeit 2. Wärmeerzeuger*","Heating power 2. heat source*"]
["Deckungsanteil Wärmepumpe","Deckungsanteil Wärmepumpe","Covering ratio heat pump"]
["Laufzeit 2. Wärmeerzeuger","Laufzeit 2. Wärmeerzeuger","Running time 2. heat source"]
["Jahresanteil Heizperiode","Jahresanteil Heizperiode","Ratio heating season"]
["Max. Heizleistung (WP+DHC)","Max. Heizleistung (WP+DHC)","Max. heating capacity (HP+DHC)"]
["Vollbenutzungsstunden anzeigen","Vollbenutzungsstunden anzeigen","Show seasonal heating hours"]
["Vollbenutzungsstunden","Vollbenutzungsstunden","Seasonal heating hours"]
["Heiztage pro Jahr","Heiztage pro Jahr","Annual heating days"]
["Nach IWU - Institut für Wohnen und Umwelt, langjähriges Mittel 1970-2009","Nach IWU - Institut für Wohnen und Umwelt, langjähriges Mittel 1970-2009",{"$f":"\"\"","v":""}]
["Israel","Israel","Israel"]
[]
[]
[]
[]
[]
[]
[]
[]
[]
[]
[]
[]
[]
[]
[]
[]
[]
[]
[]
[]
[]
[]
[]
[]
[]
[]
[]
[]
[]
[]
[]
[]
[]
[]
[]
[]
[]
[]
[]
[]
[]
[]
[]
[]
[]
[]
[]
[]
[]
[]
[]
[]
[]
[]
[]
[]
[]
[]
[]
[]
[]
[]
[]
[]
[]
[]
[]
[]
[]
[]
[]
[]
[]
[]
[]
[]
[]
[]
[]
[]
[]
[]
[]
[]
[]
[]
[]
[]
[]
[]
[]
[]
[]
[]
[]
[]
[]
[]
[]
[]
[]
[]
[]
[]
[]
[]
[]
[]
[]
[]
[]
[]
[]
[]
[]
[]
[]
[]
[]
[]
[]
[]
[]
[]
[]
[]
[]
[]
[]
[]
[]
[]
[]
[]
[]
[]
[]
[]
[]
[]
[]
[]
[]
[]
[]
[]
[]
[]
[]
[]
[]
[]
[]
[]
[]
[]
[]
[]
[]
[]
[]
[]
[]
[]
[]
[]
[]
[]
[]
[]
[]
[]
[]
[]
[]
[]
[]
[]
[]
[]
[]
[]
[]
[]
[]
[]
[]
[]
[]
[]
[]
[]
[]
[]
[]
[]
[]
[]
[]
[]
[]
[]
[]
[]
[]
[]
[]
[]
[]
[]
[]
[]
[]
[]
[]
[]
[]
[]
[]
[]
[]
[]
[]
[]
[]
[]
[]
[]
[]
[]
[]
[]
[]
[]
[]
[]
[]
[]
[]
[]
[]
[]
[]
[]
[]
[]
[]
[]
[]
[]
[]
[]
[]
[]
[]
[]
[null,null,"Eng"]
[null,null,"Eng"]